<?xml version="1.0" encoding="utf-8"?>
<!-- Generator: Adobe Illustrator 23.0.3, SVG Export Plug-In . SVG Version: 6.00 Build 0)  -->
<svg version="1.1" id="Layer_1" xmlns="http://www.w3.org/2000/svg" xmlns:xlink="http://www.w3.org/1999/xlink" x="0px" y="0px"
	 viewBox="0 0 1984.25 1417.32" style="enable-background:new 0 0 1984.25 1417.32;" xml:space="preserve">
<style type="text/css">
	.st0{fill:#FFFFFF;stroke:#000000;stroke-miterlimit:10;}
	.st1{fill:none;stroke:#000000;stroke-miterlimit:10;}
</style>
<line class="st0" x1="1984.25" y1="283.46" x2="0" y2="283.46"/>
<line class="st1" x1="510.24" y1="283.46" x2="510.24" y2="170.08"/>
<line class="st1" x1="1927.56" y1="0" x2="1927.56" y2="113.39"/>
<circle class="st1" cx="850.39" cy="141.73" r="56.69"/>
</svg>
