<?xml version="1.0" encoding="UTF-8" standalone="no"?>
<svg
   xmlns:osb="http://www.openswatchbook.org/uri/2009/osb"
   xmlns:dc="http://purl.org/dc/elements/1.1/"
   xmlns:cc="http://creativecommons.org/ns#"
   xmlns:rdf="http://www.w3.org/1999/02/22-rdf-syntax-ns#"
   xmlns:svg="http://www.w3.org/2000/svg"
   xmlns="http://www.w3.org/2000/svg"
   xmlns:sodipodi="http://sodipodi.sourceforge.net/DTD/sodipodi-0.dtd"
   xmlns:inkscape="http://www.inkscape.org/namespaces/inkscape"
   width="297mm"
   height="210mm"
   viewBox="0 0 297 210"
   version="1.1"
   id="svg8"
   sodipodi:docname="Reduit_couleurs_calib.svg"
   inkscape:version="1.0.2 (e86c870879, 2021-01-15)">
  <defs
     id="defs2">
    <linearGradient
       id="linearGradient3523"
       osb:paint="solid">
      <stop
         style="stop-color:#ff9955;stop-opacity:1;"
         offset="0"
         id="stop3521" />
    </linearGradient>
    <rect
       x="14.741071"
       y="12.85119"
       width="179.91667"
       height="30.994047"
       id="rect1404" />
  </defs>
  <sodipodi:namedview
     id="base"
     pagecolor="#ffffff"
     bordercolor="#666666"
     borderopacity="1.0"
     inkscape:pageopacity="0.0"
     inkscape:pageshadow="2"
     inkscape:zoom="0.98994949"
     inkscape:cx="445.42448"
     inkscape:cy="290.00962"
     inkscape:document-units="mm"
     inkscape:current-layer="g1598-8-9"
     inkscape:document-rotation="0"
     showgrid="false"
     inkscape:window-width="1920"
     inkscape:window-height="1017"
     inkscape:window-x="-8"
     inkscape:window-y="-8"
     inkscape:window-maximized="1" />
  <metadata
     id="metadata5">
    <rdf:RDF>
      <cc:Work
         rdf:about="">
        <dc:format>image/svg+xml</dc:format>
        <dc:type
           rdf:resource="http://purl.org/dc/dcmitype/StillImage" />
        <dc:title></dc:title>
      </cc:Work>
    </rdf:RDF>
  </metadata>
  <g
     inkscape:label="Calque 1"
     inkscape:groupmode="layer"
     id="layer1">
    <text
       xml:space="preserve"
       id="text1402"
       style="font-style:normal;font-weight:normal;font-size:10.5833px;line-height:1.25;font-family:sans-serif;white-space:pre;shape-inside:url(#rect1404);fill:#000000;fill-opacity:1;stroke:none;" />
    <text
       xml:space="preserve"
       style="font-style:normal;font-weight:normal;font-size:6.35px;line-height:1.25;font-family:sans-serif;fill:#000000;fill-opacity:1;stroke:#008080;stroke-width:0.264583"
       x="61.211796"
       y="140.49699"
       id="text1410"><tspan
         sodipodi:role="line"
         id="tspan1408"
         x="61.211796"
         y="140.49699"
         style="font-size:6.35px;stroke:#008080;stroke-width:0.264583">Calibration : Kristine-Doriane-Théo-Ellias</tspan></text>
    <text
       xml:space="preserve"
       style="font-style:normal;font-weight:normal;font-size:10.5833px;line-height:1.25;font-family:sans-serif;fill:#000000;fill-opacity:1;stroke:none;stroke-width:0.264583"
       x="6.3328319"
       y="83.824585"
       id="text1414-0"><tspan
         sodipodi:role="line"
         id="tspan1412-7"
         x="6.3328319"
         y="83.824585"
         style="font-style:normal;font-variant:normal;font-weight:normal;font-stretch:normal;font-family:'Bell MT';-inkscape-font-specification:'Bell MT';stroke-width:0.264583">Power %</tspan></text>
    <g
       id="g1492"
       transform="translate(32.883928,7.0708409)">
      <text
         xml:space="preserve"
         style="font-style:normal;font-weight:normal;font-size:10.5833px;line-height:1.25;font-family:sans-serif;fill:#000000;fill-opacity:1;stroke:none;stroke-width:0.264583"
         x="14.803215"
         y="40.397598"
         id="text1446"><tspan
           sodipodi:role="line"
           id="tspan1444"
           x="14.803215"
           y="40.397598"
           style="stroke-width:0.264583">10</tspan></text>
      <text
         xml:space="preserve"
         style="font-style:normal;font-weight:normal;font-size:10.5833px;line-height:1.25;font-family:sans-serif;fill:#000000;fill-opacity:1;stroke:none;stroke-width:0.264583"
         x="14.803215"
         y="59.185444"
         id="text1450"><tspan
           sodipodi:role="line"
           id="tspan1448"
           x="14.803215"
           y="59.185444"
           style="stroke-width:0.264583">20</tspan></text>
      <text
         xml:space="preserve"
         style="font-style:normal;font-weight:normal;font-size:10.5833px;line-height:1.25;font-family:sans-serif;fill:#000000;fill-opacity:1;stroke:none;stroke-width:0.264583"
         x="14.803215"
         y="77.166313"
         id="text1454"><tspan
           sodipodi:role="line"
           id="tspan1452"
           x="14.803215"
           y="77.166313"
           style="stroke-width:0.264583">30</tspan></text>
      <text
         xml:space="preserve"
         style="font-style:normal;font-weight:normal;font-size:10.5833px;line-height:1.25;font-family:sans-serif;fill:#000000;fill-opacity:1;stroke:none;stroke-width:0.264583"
         x="14.803215"
         y="95.142014"
         id="text1458"><tspan
           sodipodi:role="line"
           id="tspan1456"
           x="14.803215"
           y="95.142014"
           style="stroke-width:0.264583">40</tspan></text>
      <text
         xml:space="preserve"
         style="font-style:normal;font-weight:normal;font-size:10.5833px;line-height:1.25;font-family:sans-serif;fill:#000000;fill-opacity:1;stroke:none;stroke-width:0.264583"
         x="14.854892"
         y="112.96786"
         id="text1462"><tspan
           sodipodi:role="line"
           id="tspan1460"
           x="14.854892"
           y="112.96786"
           style="stroke-width:0.264583">55</tspan></text>
    </g>
    <g
       id="g1492-4"
       transform="translate(58.292527,11.196249)">
      <text
         xml:space="preserve"
         style="font-style:normal;font-weight:normal;font-size:10.5833px;line-height:1.25;font-family:sans-serif;fill:#000000;fill-opacity:1;stroke:none;stroke-width:0.264583"
         x="9.6005325"
         y="20.338404"
         id="text1454-8"><tspan
           sodipodi:role="line"
           id="tspan1452-3"
           x="9.6005325"
           y="20.338404"
           style="stroke-width:0.264583">30</tspan></text>
      <text
         xml:space="preserve"
         style="font-style:normal;font-weight:normal;font-size:10.5833px;line-height:1.25;font-family:sans-serif;fill:#000000;fill-opacity:1;stroke:none;stroke-width:0.264583"
         x="34.938282"
         y="20.338404"
         id="text1458-4"><tspan
           sodipodi:role="line"
           id="tspan1456-2"
           x="34.938282"
           y="20.338404"
           style="stroke-width:0.264583">40</tspan></text>
      <text
         xml:space="preserve"
         style="font-style:normal;font-weight:normal;font-size:10.5833px;line-height:1.25;font-family:sans-serif;fill:#000000;fill-opacity:1;stroke:none;stroke-width:0.264583"
         x="59.785095"
         y="20.338404"
         id="text1462-6"><tspan
           sodipodi:role="line"
           id="tspan1460-8"
           x="59.785095"
           y="20.338404"
           style="stroke-width:0.264583">55</tspan></text>
      <text
         xml:space="preserve"
         style="font-style:normal;font-weight:normal;font-size:10.5833px;line-height:1.25;font-family:sans-serif;fill:#000000;fill-opacity:1;stroke:none;stroke-width:0.264583"
         x="84.949715"
         y="20.338404"
         id="text1466-7"><tspan
           sodipodi:role="line"
           id="tspan1464-4"
           x="84.949715"
           y="20.338404"
           style="stroke-width:0.264583">70</tspan></text>
      <text
         xml:space="preserve"
         style="font-style:normal;font-weight:normal;font-size:10.5833px;line-height:1.25;font-family:sans-serif;fill:#000000;fill-opacity:1;stroke:none;stroke-width:0.264583"
         x="110.13761"
         y="20.322901"
         id="text1470-2"><tspan
           sodipodi:role="line"
           id="tspan1468-5"
           x="110.13761"
           y="20.322901"
           style="stroke-width:0.264583">80</tspan></text>
      <text
         xml:space="preserve"
         style="font-style:normal;font-weight:normal;font-size:10.5833px;line-height:1.25;font-family:sans-serif;fill:#000000;fill-opacity:1;stroke:none;stroke-width:0.264583"
         x="135.2919"
         y="20.338404"
         id="text1474-5"><tspan
           sodipodi:role="line"
           id="tspan1472-0"
           x="135.2919"
           y="20.338404"
           style="stroke-width:0.264583">95</tspan></text>
    </g>
    <g
       id="g1598-8-9"
       transform="matrix(0.40148951,0,0,0.40148951,1.9267174,-4.9665716)">
      <rect
         style="fill:none;stroke:#800000;stroke-width:0.04988022;stroke-miterlimit:4;stroke-dasharray:none"
         id="rect1578-4-7"
         width="30.994047"
         height="30.238094"
         x="164.79762"
         y="106.21131" />
      <path
         style="fill:none;stroke:#800000;stroke-width:0.04980191;stroke-linecap:butt;stroke-linejoin:miter;stroke-opacity:1;stroke-miterlimit:4;stroke-dasharray:none"
         d="m 164.79762,136.4494 c 30.99405,-30.23809 30.99405,-30.23809 30.99405,-30.23809"
         id="path1582-2-9" />
      <path
         style="fill:none;stroke:#800000;stroke-width:0.04980191;stroke-linecap:butt;stroke-linejoin:miter;stroke-opacity:1;stroke-miterlimit:4;stroke-dasharray:none"
         d="M 164.79762,125.20461 184.0744,106.3058"
         id="path1584-4-2" />
      <path
         style="fill:none;stroke:#800000;stroke-width:0.04980191;stroke-linecap:butt;stroke-linejoin:miter;stroke-opacity:1;stroke-miterlimit:4;stroke-dasharray:none"
         d="m 178.68824,136.35491 17.00893,-15.875"
         id="path1586-7-7" />
      <path
         style="fill:none;stroke:#800000;stroke-width:0.00281295;stroke-linecap:butt;stroke-linejoin:miter;stroke-opacity:1;stroke-miterlimit:4;stroke-dasharray:none"
         d="m 173.30208,106.21131 c -9.07143,7.9375 -8.31548,7.9375 -8.31548,7.9375"
         id="path1588-3-4" />
      <path
         style="fill:none;stroke:#800000;stroke-width:0.04980191;stroke-linecap:butt;stroke-linejoin:miter;stroke-opacity:1;stroke-miterlimit:4;stroke-dasharray:none"
         d="m 188.23214,136.4494 7.55952,-6.99255"
         id="path1590-0-6" />
      <rect
         style="fill:none;fill-opacity:1;stroke:#000000;stroke-width:0.188228;stroke-miterlimit:4;stroke-dasharray:none;stroke-opacity:1"
         id="rect3519"
         width="543.20789"
         height="381.28107"
         x="-0.091749825"
         y="24.609018" />
      <rect
         style="fill:none;fill-opacity:1;stroke:#000000;stroke-width:0.188228;stroke-miterlimit:4;stroke-dasharray:none;stroke-opacity:1"
         id="rect4140"
         width="543.20789"
         height="381.28107"
         x="-0.091749825"
         y="24.609018" />
    </g>
    <g
       id="g1598-8-9-7"
       transform="matrix(0.40148951,0,0,0.40148951,26.978668,-4.9665716)"
       style="stroke-width:0.18822795;stroke-miterlimit:4;stroke-dasharray:none">
      <rect
         style="fill:none;stroke:#ff0000;stroke-width:0.18822795;stroke-miterlimit:4;stroke-dasharray:none"
         id="rect1578-4-7-1"
         width="30.994047"
         height="30.238094"
         x="164.79762"
         y="106.21131" />
      <path
         style="fill:none;stroke:#ff0000;stroke-width:0.18822795;stroke-linecap:butt;stroke-linejoin:miter;stroke-opacity:1;stroke-miterlimit:4;stroke-dasharray:none"
         d="m 164.79762,136.4494 c 30.99405,-30.23809 30.99405,-30.23809 30.99405,-30.23809"
         id="path1582-2-9-3" />
      <path
         style="fill:none;stroke:#ff0000;stroke-width:0.18822795;stroke-linecap:butt;stroke-linejoin:miter;stroke-opacity:1;stroke-miterlimit:4;stroke-dasharray:none"
         d="M 164.79762,125.20461 184.0744,106.3058"
         id="path1584-4-2-1" />
      <path
         style="fill:none;stroke:#ff0000;stroke-width:0.18822795;stroke-linecap:butt;stroke-linejoin:miter;stroke-opacity:1;stroke-miterlimit:4;stroke-dasharray:none"
         d="m 178.68824,136.35491 17.00893,-15.875"
         id="path1586-7-7-5" />
      <path
         style="fill:none;stroke:#ff0000;stroke-width:0.18822795;stroke-linecap:butt;stroke-linejoin:miter;stroke-opacity:1;stroke-miterlimit:4;stroke-dasharray:none"
         d="m 173.30208,106.21131 c -9.07143,7.9375 -8.31548,7.9375 -8.31548,7.9375"
         id="path1588-3-4-7" />
      <path
         style="fill:none;stroke:#ff0000;stroke-width:0.18822795;stroke-linecap:butt;stroke-linejoin:miter;stroke-opacity:1;stroke-miterlimit:4;stroke-dasharray:none"
         d="m 188.23214,136.4494 7.55952,-6.99255"
         id="path1590-0-6-0" />
    </g>
    <g
       id="g1598-2"
       transform="matrix(0.40148951,0,0,0.40148951,52.030627,-4.9665716)"
       style="stroke-width:0.18822795;stroke-miterlimit:4;stroke-dasharray:none">
      <rect
         style="fill:none;stroke:#808000;stroke-width:0.18822795;stroke-miterlimit:4;stroke-dasharray:none"
         id="rect1578-7"
         width="30.994047"
         height="30.238094"
         x="164.79762"
         y="106.21131" />
      <path
         style="fill:none;stroke:#808000;stroke-width:0.18822795;stroke-linecap:butt;stroke-linejoin:miter;stroke-opacity:1;stroke-miterlimit:4;stroke-dasharray:none"
         d="m 164.79762,136.4494 c 30.99405,-30.23809 30.99405,-30.23809 30.99405,-30.23809"
         id="path1582-3" />
      <path
         style="fill:none;stroke:#808000;stroke-width:0.18822795;stroke-linecap:butt;stroke-linejoin:miter;stroke-opacity:1;stroke-miterlimit:4;stroke-dasharray:none"
         d="M 164.79762,125.20461 184.0744,106.3058"
         id="path1584-2" />
      <path
         style="fill:none;stroke:#808000;stroke-width:0.18822795;stroke-linecap:butt;stroke-linejoin:miter;stroke-opacity:1;stroke-miterlimit:4;stroke-dasharray:none"
         d="m 178.68824,136.35491 17.00893,-15.875"
         id="path1586-71" />
      <path
         style="fill:none;stroke:#808000;stroke-width:0.18822795;stroke-linecap:butt;stroke-linejoin:miter;stroke-opacity:1;stroke-miterlimit:4;stroke-dasharray:none"
         d="m 173.30208,106.21131 c -9.07143,7.9375 -8.31548,7.9375 -8.31548,7.9375"
         id="path1588-0" />
      <path
         style="fill:none;stroke:#808000;stroke-width:0.18822795;stroke-linecap:butt;stroke-linejoin:miter;stroke-opacity:1;stroke-miterlimit:4;stroke-dasharray:none"
         d="m 188.23214,136.4494 7.55952,-6.99255"
         id="path1590-3" />
    </g>
    <g
       id="g3515"
       style="stroke-width:0.00489081;stroke-miterlimit:4;stroke-dasharray:none">
      <g
         id="g1598-8-1"
         transform="matrix(0.40148951,0,0,0.40148951,77.082587,-4.9665716)"
         style="stroke-width:0.01218167;stroke-miterlimit:4;stroke-dasharray:none">
        <rect
           style="fill:none;stroke:#ffff00;stroke-width:0.01218167;stroke-miterlimit:4;stroke-dasharray:none"
           id="rect1578-4-2"
           width="30.994047"
           height="30.238094"
           x="164.79762"
           y="106.21131" />
        <path
           style="fill:none;stroke:#ffff00;stroke-width:0.01218167;stroke-linecap:butt;stroke-linejoin:miter;stroke-opacity:1;stroke-miterlimit:4;stroke-dasharray:none"
           d="m 164.79762,136.4494 c 30.99405,-30.23809 30.99405,-30.23809 30.99405,-30.23809"
           id="path1582-2-8" />
        <path
           style="fill:none;stroke:#ffff00;stroke-width:0.01218167;stroke-linecap:butt;stroke-linejoin:miter;stroke-opacity:1;stroke-miterlimit:4;stroke-dasharray:none"
           d="M 164.79762,125.20461 184.0744,106.3058"
           id="path1584-4-3" />
        <path
           style="fill:none;stroke:#ffff00;stroke-width:0.01218167;stroke-linecap:butt;stroke-linejoin:miter;stroke-opacity:1;stroke-miterlimit:4;stroke-dasharray:none"
           d="m 178.68824,136.35491 17.00893,-15.875"
           id="path1586-7-9" />
        <path
           style="fill:none;stroke:#ffff00;stroke-width:0.01218167;stroke-linecap:butt;stroke-linejoin:miter;stroke-opacity:1;stroke-miterlimit:4;stroke-dasharray:none"
           d="m 173.30208,106.21131 c -9.07143,7.9375 -8.31548,7.9375 -8.31548,7.9375"
           id="path1588-3-0" />
        <path
           style="fill:none;stroke:#ffff00;stroke-width:0.01218167;stroke-linecap:butt;stroke-linejoin:miter;stroke-opacity:1;stroke-miterlimit:4;stroke-dasharray:none"
           d="m 188.23214,136.4494 7.55952,-6.99255"
           id="path1590-0-1" />
      </g>
    </g>
    <g
       id="g1598-8-9-1"
       transform="matrix(0.40148951,0,0,0.40148951,102.13455,-4.9665716)"
       style="stroke:#008000;stroke-width:0.18822795;stroke-miterlimit:4;stroke-dasharray:none">
      <rect
         style="fill:none;stroke:#008000;stroke-width:0.18822795;stroke-miterlimit:4;stroke-dasharray:none"
         id="rect1578-4-7-2"
         width="30.994047"
         height="30.238094"
         x="164.79762"
         y="106.21131" />
      <path
         style="fill:none;stroke:#008000;stroke-width:0.18822795;stroke-linecap:butt;stroke-linejoin:miter;stroke-opacity:1;stroke-miterlimit:4;stroke-dasharray:none"
         d="m 164.79762,136.4494 c 30.99405,-30.23809 30.99405,-30.23809 30.99405,-30.23809"
         id="path1582-2-9-1" />
      <path
         style="fill:none;stroke:#008000;stroke-width:0.18822795;stroke-linecap:butt;stroke-linejoin:miter;stroke-opacity:1;stroke-miterlimit:4;stroke-dasharray:none"
         d="M 164.79762,125.20461 184.0744,106.3058"
         id="path1584-4-2-2" />
      <path
         style="fill:none;stroke:#008000;stroke-width:0.18822795;stroke-linecap:butt;stroke-linejoin:miter;stroke-opacity:1;stroke-miterlimit:4;stroke-dasharray:none"
         d="m 178.68824,136.35491 17.00893,-15.875"
         id="path1586-7-7-52" />
      <path
         style="fill:none;stroke:#008000;stroke-width:0.18822795;stroke-linecap:butt;stroke-linejoin:miter;stroke-opacity:1;stroke-miterlimit:4;stroke-dasharray:none"
         d="m 173.30208,106.21131 c -9.07143,7.9375 -8.31548,7.9375 -8.31548,7.9375"
         id="path1588-3-4-6" />
      <path
         style="fill:none;stroke:#008000;stroke-width:0.18822795;stroke-linecap:butt;stroke-linejoin:miter;stroke-opacity:1;stroke-miterlimit:4;stroke-dasharray:none"
         d="m 188.23214,136.4494 7.55952,-6.99255"
         id="path1590-0-6-3" />
    </g>
    <g
       id="g1598-8-9-7-8"
       transform="matrix(0.40148951,0,0,0.40148951,127.18651,-4.9665716)"
       style="stroke:#00ff00;stroke-width:0.18822795;stroke-miterlimit:4;stroke-dasharray:none">
      <rect
         style="fill:none;stroke:#00ff00;stroke-width:0.18822795;stroke-miterlimit:4;stroke-dasharray:none"
         id="rect1578-4-7-1-5"
         width="30.994047"
         height="30.238094"
         x="164.79762"
         y="106.21131" />
      <path
         style="fill:none;stroke:#00ff00;stroke-width:0.18822795;stroke-linecap:butt;stroke-linejoin:miter;stroke-opacity:1;stroke-miterlimit:4;stroke-dasharray:none"
         d="m 164.79762,136.4494 c 30.99405,-30.23809 30.99405,-30.23809 30.99405,-30.23809"
         id="path1582-2-9-3-6" />
      <path
         style="fill:none;stroke:#00ff00;stroke-width:0.18822795;stroke-linecap:butt;stroke-linejoin:miter;stroke-opacity:1;stroke-miterlimit:4;stroke-dasharray:none"
         d="M 164.79762,125.20461 184.0744,106.3058"
         id="path1584-4-2-1-7" />
      <path
         style="fill:none;stroke:#00ff00;stroke-width:0.18822795;stroke-linecap:butt;stroke-linejoin:miter;stroke-opacity:1;stroke-miterlimit:4;stroke-dasharray:none"
         d="m 178.68824,136.35491 17.00893,-15.875"
         id="path1586-7-7-5-7" />
      <path
         style="fill:none;stroke:#00ff00;stroke-width:0.18822795;stroke-linecap:butt;stroke-linejoin:miter;stroke-opacity:1;stroke-miterlimit:4;stroke-dasharray:none"
         d="m 173.30208,106.21131 c -9.07143,7.9375 -8.31548,7.9375 -8.31548,7.9375"
         id="path1588-3-4-7-3" />
      <path
         style="fill:none;stroke:#00ff00;stroke-width:0.18822795;stroke-linecap:butt;stroke-linejoin:miter;stroke-opacity:1;stroke-miterlimit:4;stroke-dasharray:none"
         d="m 188.23214,136.4494 7.55952,-6.99255"
         id="path1590-0-6-0-5" />
    </g>
    <g
       id="g1598-8-9-7-87"
       transform="matrix(0.40148951,0,0,0.40148951,26.806253,13.828203)"
       style="stroke:#00ffff;stroke-width:0.18822795;stroke-miterlimit:4;stroke-dasharray:none">
      <rect
         style="fill:none;stroke:#00ffff;stroke-width:0.18822795;stroke-miterlimit:4;stroke-dasharray:none"
         id="rect1578-4-7-1-8"
         width="30.994047"
         height="30.238094"
         x="164.79762"
         y="106.21131" />
      <path
         style="fill:none;stroke:#00ffff;stroke-width:0.18822795;stroke-linecap:butt;stroke-linejoin:miter;stroke-opacity:1;stroke-miterlimit:4;stroke-dasharray:none"
         d="m 164.79762,136.4494 c 30.99405,-30.23809 30.99405,-30.23809 30.99405,-30.23809"
         id="path1582-2-9-3-5" />
      <path
         style="fill:none;stroke:#00ffff;stroke-width:0.18822795;stroke-linecap:butt;stroke-linejoin:miter;stroke-opacity:1;stroke-miterlimit:4;stroke-dasharray:none"
         d="M 164.79762,125.20461 184.0744,106.3058"
         id="path1584-4-2-1-3" />
      <path
         style="fill:none;stroke:#00ffff;stroke-width:0.18822795;stroke-linecap:butt;stroke-linejoin:miter;stroke-opacity:1;stroke-miterlimit:4;stroke-dasharray:none"
         d="m 178.68824,136.35491 17.00893,-15.875"
         id="path1586-7-7-5-5" />
      <path
         style="fill:none;stroke:#00ffff;stroke-width:0.18822795;stroke-linecap:butt;stroke-linejoin:miter;stroke-opacity:1;stroke-miterlimit:4;stroke-dasharray:none"
         d="m 173.30208,106.21131 c -9.07143,7.9375 -8.31548,7.9375 -8.31548,7.9375"
         id="path1588-3-4-7-5" />
      <path
         style="fill:none;stroke:#00ffff;stroke-width:0.18822795;stroke-linecap:butt;stroke-linejoin:miter;stroke-opacity:1;stroke-miterlimit:4;stroke-dasharray:none"
         d="m 188.23214,136.4494 7.55952,-6.99255"
         id="path1590-0-6-0-7" />
    </g>
    <g
       id="g1598-2-4"
       transform="matrix(0.40148951,0,0,0.40148951,51.858207,13.828203)"
       style="stroke:#000080;stroke-width:0.18822795;stroke-miterlimit:4;stroke-dasharray:none">
      <rect
         style="fill:none;stroke:#000080;stroke-width:0.18822795;stroke-miterlimit:4;stroke-dasharray:none"
         id="rect1578-7-0"
         width="30.994047"
         height="30.238094"
         x="164.79762"
         y="106.21131" />
      <path
         style="fill:none;stroke:#000080;stroke-width:0.18822795;stroke-linecap:butt;stroke-linejoin:miter;stroke-opacity:1;stroke-miterlimit:4;stroke-dasharray:none"
         d="m 164.79762,136.4494 c 30.99405,-30.23809 30.99405,-30.23809 30.99405,-30.23809"
         id="path1582-3-5" />
      <path
         style="fill:none;stroke:#000080;stroke-width:0.18822795;stroke-linecap:butt;stroke-linejoin:miter;stroke-opacity:1;stroke-miterlimit:4;stroke-dasharray:none"
         d="M 164.79762,125.20461 184.0744,106.3058"
         id="path1584-2-2" />
      <path
         style="fill:none;stroke:#000080;stroke-width:0.18822795;stroke-linecap:butt;stroke-linejoin:miter;stroke-opacity:1;stroke-miterlimit:4;stroke-dasharray:none"
         d="m 178.68824,136.35491 17.00893,-15.875"
         id="path1586-71-4" />
      <path
         style="fill:none;stroke:#000080;stroke-width:0.18822795;stroke-linecap:butt;stroke-linejoin:miter;stroke-opacity:1;stroke-miterlimit:4;stroke-dasharray:none"
         d="m 173.30208,106.21131 c -9.07143,7.9375 -8.31548,7.9375 -8.31548,7.9375"
         id="path1588-0-6" />
      <path
         style="fill:none;stroke:#000080;stroke-width:0.18822795;stroke-linecap:butt;stroke-linejoin:miter;stroke-opacity:1;stroke-miterlimit:4;stroke-dasharray:none"
         d="m 188.23214,136.4494 7.55952,-6.99255"
         id="path1590-3-4" />
    </g>
    <g
       id="g1598-8-1-8"
       transform="matrix(0.40148951,0,0,0.40148951,76.910167,13.828203)"
       style="stroke:#0000ff;stroke-width:0.18822795;stroke-miterlimit:4;stroke-dasharray:none">
      <rect
         style="fill:none;stroke:#0000ff;stroke-width:0.18822795;stroke-miterlimit:4;stroke-dasharray:none"
         id="rect1578-4-2-5"
         width="30.994047"
         height="30.238094"
         x="164.79762"
         y="106.21131" />
      <path
         style="fill:none;stroke:#0000ff;stroke-width:0.18822795;stroke-linecap:butt;stroke-linejoin:miter;stroke-opacity:1;stroke-miterlimit:4;stroke-dasharray:none"
         d="m 164.79762,136.4494 c 30.99405,-30.23809 30.99405,-30.23809 30.99405,-30.23809"
         id="path1582-2-8-6" />
      <path
         style="fill:none;stroke:#0000ff;stroke-width:0.18822795;stroke-linecap:butt;stroke-linejoin:miter;stroke-opacity:1;stroke-miterlimit:4;stroke-dasharray:none"
         d="M 164.79762,125.20461 184.0744,106.3058"
         id="path1584-4-3-3" />
      <path
         style="fill:none;stroke:#0000ff;stroke-width:0.18822795;stroke-linecap:butt;stroke-linejoin:miter;stroke-opacity:1;stroke-miterlimit:4;stroke-dasharray:none"
         d="m 178.68824,136.35491 17.00893,-15.875"
         id="path1586-7-9-4" />
      <path
         style="fill:none;stroke:#0000ff;stroke-width:0.18822795;stroke-linecap:butt;stroke-linejoin:miter;stroke-opacity:1;stroke-miterlimit:4;stroke-dasharray:none"
         d="m 173.30208,106.21131 c -9.07143,7.9375 -8.31548,7.9375 -8.31548,7.9375"
         id="path1588-3-0-1" />
      <path
         style="fill:none;stroke:#0000ff;stroke-width:0.18822795;stroke-linecap:butt;stroke-linejoin:miter;stroke-opacity:1;stroke-miterlimit:4;stroke-dasharray:none"
         d="m 188.23214,136.4494 7.55952,-6.99255"
         id="path1590-0-1-9" />
    </g>
    <g
       id="g1598-8-9-1-4"
       transform="matrix(0.40148951,0,0,0.40148951,101.96213,13.828203)"
       style="stroke:#800080;stroke-width:0.18822795;stroke-miterlimit:4;stroke-dasharray:none">
      <rect
         style="fill:none;stroke:#800080;stroke-width:0.18822795;stroke-miterlimit:4;stroke-dasharray:none"
         id="rect1578-4-7-2-6"
         width="30.994047"
         height="30.238094"
         x="164.79762"
         y="106.21131" />
      <path
         style="fill:none;stroke:#800080;stroke-width:0.18822795;stroke-linecap:butt;stroke-linejoin:miter;stroke-opacity:1;stroke-miterlimit:4;stroke-dasharray:none"
         d="m 164.79762,136.4494 c 30.99405,-30.23809 30.99405,-30.23809 30.99405,-30.23809"
         id="path1582-2-9-1-5" />
      <path
         style="fill:none;stroke:#800080;stroke-width:0.18822795;stroke-linecap:butt;stroke-linejoin:miter;stroke-opacity:1;stroke-miterlimit:4;stroke-dasharray:none"
         d="M 164.79762,125.20461 184.0744,106.3058"
         id="path1584-4-2-2-9" />
      <path
         style="fill:none;stroke:#800080;stroke-width:0.18822795;stroke-linecap:butt;stroke-linejoin:miter;stroke-opacity:1;stroke-miterlimit:4;stroke-dasharray:none"
         d="m 178.68824,136.35491 17.00893,-15.875"
         id="path1586-7-7-52-6" />
      <path
         style="fill:none;stroke:#800080;stroke-width:0.18822795;stroke-linecap:butt;stroke-linejoin:miter;stroke-opacity:1;stroke-miterlimit:4;stroke-dasharray:none"
         d="m 173.30208,106.21131 c -9.07143,7.9375 -8.31548,7.9375 -8.31548,7.9375"
         id="path1588-3-4-6-8" />
      <path
         style="fill:none;stroke:#800080;stroke-width:0.18822795;stroke-linecap:butt;stroke-linejoin:miter;stroke-opacity:1;stroke-miterlimit:4;stroke-dasharray:none"
         d="m 188.23214,136.4494 7.55952,-6.99255"
         id="path1590-0-6-3-6" />
    </g>
    <g
       id="g1598-8-9-7-8-4"
       transform="matrix(0.40148951,0,0,0.40148951,127.0141,13.828203)"
       style="stroke:#ff00ff;stroke-width:0.18822795;stroke-miterlimit:4;stroke-dasharray:none">
      <rect
         style="fill:none;stroke:#ff00ff;stroke-width:0.18822795;stroke-miterlimit:4;stroke-dasharray:none"
         id="rect1578-4-7-1-5-7"
         width="30.994047"
         height="30.238094"
         x="164.79762"
         y="106.21131" />
      <path
         style="fill:none;stroke:#ff00ff;stroke-width:0.18822795;stroke-linecap:butt;stroke-linejoin:miter;stroke-opacity:1;stroke-miterlimit:4;stroke-dasharray:none"
         d="m 164.79762,136.4494 c 30.99405,-30.23809 30.99405,-30.23809 30.99405,-30.23809"
         id="path1582-2-9-3-6-5" />
      <path
         style="fill:none;stroke:#ff00ff;stroke-width:0.18822795;stroke-linecap:butt;stroke-linejoin:miter;stroke-opacity:1;stroke-miterlimit:4;stroke-dasharray:none"
         d="M 164.79762,125.20461 184.0744,106.3058"
         id="path1584-4-2-1-7-3" />
      <path
         style="fill:none;stroke:#ff00ff;stroke-width:0.18822795;stroke-linecap:butt;stroke-linejoin:miter;stroke-opacity:1;stroke-miterlimit:4;stroke-dasharray:none"
         d="m 178.68824,136.35491 17.00893,-15.875"
         id="path1586-7-7-5-7-9" />
      <path
         style="fill:none;stroke:#ff00ff;stroke-width:0.18822795;stroke-linecap:butt;stroke-linejoin:miter;stroke-opacity:1;stroke-miterlimit:4;stroke-dasharray:none"
         d="m 173.30208,106.21131 c -9.07143,7.9375 -8.31548,7.9375 -8.31548,7.9375"
         id="path1588-3-4-7-3-2" />
      <path
         style="fill:none;stroke:#ff00ff;stroke-width:0.18822795;stroke-linecap:butt;stroke-linejoin:miter;stroke-opacity:1;stroke-miterlimit:4;stroke-dasharray:none"
         d="m 188.23214,136.4494 7.55952,-6.99255"
         id="path1590-0-6-0-5-2" />
    </g>
    <g
       id="g1598-2-4-6"
       transform="matrix(0.40148951,0,0,0.40148951,51.858197,32.002532)"
       style="stroke:#ff6600;stroke-width:0.18822795;stroke-miterlimit:4;stroke-dasharray:none">
      <rect
         style="fill:none;stroke:#ff6600;stroke-width:0.18822795;stroke-miterlimit:4;stroke-dasharray:none"
         id="rect1578-7-0-7"
         width="30.994047"
         height="30.238094"
         x="164.79762"
         y="106.21131" />
      <path
         style="fill:none;stroke:#ff6600;stroke-width:0.18822795;stroke-linecap:butt;stroke-linejoin:miter;stroke-opacity:1;stroke-miterlimit:4;stroke-dasharray:none"
         d="m 164.79762,136.4494 c 30.99405,-30.23809 30.99405,-30.23809 30.99405,-30.23809"
         id="path1582-3-5-0" />
      <path
         style="fill:none;stroke:#ff6600;stroke-width:0.18822795;stroke-linecap:butt;stroke-linejoin:miter;stroke-opacity:1;stroke-miterlimit:4;stroke-dasharray:none"
         d="M 164.79762,125.20461 184.0744,106.3058"
         id="path1584-2-2-1" />
      <path
         style="fill:none;stroke:#ff6600;stroke-width:0.18822795;stroke-linecap:butt;stroke-linejoin:miter;stroke-opacity:1;stroke-miterlimit:4;stroke-dasharray:none"
         d="m 178.68824,136.35491 17.00893,-15.875"
         id="path1586-71-4-3" />
      <path
         style="fill:none;stroke:#ff6600;stroke-width:0.18822795;stroke-linecap:butt;stroke-linejoin:miter;stroke-opacity:1;stroke-miterlimit:4;stroke-dasharray:none"
         d="m 173.30208,106.21131 c -9.07143,7.9375 -8.31548,7.9375 -8.31548,7.9375"
         id="path1588-0-6-9" />
      <path
         style="fill:none;stroke:#ff6600;stroke-width:0.18822795;stroke-linecap:butt;stroke-linejoin:miter;stroke-opacity:1;stroke-miterlimit:4;stroke-dasharray:none"
         d="m 188.23214,136.4494 7.55952,-6.99255"
         id="path1590-3-4-7" />
    </g>
    <g
       id="g1598-8-1-8-3"
       transform="matrix(0.40148951,0,0,0.40148951,76.910157,32.002532)"
       style="stroke:#ffe6d5;stroke-width:0.18822795;stroke-miterlimit:4;stroke-dasharray:none">
      <rect
         style="fill:none;stroke:#ffe6d5;stroke-width:0.18822795;stroke-miterlimit:4;stroke-dasharray:none"
         id="rect1578-4-2-5-9"
         width="30.994047"
         height="30.238094"
         x="164.79762"
         y="106.21131" />
      <path
         style="fill:none;stroke:#ffe6d5;stroke-width:0.18822795;stroke-linecap:butt;stroke-linejoin:miter;stroke-opacity:1;stroke-miterlimit:4;stroke-dasharray:none"
         d="m 164.79762,136.4494 c 30.99405,-30.23809 30.99405,-30.23809 30.99405,-30.23809"
         id="path1582-2-8-6-4" />
      <path
         style="fill:none;stroke:#ffe6d5;stroke-width:0.18822795;stroke-linecap:butt;stroke-linejoin:miter;stroke-opacity:1;stroke-miterlimit:4;stroke-dasharray:none"
         d="M 164.79762,125.20461 184.0744,106.3058"
         id="path1584-4-3-3-2" />
      <path
         style="fill:none;stroke:#ffe6d5;stroke-width:0.18822795;stroke-linecap:butt;stroke-linejoin:miter;stroke-opacity:1;stroke-miterlimit:4;stroke-dasharray:none"
         d="m 178.68824,136.35491 17.00893,-15.875"
         id="path1586-7-9-4-6" />
      <path
         style="fill:none;stroke:#ffe6d5;stroke-width:0.18822795;stroke-linecap:butt;stroke-linejoin:miter;stroke-opacity:1;stroke-miterlimit:4;stroke-dasharray:none"
         d="m 173.30208,106.21131 c -9.07143,7.9375 -8.31548,7.9375 -8.31548,7.9375"
         id="path1588-3-0-1-7" />
      <path
         style="fill:none;stroke:#ffe6d5;stroke-width:0.18822795;stroke-linecap:butt;stroke-linejoin:miter;stroke-opacity:1;stroke-miterlimit:4;stroke-dasharray:none"
         d="m 188.23214,136.4494 7.55952,-6.99255"
         id="path1590-0-1-9-7" />
    </g>
    <g
       id="g1598-8-9-1-4-1"
       transform="matrix(0.40148951,0,0,0.40148951,101.96212,32.002532)"
       style="stroke:#ffd42a;stroke-width:0.18822795;stroke-miterlimit:4;stroke-dasharray:none">
      <rect
         style="fill:none;stroke:#ffd42a;stroke-width:0.18822795;stroke-miterlimit:4;stroke-dasharray:none"
         id="rect1578-4-7-2-6-7"
         width="30.994047"
         height="30.238094"
         x="164.79762"
         y="106.21131" />
      <path
         style="fill:none;stroke:#ffd42a;stroke-width:0.18822795;stroke-linecap:butt;stroke-linejoin:miter;stroke-opacity:1;stroke-miterlimit:4;stroke-dasharray:none"
         d="m 164.79762,136.4494 c 30.99405,-30.23809 30.99405,-30.23809 30.99405,-30.23809"
         id="path1582-2-9-1-5-2" />
      <path
         style="fill:none;stroke:#ffd42a;stroke-width:0.18822795;stroke-linecap:butt;stroke-linejoin:miter;stroke-opacity:1;stroke-miterlimit:4;stroke-dasharray:none"
         d="M 164.79762,125.20461 184.0744,106.3058"
         id="path1584-4-2-2-9-3" />
      <path
         style="fill:none;stroke:#ffd42a;stroke-width:0.18822795;stroke-linecap:butt;stroke-linejoin:miter;stroke-opacity:1;stroke-miterlimit:4;stroke-dasharray:none"
         d="m 178.68824,136.35491 17.00893,-15.875"
         id="path1586-7-7-52-6-9" />
      <path
         style="fill:none;stroke:#ffd42a;stroke-width:0.18822795;stroke-linecap:butt;stroke-linejoin:miter;stroke-opacity:1;stroke-miterlimit:4;stroke-dasharray:none"
         d="m 173.30208,106.21131 c -9.07143,7.9375 -8.31548,7.9375 -8.31548,7.9375"
         id="path1588-3-4-6-8-9" />
      <path
         style="fill:none;stroke:#ffd42a;stroke-width:0.18822795;stroke-linecap:butt;stroke-linejoin:miter;stroke-opacity:1;stroke-miterlimit:4;stroke-dasharray:none"
         d="m 188.23214,136.4494 7.55952,-6.99255"
         id="path1590-0-6-3-6-6" />
    </g>
    <g
       id="g1598-8-9-7-8-4-9"
       transform="matrix(0.40148951,0,0,0.40148951,127.01409,32.002532)"
       style="stroke:#504416;stroke-width:0.18822795;stroke-miterlimit:4;stroke-dasharray:none">
      <rect
         style="fill:none;stroke:#504416;stroke-width:0.18822795;stroke-miterlimit:4;stroke-dasharray:none"
         id="rect1578-4-7-1-5-7-9"
         width="30.994047"
         height="30.238094"
         x="164.79762"
         y="106.21131" />
      <path
         style="fill:none;stroke:#504416;stroke-width:0.18822795;stroke-linecap:butt;stroke-linejoin:miter;stroke-opacity:1;stroke-miterlimit:4;stroke-dasharray:none"
         d="m 164.79762,136.4494 c 30.99405,-30.23809 30.99405,-30.23809 30.99405,-30.23809"
         id="path1582-2-9-3-6-5-9" />
      <path
         style="fill:none;stroke:#504416;stroke-width:0.18822795;stroke-linecap:butt;stroke-linejoin:miter;stroke-opacity:1;stroke-miterlimit:4;stroke-dasharray:none"
         d="M 164.79762,125.20461 184.0744,106.3058"
         id="path1584-4-2-1-7-3-5" />
      <path
         style="fill:none;stroke:#504416;stroke-width:0.18822795;stroke-linecap:butt;stroke-linejoin:miter;stroke-opacity:1;stroke-miterlimit:4;stroke-dasharray:none"
         d="m 178.68824,136.35491 17.00893,-15.875"
         id="path1586-7-7-5-7-9-0" />
      <path
         style="fill:none;stroke:#504416;stroke-width:0.18822795;stroke-linecap:butt;stroke-linejoin:miter;stroke-opacity:1;stroke-miterlimit:4;stroke-dasharray:none"
         d="m 173.30208,106.21131 c -9.07143,7.9375 -8.31548,7.9375 -8.31548,7.9375"
         id="path1588-3-4-7-3-2-4" />
      <path
         style="fill:none;stroke:#504416;stroke-width:0.18822795;stroke-linecap:butt;stroke-linejoin:miter;stroke-opacity:1;stroke-miterlimit:4;stroke-dasharray:none"
         d="m 188.23214,136.4494 7.55952,-6.99255"
         id="path1590-0-6-0-5-2-2" />
    </g>
    <g
       id="g1598-8-1-8-3-2"
       transform="matrix(0.40148951,0,0,0.40148951,76.910157,50.711398)"
       style="stroke:#ccff00;stroke-width:0.18822795;stroke-miterlimit:4;stroke-dasharray:none">
      <rect
         style="fill:none;stroke:#ccff00;stroke-width:0.18822795;stroke-miterlimit:4;stroke-dasharray:none"
         id="rect1578-4-2-5-9-9"
         width="30.994047"
         height="30.238094"
         x="164.79762"
         y="106.21131" />
      <path
         style="fill:none;stroke:#ccff00;stroke-width:0.18822795;stroke-linecap:butt;stroke-linejoin:miter;stroke-opacity:1;stroke-miterlimit:4;stroke-dasharray:none"
         d="m 164.79762,136.4494 c 30.99405,-30.23809 30.99405,-30.23809 30.99405,-30.23809"
         id="path1582-2-8-6-4-4" />
      <path
         style="fill:none;stroke:#ccff00;stroke-width:0.18822795;stroke-linecap:butt;stroke-linejoin:miter;stroke-opacity:1;stroke-miterlimit:4;stroke-dasharray:none"
         d="M 164.79762,125.20461 184.0744,106.3058"
         id="path1584-4-3-3-2-2" />
      <path
         style="fill:none;stroke:#ccff00;stroke-width:0.18822795;stroke-linecap:butt;stroke-linejoin:miter;stroke-opacity:1;stroke-miterlimit:4;stroke-dasharray:none"
         d="m 178.68824,136.35491 17.00893,-15.875"
         id="path1586-7-9-4-6-8" />
      <path
         style="fill:none;stroke:#ccff00;stroke-width:0.18822795;stroke-linecap:butt;stroke-linejoin:miter;stroke-opacity:1;stroke-miterlimit:4;stroke-dasharray:none"
         d="m 173.30208,106.21131 c -9.07143,7.9375 -8.31548,7.9375 -8.31548,7.9375"
         id="path1588-3-0-1-7-5" />
      <path
         style="fill:none;stroke:#ccff00;stroke-width:0.18822795;stroke-linecap:butt;stroke-linejoin:miter;stroke-opacity:1;stroke-miterlimit:4;stroke-dasharray:none"
         d="m 188.23214,136.4494 7.55952,-6.99255"
         id="path1590-0-1-9-7-8" />
    </g>
    <g
       id="g1598-8-9-1-4-1-3"
       transform="matrix(0.40148951,0,0,0.40148951,101.96212,50.711398)"
       style="stroke:#00ccff;stroke-width:0.18822795;stroke-miterlimit:4;stroke-dasharray:none">
      <rect
         style="fill:none;stroke:#00ccff;stroke-width:0.18822795;stroke-miterlimit:4;stroke-dasharray:none"
         id="rect1578-4-7-2-6-7-6"
         width="30.994047"
         height="30.238094"
         x="164.79762"
         y="106.21131" />
      <path
         style="fill:none;stroke:#00ccff;stroke-width:0.18822795;stroke-linecap:butt;stroke-linejoin:miter;stroke-opacity:1;stroke-miterlimit:4;stroke-dasharray:none"
         d="m 164.79762,136.4494 c 30.99405,-30.23809 30.99405,-30.23809 30.99405,-30.23809"
         id="path1582-2-9-1-5-2-8" />
      <path
         style="fill:none;stroke:#00ccff;stroke-width:0.18822795;stroke-linecap:butt;stroke-linejoin:miter;stroke-opacity:1;stroke-miterlimit:4;stroke-dasharray:none"
         d="M 164.79762,125.20461 184.0744,106.3058"
         id="path1584-4-2-2-9-3-8" />
      <path
         style="fill:none;stroke:#00ccff;stroke-width:0.18822795;stroke-linecap:butt;stroke-linejoin:miter;stroke-opacity:1;stroke-miterlimit:4;stroke-dasharray:none"
         d="m 178.68824,136.35491 17.00893,-15.875"
         id="path1586-7-7-52-6-9-6" />
      <path
         style="fill:none;stroke:#00ccff;stroke-width:0.18822795;stroke-linecap:butt;stroke-linejoin:miter;stroke-opacity:1;stroke-miterlimit:4;stroke-dasharray:none"
         d="m 173.30208,106.21131 c -9.07143,7.9375 -8.31548,7.9375 -8.31548,7.9375"
         id="path1588-3-4-6-8-9-4" />
      <path
         style="fill:none;stroke:#00ccff;stroke-width:0.18822795;stroke-linecap:butt;stroke-linejoin:miter;stroke-opacity:1;stroke-miterlimit:4;stroke-dasharray:none"
         d="m 188.23214,136.4494 7.55952,-6.99255"
         id="path1590-0-6-3-6-6-5" />
    </g>
    <g
       id="g1598-8-9-7-8-4-9-4"
       transform="matrix(0.40148951,0,0,0.40148951,127.01409,50.711398)"
       style="stroke:#5599ff;stroke-width:0.18822795;stroke-miterlimit:4;stroke-dasharray:none">
      <rect
         style="fill:none;stroke:#5599ff;stroke-width:0.18822795;stroke-miterlimit:4;stroke-dasharray:none"
         id="rect1578-4-7-1-5-7-9-6"
         width="30.994047"
         height="30.238094"
         x="164.79762"
         y="106.21131" />
      <path
         style="fill:none;stroke:#5599ff;stroke-width:0.18822795;stroke-linecap:butt;stroke-linejoin:miter;stroke-opacity:1;stroke-miterlimit:4;stroke-dasharray:none"
         d="m 164.79762,136.4494 c 30.99405,-30.23809 30.99405,-30.23809 30.99405,-30.23809"
         id="path1582-2-9-3-6-5-9-4" />
      <path
         style="fill:none;stroke:#5599ff;stroke-width:0.18822795;stroke-linecap:butt;stroke-linejoin:miter;stroke-opacity:1;stroke-miterlimit:4;stroke-dasharray:none"
         d="M 164.79762,125.20461 184.0744,106.3058"
         id="path1584-4-2-1-7-3-5-0" />
      <path
         style="fill:none;stroke:#5599ff;stroke-width:0.18822795;stroke-linecap:butt;stroke-linejoin:miter;stroke-opacity:1;stroke-miterlimit:4;stroke-dasharray:none"
         d="m 178.68824,136.35491 17.00893,-15.875"
         id="path1586-7-7-5-7-9-0-8" />
      <path
         style="fill:none;stroke:#5599ff;stroke-width:0.18822795;stroke-linecap:butt;stroke-linejoin:miter;stroke-opacity:1;stroke-miterlimit:4;stroke-dasharray:none"
         d="m 173.30208,106.21131 c -9.07143,7.9375 -8.31548,7.9375 -8.31548,7.9375"
         id="path1588-3-4-7-3-2-4-8" />
      <path
         style="fill:none;stroke:#5599ff;stroke-width:0.18822795;stroke-linecap:butt;stroke-linejoin:miter;stroke-opacity:1;stroke-miterlimit:4;stroke-dasharray:none"
         d="m 188.23214,136.4494 7.55952,-6.99255"
         id="path1590-0-6-0-5-2-2-5" />
    </g>
    <g
       id="g1598-8-9-1-4-1-3-9"
       transform="matrix(0.40148951,0,0,0.40148951,101.69485,69.152996)"
       style="stroke:#7f2aff;stroke-width:0.18822795;stroke-miterlimit:4;stroke-dasharray:none">
      <rect
         style="fill:none;stroke:#7f2aff;stroke-width:0.18822795;stroke-miterlimit:4;stroke-dasharray:none"
         id="rect1578-4-7-2-6-7-6-6"
         width="30.994047"
         height="30.238094"
         x="164.79762"
         y="106.21131" />
      <path
         style="fill:none;stroke:#7f2aff;stroke-width:0.18822795;stroke-linecap:butt;stroke-linejoin:miter;stroke-opacity:1;stroke-miterlimit:4;stroke-dasharray:none"
         d="m 164.79762,136.4494 c 30.99405,-30.23809 30.99405,-30.23809 30.99405,-30.23809"
         id="path1582-2-9-1-5-2-8-6" />
      <path
         style="fill:none;stroke:#7f2aff;stroke-width:0.18822795;stroke-linecap:butt;stroke-linejoin:miter;stroke-opacity:1;stroke-miterlimit:4;stroke-dasharray:none"
         d="M 164.79762,125.20461 184.0744,106.3058"
         id="path1584-4-2-2-9-3-8-0" />
      <path
         style="fill:none;stroke:#7f2aff;stroke-width:0.18822795;stroke-linecap:butt;stroke-linejoin:miter;stroke-opacity:1;stroke-miterlimit:4;stroke-dasharray:none"
         d="m 178.68824,136.35491 17.00893,-15.875"
         id="path1586-7-7-52-6-9-6-3" />
      <path
         style="fill:none;stroke:#7f2aff;stroke-width:0.18822795;stroke-linecap:butt;stroke-linejoin:miter;stroke-opacity:1;stroke-miterlimit:4;stroke-dasharray:none"
         d="m 173.30208,106.21131 c -9.07143,7.9375 -8.31548,7.9375 -8.31548,7.9375"
         id="path1588-3-4-6-8-9-4-4" />
      <path
         style="fill:none;stroke:#7f2aff;stroke-width:0.18822795;stroke-linecap:butt;stroke-linejoin:miter;stroke-opacity:1;stroke-miterlimit:4;stroke-dasharray:none"
         d="m 188.23214,136.4494 7.55952,-6.99255"
         id="path1590-0-6-3-6-6-5-8" />
    </g>
    <g
       id="g1598-8-9-7-8-4-9-4-6"
       transform="matrix(0.40148951,0,0,0.40148951,126.74682,69.152996)"
       style="stroke:#ff0066;stroke-width:0.18822795;stroke-miterlimit:4;stroke-dasharray:none">
      <rect
         style="fill:none;stroke:#ff0066;stroke-width:0.18822795;stroke-miterlimit:4;stroke-dasharray:none"
         id="rect1578-4-7-1-5-7-9-6-4"
         width="30.994047"
         height="30.238094"
         x="164.79762"
         y="106.21131" />
      <path
         style="fill:none;stroke:#ff0066;stroke-width:0.18822795;stroke-linecap:butt;stroke-linejoin:miter;stroke-opacity:1;stroke-miterlimit:4;stroke-dasharray:none"
         d="m 164.79762,136.4494 c 30.99405,-30.23809 30.99405,-30.23809 30.99405,-30.23809"
         id="path1582-2-9-3-6-5-9-4-2" />
      <path
         style="fill:none;stroke:#ff0066;stroke-width:0.18822795;stroke-linecap:butt;stroke-linejoin:miter;stroke-opacity:1;stroke-miterlimit:4;stroke-dasharray:none"
         d="M 164.79762,125.20461 184.0744,106.3058"
         id="path1584-4-2-1-7-3-5-0-5" />
      <path
         style="fill:none;stroke:#ff0066;stroke-width:0.18822795;stroke-linecap:butt;stroke-linejoin:miter;stroke-opacity:1;stroke-miterlimit:4;stroke-dasharray:none"
         d="m 178.68824,136.35491 17.00893,-15.875"
         id="path1586-7-7-5-7-9-0-8-2" />
      <path
         style="fill:none;stroke:#ff0066;stroke-width:0.18822795;stroke-linecap:butt;stroke-linejoin:miter;stroke-opacity:1;stroke-miterlimit:4;stroke-dasharray:none"
         d="m 173.30208,106.21131 c -9.07143,7.9375 -8.31548,7.9375 -8.31548,7.9375"
         id="path1588-3-4-7-3-2-4-8-9" />
      <path
         style="fill:none;stroke:#ff0066;stroke-width:0.18822795;stroke-linecap:butt;stroke-linejoin:miter;stroke-opacity:1;stroke-miterlimit:4;stroke-dasharray:none"
         d="m 188.23214,136.4494 7.55952,-6.99255"
         id="path1590-0-6-0-5-2-2-5-2" />
    </g>
  </g>
</svg>
