<?xml version="1.0"?>
<!DOCTYPE svg PUBLIC "-//W3C//DTD SVG 1.1//EN" "http://www.w3.org/Graphics/SVG/1.1/DTD/svg11.dtd">
<svg width="173.4mm" height="144.82135623730952mm" viewBox="0 0 173.4 144.82135623730952" xmlns="http://www.w3.org/2000/svg" version="1.1">
<g id="Sketch002" transform="translate(202.566180,96.636676) scale(1,-1)">
<path id="Sketch002_w0000"  d="M -125.86618 94.936676 L -125.86618 74.936676 L -180.86618 34.22599788134525 L -200.86618 34.22599788134525 L -200.86618 14.22599788134525 L -180.86618 14.22599788134525 L -125.86618 -26.484680237309504 L -125.86618 -46.484680237309504 L -105.86618 -46.484680237309504 L -105.86618 -26.484680237309508 L -50.86618 14.225997881345254 L -30.866180000000004 14.22599788134525 L -30.866180000000014 34.22599788134525 L -50.86618 34.22599788134525 L -105.86618 74.936676 L -105.86618 94.936676 L -125.86618 94.936676 " stroke="#000000" stroke-width="0.35 px" style="stroke-width:0.35;stroke-miterlimit:4;stroke-dasharray:none;fill:none;fill-opacity:1;fill-rule: evenodd"/>
<title>b'support'</title>
</g>
</svg>