<svg xmlns="http://www.w3.org/2000/svg" version="1.1" width="100mm" height="150mm" viewBox="0 0 100 150">
<g stroke="black">
	<g transform="translate(0,0)">
	<path d="M 0 5L35.90594245370453 14.620968283948493"></path>
	<path d="M 45 0L35.37903171605151 35.90594245370453"></path>
	<path d="M 50 45L14.094057546295467 35.37903171605151"></path>
	<path d="M 5 50L14.620968283948493 14.094057546295467"></path>
	</g>
	<g transform="translate(0,50)translate(50,0)scale(-1,1)">
	<path d="M 0 5L35.90594245370453 14.620968283948493"></path>
	<path d="M 45 0L35.37903171605151 35.90594245370453"></path>
	<path d="M 50 45L14.094057546295467 35.37903171605151"></path>
	<path d="M 5 50L14.620968283948493 14.094057546295467"></path>
	</g>
	<g transform="translate(0,100)">
	<path d="M 0 5L35.90594245370453 14.620968283948493"></path>
	<path d="M 45 0L35.37903171605151 35.90594245370453"></path>
	<path d="M 50 45L14.094057546295467 35.37903171605151"></path>
	<path d="M 5 50L14.620968283948493 14.094057546295467"></path>
	</g>
	<g transform="translate(50,0)translate(50,0)scale(-1,1)">
	<path d="M 0 5L35.90594245370453 14.620968283948493"></path>
	<path d="M 45 0L35.37903171605151 35.90594245370453"></path>
	<path d="M 50 45L14.094057546295467 35.37903171605151"></path>
	<path d="M 5 50L14.620968283948493 14.094057546295467"></path>
	</g>
	<g transform="translate(50,50)">
	<path d="M 0 5L35.90594245370453 14.620968283948493"></path>
	<path d="M 45 0L35.37903171605151 35.90594245370453"></path>
	<path d="M 50 45L14.094057546295467 35.37903171605151"></path>
	<path d="M 5 50L14.620968283948493 14.094057546295467"></path>
	</g>
	<g transform="translate(50,100)translate(50,0)scale(-1,1)">
	<path d="M 0 5L35.90594245370453 14.620968283948493"></path>
	<path d="M 45 0L35.37903171605151 35.90594245370453"></path>
	<path d="M 50 45L14.094057546295467 35.37903171605151"></path>
	<path d="M 5 50L14.620968283948493 14.094057546295467"></path>
	</g>
<rect width="100" height="150" fill="none"></rect>
</g>
</svg>
