999
"DXF R12 Output" (www.mydxf.blogspot.com)
 0 
SECTION
 2 
HEADER
 9 
$ACADVER
 1 
AC1009
 9 
$EXTMIN
 10 
 0 
 20 
 0 
 9 
$EXTMAX
 10 
 8.5 
 20 
 11 
 0 
ENDSEC
 0 
SECTION
 2 
ENTITIES
0
LINE
8
Layer 1
10
-4.486340
20
92.635600
11
-5.391430
21
92.113000
0
LINE
8
Layer 1
10
-5.391430
20
92.113000
11
-4.432870
21
90.452800
0
LINE
8
Layer 1
10
-4.432870
20
90.452800
11
-6.349990
21
90.452800
0
LINE
8
Layer 1
10
-6.349990
20
90.452800
11
-6.349990
21
89.407700
0
LINE
8
Layer 1
10
-6.349990
20
89.407700
11
-4.432870
21
89.407700
0
LINE
8
Layer 1
10
-4.432870
20
89.407700
11
-7.055550
21
84.864600
0
LINE
8
Layer 1
10
-7.055550
20
84.864600
11
-8.014110
21
86.525400
0
LINE
8
Layer 1
10
-8.014110
20
86.525400
11
-8.919210
21
86.002800
0
LINE
8
Layer 1
10
-8.919210
20
86.002800
11
-7.960090
21
84.342600
0
LINE
8
Layer 1
10
-7.960090
20
84.342600
11
-9.877770
21
84.342600
0
LINE
8
Layer 1
10
-9.877770
20
84.342600
11
-9.877770
21
83.297400
0
LINE
8
Layer 1
10
-9.877770
20
83.297400
11
-7.960090
21
83.297400
0
LINE
8
Layer 1
10
-7.960090
20
83.297400
11
-8.919210
21
81.637200
0
LINE
8
Layer 1
10
-8.919210
20
81.637200
11
-8.014110
21
81.114600
0
LINE
8
Layer 1
10
-8.014110
20
81.114600
11
-7.055550
21
82.775400
0
LINE
8
Layer 1
10
-7.055550
20
82.775400
11
-4.432870
21
78.232300
0
LINE
8
Layer 1
10
-4.432870
20
78.232300
11
-6.349990
21
78.232300
0
LINE
8
Layer 1
10
-6.349990
20
78.232300
11
-6.349990
21
77.187200
0
LINE
8
Layer 1
10
-6.349990
20
77.187200
11
-4.432870
21
77.187200
0
LINE
8
Layer 1
10
-4.432870
20
77.187200
11
-5.391430
21
75.527000
0
LINE
8
Layer 1
10
-5.391430
20
75.527000
11
-4.486340
21
75.004400
0
LINE
8
Layer 1
10
-4.486340
20
75.004400
11
-3.527770
21
76.664700
0
LINE
8
Layer 1
10
-3.527770
20
76.664700
11
-2.569210
21
75.004400
0
LINE
8
Layer 1
10
-2.569210
20
75.004400
11
-1.664120
21
75.527000
0
LINE
8
Layer 1
10
-1.664120
20
75.527000
11
-2.622680
21
77.187200
0
LINE
8
Layer 1
10
-2.622680
20
77.187200
11
2.622680
21
77.187200
0
LINE
8
Layer 1
10
2.622680
20
77.187200
11
1.664120
21
75.527000
0
LINE
8
Layer 1
10
1.664120
20
75.527000
11
2.569210
21
75.004400
0
LINE
8
Layer 1
10
2.569210
20
75.004400
11
3.527770
21
76.664700
0
LINE
8
Layer 1
10
3.527770
20
76.664700
11
4.486340
21
75.004400
0
LINE
8
Layer 1
10
4.486340
20
75.004400
11
5.391430
21
75.527000
0
LINE
8
Layer 1
10
5.391430
20
75.527000
11
4.432870
21
77.187200
0
LINE
8
Layer 1
10
4.432870
20
77.187200
11
6.349990
21
77.187200
0
LINE
8
Layer 1
10
6.349990
20
77.187200
11
6.349990
21
78.232300
0
LINE
8
Layer 1
10
6.349990
20
78.232300
11
4.432870
21
78.232300
0
LINE
8
Layer 1
10
4.432870
20
78.232300
11
7.055550
21
82.775400
0
LINE
8
Layer 1
10
7.055550
20
82.775400
11
8.014110
21
81.114600
0
LINE
8
Layer 1
10
8.014110
20
81.114600
11
8.919210
21
81.637200
0
LINE
8
Layer 1
10
8.919210
20
81.637200
11
7.960090
21
83.297400
0
LINE
8
Layer 1
10
7.960090
20
83.297400
11
9.877770
21
83.297400
0
LINE
8
Layer 1
10
9.877770
20
83.297400
11
9.877770
21
84.342600
0
LINE
8
Layer 1
10
9.877770
20
84.342600
11
7.960090
21
84.342600
0
LINE
8
Layer 1
10
7.960090
20
84.342600
11
8.919210
21
86.002800
0
LINE
8
Layer 1
10
8.919210
20
86.002800
11
8.014110
21
86.525400
0
LINE
8
Layer 1
10
8.014110
20
86.525400
11
7.055550
21
84.864600
0
LINE
8
Layer 1
10
7.055550
20
84.864600
11
4.432870
21
89.407700
0
LINE
8
Layer 1
10
4.432870
20
89.407700
11
6.349990
21
89.407700
0
LINE
8
Layer 1
10
6.349990
20
89.407700
11
6.349990
21
90.452800
0
LINE
8
Layer 1
10
6.349990
20
90.452800
11
4.432870
21
90.452800
0
LINE
8
Layer 1
10
4.432870
20
90.452800
11
5.391430
21
92.113000
0
LINE
8
Layer 1
10
5.391430
20
92.113000
11
4.486340
21
92.635600
0
LINE
8
Layer 1
10
4.486340
20
92.635600
11
3.527770
21
90.975300
0
LINE
8
Layer 1
10
3.527770
20
90.975300
11
2.569210
21
92.635600
0
LINE
8
Layer 1
10
2.569210
20
92.635600
11
1.664120
21
92.113000
0
LINE
8
Layer 1
10
1.664120
20
92.113000
11
2.622680
21
90.452800
0
LINE
8
Layer 1
10
2.622680
20
90.452800
11
-2.622680
21
90.452800
0
LINE
8
Layer 1
10
-2.622680
20
90.452800
11
-1.664120
21
92.113000
0
LINE
8
Layer 1
10
-1.664120
20
92.113000
11
-2.569210
21
92.635600
0
LINE
8
Layer 1
10
-2.569210
20
92.635600
11
-3.527770
21
90.975300
0
LINE
8
Layer 1
10
-3.527770
20
90.975300
11
-4.486340
21
92.635600
0
LINE
8
Layer 1
10
-4.486340
20
92.635600
11
-4.486340
21
92.635600
0
LINE
8
Layer 1
10
-2.622680
20
89.407700
11
2.622680
21
89.407700
0
LINE
8
Layer 1
10
2.622680
20
89.407700
11
0.000000
21
84.864600
0
LINE
8
Layer 1
10
0.000000
20
84.864600
11
-2.622680
21
89.407700
0
LINE
8
Layer 1
10
-2.622680
20
89.407700
11
-2.622680
21
89.407700
0
LINE
8
Layer 1
10
3.527770
20
88.885700
11
6.150460
21
84.342600
0
LINE
8
Layer 1
10
6.150460
20
84.342600
11
0.905095
21
84.342600
0
LINE
8
Layer 1
10
0.905095
20
84.342600
11
3.527770
21
88.885700
0
LINE
8
Layer 1
10
3.527770
20
88.885700
11
3.527770
21
88.885700
0
LINE
8
Layer 1
10
-3.527770
20
88.885100
11
-0.905095
21
84.342600
0
LINE
8
Layer 1
10
-0.905095
20
84.342600
11
-6.150460
21
84.342600
0
LINE
8
Layer 1
10
-6.150460
20
84.342600
11
-3.527770
21
88.885100
0
LINE
8
Layer 1
10
-3.527770
20
88.885100
11
-3.527770
21
88.885100
0
LINE
8
Layer 1
10
-6.150460
20
83.297400
11
-0.905095
21
83.297400
0
LINE
8
Layer 1
10
-0.905095
20
83.297400
11
-3.527770
21
78.754300
0
LINE
8
Layer 1
10
-3.527770
20
78.754300
11
-6.150460
21
83.297400
0
LINE
8
Layer 1
10
-6.150460
20
83.297400
11
-6.150460
21
83.297400
0
LINE
8
Layer 1
10
0.905095
20
83.297400
11
6.150460
21
83.297400
0
LINE
8
Layer 1
10
6.150460
20
83.297400
11
3.527770
21
78.754300
0
LINE
8
Layer 1
10
3.527770
20
78.754300
11
0.905095
21
83.297400
0
LINE
8
Layer 1
10
0.905095
20
83.297400
11
0.905095
21
83.297400
0
LINE
8
Layer 1
10
0.000000
20
82.775400
11
2.622680
21
78.232300
0
LINE
8
Layer 1
10
2.622680
20
78.232300
11
-2.622680
21
78.232300
0
LINE
8
Layer 1
10
-2.622680
20
78.232300
11
0.000000
21
82.775400
0
LINE
8
Layer 1
10
0.000000
20
82.775400
11
0.000000
21
82.775400
 0 
ENDSEC
 0 
EOF