<?xml version="1.0"?>
<!DOCTYPE svg PUBLIC "-//W3C//DTD SVG 1.1//EN" "http://www.w3.org/Graphics/SVG/1.1/DTD/svg11.dtd">
<svg width="71.4mm" height="62.02177826491071mm" viewBox="0 0 71.4 62.02177826491071" xmlns="http://www.w3.org/2000/svg" version="1.1">
<g id="Sketch" transform="translate(35.700000,31.010889) scale(1,-1)">
<path id="Sketch_w0000"  d="M -7.500000000000025 -30.31088913245535 L -12.50000000000002 -21.650635094610955 L -17.500000000000025 -30.310889132455337 M 17.499999999999982 -30.310889132455365 L 12.499999999999988 -21.650635094610973 L 7.499999999999984 -30.310889132455358 M -22.500000000000018 -21.650635094610948 L -12.50000000000002 -21.650635094610955 L 12.49999999999999 -21.650635094610973 L 0.0 3.4011250173002886e-25 L 25.0 -1.7527455471796086e-14 L 12.499999999999991 -21.650635094610973 L 22.499999999999986 -21.650635094610983 M -29.999999999999996 8.660254037844407 L -25.0 1.7763568394002505e-14 L -29.999999999999996 -8.66025403784437 M -22.500000000000025 21.65063509461095 L -12.500000000000023 21.650635094610955 L -25.0 1.7763568394002505e-14 L -35.0 2.4207878943787478e-14 M -17.500000000000036 30.310889132455337 L -12.500000000000021 21.650635094610955 L 0.0 3.4011250173002886e-25 L -25.0 1.7763568394002505e-14 L -12.50000000000002 -21.650635094610955 L 0.0 0.0 L 12.50000000000002 21.650635094610955 L -12.500000000000021 21.650635094610955 L -7.500000000000025 30.31088913245534 M 17.50000000000003 30.310889132455337 L 12.50000000000002 21.650635094610955 L 7.500000000000026 30.310889132455344 M 35.0 -2.420787897604752e-14 L 25.0 -1.7291342540283885e-14 L 12.50000000000002 21.650635094610955 L 22.500000000000018 21.650635094610955 M 29.999999999999993 -8.660254037844407 L 25.0 -1.7291342540283885e-14 L 30.000000000000004 8.660254037844366 " stroke="#000000" stroke-width="0.35 px" style="stroke-width:0.35;stroke-miterlimit:4;stroke-dasharray:none;fill:none;fill-opacity:1;fill-rule: evenodd"/>
<title>b'Sketch'</title>
</g>
</svg>