<?xml version="1.0" encoding="UTF-8" standalone="no"?>
<svg
   xmlns:dc="http://purl.org/dc/elements/1.1/"
   xmlns:cc="http://creativecommons.org/ns#"
   xmlns:rdf="http://www.w3.org/1999/02/22-rdf-syntax-ns#"
   xmlns:svg="http://www.w3.org/2000/svg"
   xmlns="http://www.w3.org/2000/svg"
   xmlns:sodipodi="http://sodipodi.sourceforge.net/DTD/sodipodi-0.dtd"
   xmlns:inkscape="http://www.inkscape.org/namespaces/inkscape"
   width="173.39999999999998mm"
   height="164.82135623730952mm"
   viewBox="0 0 173.39999999999998 164.82135623730952"
   version="1.1"
   id="svg12"
   sodipodi:docname="FPside-couvercle-fleur.svg"
   inkscape:version="1.0.1 (3bc2e813f5, 2020-09-07)">
  <metadata
     id="metadata18">
    <rdf:RDF>
      <cc:Work
         rdf:about="">
        <dc:format>image/svg+xml</dc:format>
        <dc:type
           rdf:resource="http://purl.org/dc/dcmitype/StillImage" />
        <dc:title></dc:title>
      </cc:Work>
    </rdf:RDF>
  </metadata>
  <defs
     id="defs16" />
  <sodipodi:namedview
     pagecolor="#ffffff"
     bordercolor="#666666"
     borderopacity="1"
     objecttolerance="10"
     gridtolerance="10"
     guidetolerance="10"
     inkscape:pageopacity="0"
     inkscape:pageshadow="2"
     inkscape:window-width="1920"
     inkscape:window-height="1051"
     id="namedview14"
     showgrid="false"
     inkscape:zoom="1.4126406"
     inkscape:cx="327.68503"
     inkscape:cy="311.47342"
     inkscape:window-x="-9"
     inkscape:window-y="-9"
     inkscape:window-maximized="1"
     inkscape:current-layer="svg12" />
  <g
     id="Sketch003"
     transform="translate(-44.076844,-25.792506) scale(1,-1)">
    <path
       id="Sketch003_w0000"
       d="M 215.7768437972803 -27.49250616089911 L 215.7768437972803 -188.9138623982086 L 45.77684379728029 -188.91386239820864 L 45.77684379728029 -27.49250616089912 L 215.7768437972803 -27.49250616089911 "
       stroke="#000000"
       stroke-width="0.35 px"
       style="stroke-width:0.35;stroke-miterlimit:4;stroke-dasharray:none;fill:none;fill-opacity:1;fill-rule: evenodd" />
    <path
       id="Sketch003_w0001"
       d="M 75.77684379728029 -41.02804006683185 L 95.77684379728029 -41.02804006683185 L 95.77684379728029 -37.49250616089911 L 75.77684379728029 -37.49250616089911 L 75.77684379728029 -41.02804006683185 "
       stroke="#000000"
       stroke-width="0.35 px"
       style="stroke-width:0.35;stroke-miterlimit:4;stroke-dasharray:none;fill:none;fill-opacity:1;fill-rule: evenodd" />
    <path
       id="Sketch003_w0002"
       d="M 55.77684379728029 -52.49250616089911 L 55.77684379728029 -72.49250616089911 L 58.27684379728029 -72.49250616089911 L 58.27684379728029 -52.49250616089911 L 55.77684379728029 -52.49250616089911 "
       stroke="#000000"
       stroke-width="0.35 px"
       style="stroke-width:0.35;stroke-miterlimit:4;stroke-dasharray:none;fill:none;fill-opacity:1;fill-rule: evenodd" />
    <path
       id="Sketch003_w0003"
       d="M 185.7768437972803 -41.02804006683185 L 165.7768437972803 -41.02804006683185 L 165.7768437972803 -37.49250616089911 L 185.7768437972803 -37.49250616089911 L 185.7768437972803 -41.02804006683185 "
       stroke="#000000"
       stroke-width="0.35 px"
       style="stroke-width:0.35;stroke-miterlimit:4;stroke-dasharray:none;fill:none;fill-opacity:1;fill-rule: evenodd" />
    <path
       id="Sketch003_w0004"
       d="M 205.7768437972803 -52.49250616089911 L 203.2768437972803 -52.49250616089911 L 203.2768437972803 -72.49250616089911 L 205.7768437972803 -72.49250616089911 L 205.7768437972803 -52.49250616089911 "
       stroke="#000000"
       stroke-width="0.35 px"
       style="stroke-width:0.35;stroke-miterlimit:4;stroke-dasharray:none;fill:none;fill-opacity:1;fill-rule: evenodd" />
    <path
       id="Sketch003_w0005"
       d="M 205.7768437972803 -163.91386239820864 L 203.2768437972803 -163.91386239820864 L 203.2768437972803 -143.91386239820864 L 205.7768437972803 -143.91386239820864 L 205.7768437972803 -163.91386239820864 "
       stroke="#000000"
       stroke-width="0.35 px"
       style="stroke-width:0.35;stroke-miterlimit:4;stroke-dasharray:none;fill:none;fill-opacity:1;fill-rule: evenodd" />
    <path
       id="Sketch003_w0006"
       d="M 55.77684379728029 -163.91386239820864 L 58.27684379728029 -163.91386239820864 L 58.27684379728029 -143.91386239820864 L 55.77684379728029 -143.91386239820864 L 55.77684379728029 -163.91386239820864 "
       stroke="#000000"
       stroke-width="0.35 px"
       style="stroke-width:0.35;stroke-miterlimit:4;stroke-dasharray:none;fill:none;fill-opacity:1;fill-rule: evenodd" />
    <title
       id="title9">b'couvercle'</title>
  </g>
  <g
     transform="matrix(0.00746308,0,0,-0.00746308,39.327045,110.95077)"
     fill="#000000"
     stroke="none"
     id="g6"
     style="fill:none;stroke:#000000;stroke-opacity:1;stroke-width:133.99294037;stroke-miterlimit:4;stroke-dasharray:none">
    <path
       d="m 6712,9580 c -47,-19 -38,-38 66,-143 123,-123 189,-205 290,-357 137,-205 253,-461 332,-730 12,-41 28,-93 35,-115 14,-41 40,-137 76,-272 34,-128 47,-183 69,-288 12,-55 28,-125 35,-155 7,-30 16,-77 20,-105 3,-27 12,-79 20,-115 7,-36 23,-128 35,-205 11,-77 27,-176 35,-220 8,-44 24,-143 35,-220 12,-77 28,-174 35,-215 7,-41 16,-95 20,-120 67,-499 146,-744 287,-895 37,-40 68,-81 68,-91 0,-9 -29,-76 -64,-148 -35,-72 -101,-207 -146,-301 -125,-258 -293,-596 -363,-731 -187,-356 -388,-646 -579,-836 -139,-139 -153,-132 -94,45 35,106 93,306 106,367 5,19 20,87 34,150 64,278 110,604 135,960 8,120 -1,414 -19,585 -16,160 -24,636 -12,770 24,271 113,558 223,723 32,48 35,60 16,68 -12,4 -140,-32 -192,-55 -189,-83 -335,-185 -421,-294 -104,-133 -227,-358 -285,-522 -18,-50 -34,-81 -44,-83 -21,-5 -166,52 -220,86 -64,39 -134,113 -163,172 -24,50 -26,65 -26,170 1,118 11,162 66,290 25,58 120,242 179,350 19,34 117,248 124,271 4,13 11,29 15,34 4,6 20,51 35,100 15,50 33,108 40,130 7,22 18,84 25,137 12,84 11,109 -2,185 -18,98 -51,183 -70,183 -39,0 -198,-97 -322,-195 -324,-256 -637,-654 -746,-950 -29,-77 -34,-88 -47,-92 -16,-6 -119,86 -187,167 -116,139 -181,256 -261,470 -48,128 -111,403 -140,610 -16,116 -35,493 -32,629 1,46 -2,75 -9,78 -26,9 -187,-285 -262,-479 -75,-194 -132,-416 -168,-654 -23,-159 -16,-536 14,-679 72,-345 168,-518 364,-658 36,-26 70,-47 76,-47 5,0 15,-7 22,-15 22,-26 6,-38 -142,-104 -50,-22 -225,-82 -313,-106 -109,-31 -233,-53 -335,-60 -55,-4 -103,-12 -106,-17 -11,-18 51,-122 107,-178 66,-67 136,-103 269,-138 90,-24 113,-25 470,-31 335,-5 379,-8 408,-24 44,-24 57,-59 36,-98 -8,-17 -66,-67 -132,-116 -245,-181 -320,-256 -398,-398 -37,-67 -39,-74 -38,-162 1,-127 10,-138 115,-128 72,6 139,25 269,75 30,12 69,26 85,32 17,5 39,14 50,19 189,84 430,113 564,68 313,-106 610,-417 761,-799 12,-30 26,-66 32,-80 18,-45 49,-173 68,-288 55,-319 -2,-736 -142,-1026 -56,-117 -61,-126 -70,-126 -11,0 -10,44 1,56 6,5 14,27 20,49 5,22 21,78 36,125 137,452 47,1043 -220,1445 -62,93 -228,254 -311,302 -121,69 -182,86 -314,87 -105,1 -120,-1 -170,-25 -106,-51 -198,-153 -270,-300 -23,-46 -46,-92 -51,-101 -5,-10 -9,-27 -9,-38 0,-18 7,-20 58,-20 86,0 298,-27 356,-46 314,-99 500,-272 587,-545 21,-66 23,-93 23,-244 0,-213 -16,-285 -105,-461 -168,-334 -555,-673 -1094,-961 -144,-77 -608,-303 -621,-303 -3,0 -22,-7 -42,-16 -158,-71 -192,-85 -299,-128 -311,-122 -406,-156 -678,-246 -132,-44 -253,-85 -270,-91 -16,-6 -48,-15 -70,-20 -22,-5 -58,-16 -80,-23 -22,-7 -65,-20 -95,-29 -30,-9 -86,-25 -125,-36 -38,-11 -108,-30 -155,-42 -47,-12 -105,-27 -130,-34 -125,-35 -341,-88 -565,-140 -33,-7 -98,-23 -145,-34 -47,-11 -130,-29 -185,-41 -55,-12 -127,-28 -160,-35 C 1191,733 1125,719 905,674 785,650 637,622 595,615 542,606 531,595 443,461 355,328 252,217 146,140 25,52 31,50 314,75 c 417,36 875,126 1531,300 192,51 254,69 465,132 47,14 112,33 145,43 90,27 339,107 435,142 47,16 99,33 115,38 53,15 239,81 272,96 17,7 36,14 42,14 6,0 25,6 43,14 18,7 60,24 93,36 33,12 76,27 95,35 19,7 60,22 90,33 188,69 687,270 830,334 25,11 54,23 65,28 11,5 40,17 65,28 25,11 61,27 80,35 19,8 67,29 105,47 39,18 95,43 125,57 84,38 644,317 735,366 147,79 169,91 395,221 295,170 429,253 685,425 321,215 543,400 802,664 177,181 256,238 417,297 285,105 480,71 708,-124 88,-75 162,-160 226,-261 163,-255 207,-307 329,-388 142,-94 259,-130 428,-131 122,0 217,15 340,55 74,24 205,89 205,102 0,5 -20,31 -45,59 -74,83 -101,140 -154,323 -51,175 -84,274 -112,330 -85,167 -209,270 -444,365 -163,67 -246,83 -435,82 -232,-1 -392,-31 -755,-141 -149,-45 -224,-63 -335,-77 -63,-7 -120,-14 -127,-14 -34,0 -21,35 44,127 233,328 463,730 617,1078 15,33 31,67 35,76 5,8 21,47 36,85 15,38 34,83 41,99 8,17 18,44 23,60 20,64 62,170 71,179 11,11 35,5 170,-42 136,-48 217,-64 350,-69 127,-6 180,0 345,37 167,36 225,51 420,106 291,81 472,107 586,85 35,-7 83,-22 106,-33 71,-35 185,-163 253,-285 13,-24 29,-43 36,-43 18,0 46,68 74,175 19,78 22,106 17,210 -4,75 -13,145 -26,188 -45,153 -150,293 -276,368 -37,21 -60,42 -60,53 0,11 26,31 75,58 264,143 474,272 630,387 193,143 403,353 475,475 104,178 99,359 -13,458 -85,74 -299,149 -537,189 -87,15 -119,36 -123,83 -5,54 31,95 134,156 46,27 86,50 89,50 9,0 306,176 385,228 162,107 318,233 474,382 170,163 333,389 479,666 47,89 45,91 -123,127 -238,52 -317,61 -510,62 -219,0 -286,-13 -525,-99 -171,-62 -360,-198 -629,-454 -166,-158 -241,-215 -366,-277 -41,-20 -89,-44 -105,-52 -45,-23 -70,-14 -68,22 32,452 19,648 -55,816 -17,38 -47,68 -57,57 -2,-2 -8,-48 -14,-103 -11,-102 -33,-202 -69,-310 -19,-58 -25,-74 -61,-159 -19,-46 -223,-454 -271,-541 -18,-33 -106,-186 -195,-340 -89,-154 -180,-311 -201,-350 -21,-38 -51,-92 -67,-120 -68,-115 -168,-316 -197,-395 -17,-47 -37,-92 -44,-100 -8,-8 -16,-22 -19,-30 -16,-44 0,210 28,445 8,66 17,145 20,175 3,30 12,109 20,175 77,643 98,1111 61,1370 -9,66 -19,127 -22,136 -5,18 -68,48 -164,77 -100,31 -129,36 -135,20 -2,-7 -9,-141 -14,-298 -21,-597 -93,-1243 -196,-1765 -7,-38 -23,-122 -35,-185 -20,-111 -28,-150 -69,-330 -10,-47 -27,-121 -36,-165 -10,-44 -32,-132 -48,-195 -16,-63 -33,-133 -39,-155 -5,-22 -15,-58 -22,-80 -8,-22 -24,-76 -36,-120 -12,-44 -28,-96 -35,-115 -7,-19 -23,-66 -35,-105 -19,-61 -40,-120 -82,-227 -6,-16 -16,-28 -23,-28 -13,0 -100,168 -130,250 -82,229 -113,362 -160,695 -8,61 -24,171 -34,245 -11,74 -27,189 -35,255 -9,66 -23,172 -32,235 -9,63 -20,144 -24,180 -23,182 -112,641 -155,790 -7,25 -16,61 -20,80 -10,48 -49,182 -75,255 -11,33 -25,74 -31,92 -39,127 -194,423 -315,603 -94,140 -97,143 -219,195 -60,25 -119,50 -130,55 -72,33 -162,52 -193,40 z"
       id="path4"
       style="fill:none;stroke:#000000;stroke-opacity:1;stroke-width:133.99294037;stroke-miterlimit:4;stroke-dasharray:none" />
  </g>
</svg>
