<?xml version="1.0" encoding="UTF-8" standalone="no"?>
<svg
   xmlns:dc="http://purl.org/dc/elements/1.1/"
   xmlns:cc="http://creativecommons.org/ns#"
   xmlns:rdf="http://www.w3.org/1999/02/22-rdf-syntax-ns#"
   xmlns:svg="http://www.w3.org/2000/svg"
   xmlns="http://www.w3.org/2000/svg"
   xmlns:sodipodi="http://sodipodi.sourceforge.net/DTD/sodipodi-0.dtd"
   xmlns:inkscape="http://www.inkscape.org/namespaces/inkscape"
   width="165.2737mm"
   height="100.55064mm"
   viewBox="0 0 165.2737 100.55064"
   version="1.1"
   id="svg8"
   inkscape:version="1.0.2 (e86c8708, 2021-01-15)"
   sodipodi:docname="Goutte.svg">
  <defs
     id="defs2" />
  <sodipodi:namedview
     id="base"
     pagecolor="#ffffff"
     bordercolor="#666666"
     borderopacity="1.0"
     inkscape:pageopacity="0.0"
     inkscape:pageshadow="2"
     inkscape:zoom="0.84425158"
     inkscape:cx="307.22333"
     inkscape:cy="240.29018"
     inkscape:document-units="mm"
     inkscape:current-layer="layer1"
     inkscape:document-rotation="0"
     showgrid="true"
     inkscape:window-width="1434"
     inkscape:window-height="813"
     inkscape:window-x="0"
     inkscape:window-y="23"
     inkscape:window-maximized="0"
     fit-margin-top="0"
     fit-margin-left="0"
     fit-margin-right="0"
     fit-margin-bottom="0">
    <inkscape:grid
       type="xygrid"
       id="grid833"
       units="mm"
       spacingx="1"
       spacingy="1"
       empspacing="5"
       originx="-9.8585982"
       originy="-19.581657" />
  </sodipodi:namedview>
  <metadata
     id="metadata5">
    <rdf:RDF>
      <cc:Work
         rdf:about="">
        <dc:format>image/svg+xml</dc:format>
        <dc:type
           rdf:resource="http://purl.org/dc/dcmitype/StillImage" />
        <dc:title></dc:title>
      </cc:Work>
    </rdf:RDF>
  </metadata>
  <g
     inkscape:label="Calque 1"
     inkscape:groupmode="layer"
     id="layer1"
     transform="translate(-9.858598,-19.581658)">
    <path
       style="fill:none;stroke:#ff0000;stroke-width:0.265;stroke-linecap:butt;stroke-linejoin:miter;stroke-miterlimit:4;stroke-dasharray:none;stroke-opacity:1"
       d="m 10,59.999998 h 160 v 20 H 10 Z"
       id="path847" />
    <path
       style="fill:none;stroke:#ff0000;stroke-width:0.265;stroke-linecap:butt;stroke-linejoin:miter;stroke-miterlimit:4;stroke-dasharray:none;stroke-opacity:1"
       d="m 30,59.999998 v 20"
       id="path849" />
    <path
       style="fill:none;stroke:#ff0000;stroke-width:0.265;stroke-linecap:butt;stroke-linejoin:miter;stroke-miterlimit:4;stroke-dasharray:none;stroke-opacity:1"
       d="m 50,59.999998 v 20"
       id="path851" />
    <path
       style="fill:none;stroke:#ff0000;stroke-width:0.265;stroke-linecap:butt;stroke-linejoin:miter;stroke-miterlimit:4;stroke-dasharray:none;stroke-opacity:1"
       d="m 69.999999,59.999998 v 20"
       id="path853" />
    <path
       style="fill:none;stroke:#ff0000;stroke-width:0.265;stroke-linecap:butt;stroke-linejoin:miter;stroke-miterlimit:4;stroke-dasharray:none;stroke-opacity:1"
       d="m 89.999999,59.999998 v 20"
       id="path855" />
    <path
       style="fill:none;stroke:#ff0000;stroke-width:0.265;stroke-linecap:butt;stroke-linejoin:miter;stroke-miterlimit:4;stroke-dasharray:none;stroke-opacity:1"
       d="m 110,59.999998 v 20"
       id="path857" />
    <path
       style="fill:none;stroke:#ff0000;stroke-width:0.265;stroke-linecap:butt;stroke-linejoin:miter;stroke-miterlimit:4;stroke-dasharray:none;stroke-opacity:1"
       d="m 130,59.999998 v 20"
       id="path861" />
    <path
       style="fill:none;stroke:#ff0000;stroke-width:0.265;stroke-linecap:butt;stroke-linejoin:miter;stroke-miterlimit:4;stroke-dasharray:none;stroke-opacity:1"
       d="m 150,59.999998 v 20"
       id="path863" />
    <path
       style="fill:none;stroke:#000000;stroke-width:0.282804px;stroke-linecap:butt;stroke-linejoin:miter;stroke-opacity:1"
       d="M 169.99242,80.005052 160.00758,97.16818"
       id="path869" />
    <path
       style="fill:none;stroke:#ff0000;stroke-width:0.282804px;stroke-linecap:butt;stroke-linejoin:miter;stroke-opacity:1"
       d="M 169.99242,80.005052 160.00758,97.16818 150,80 v 20 H 130 V 80"
       id="path869-6" />
    <path
       style="fill:none;stroke:#000000;stroke-width:0.282804px;stroke-linecap:butt;stroke-linejoin:miter;stroke-opacity:1"
       d="m 130,80 -9.98484,17.163128"
       id="path869-9" />
    <path
       style="fill:none;stroke:#ff0000;stroke-width:0.282804px;stroke-linecap:butt;stroke-linejoin:miter;stroke-opacity:1"
       d="M 130,80 120.01516,97.163128 110,80 v 20 H 90 V 80"
       id="path869-9-4" />
    <path
       style="fill:none;stroke:#ff0000;stroke-width:0.282804px;stroke-linecap:butt;stroke-linejoin:miter;stroke-opacity:1"
       d="M 90,80 80.01516,97.16313 70,80 v 20 H 50 V 80"
       id="path869-9-1" />
    <path
       style="fill:none;stroke:#ff0000;stroke-width:0.282804px;stroke-linecap:butt;stroke-linejoin:miter;stroke-opacity:1"
       d="M 50,80 40.015161,97.163131 30,80 v 20 H 10 V 80"
       id="path869-9-3" />
    <path
       style="fill:none;stroke:#ff0000;stroke-width:0.264583px;stroke-linecap:butt;stroke-linejoin:miter;stroke-opacity:1"
       d="m 10,100 v 20 h 20 v -20"
       id="path940" />
    <path
       style="fill:none;stroke:#000000;stroke-width:0.264583px;stroke-linecap:butt;stroke-linejoin:miter;stroke-opacity:1"
       d="m 30,84.999998 9.999999,12 L 50,85"
       id="path942" />
    <path
       style="fill:none;stroke:#000000;stroke-width:0.264583px;stroke-linecap:butt;stroke-linejoin:miter;stroke-opacity:1"
       d="m 79.999998,96.999998 -9.999999,-12"
       id="path944" />
    <path
       style="fill:none;stroke:#000000;stroke-width:0.264583px;stroke-linecap:butt;stroke-linejoin:miter;stroke-opacity:1"
       d="m 79.999998,96.999998 10.000001,-12"
       id="path946" />
    <path
       style="fill:none;stroke:#000000;stroke-width:0.264583px;stroke-linecap:butt;stroke-linejoin:miter;stroke-opacity:1"
       d="m 110,84.999998 10,12 L 130,85"
       id="path948" />
    <path
       style="fill:none;stroke:#000000;stroke-width:0.264583px;stroke-linecap:butt;stroke-linejoin:miter;stroke-opacity:1"
       d="m 150,84.999998 10,12 10,-12 v -5"
       id="path950" />
    <path
       style="fill:none;stroke:#ff0000;stroke-width:0.264583px;stroke-linecap:butt;stroke-linejoin:miter;stroke-opacity:1"
       d="M 170,59.999998 160,20 150,59.999998 140,20 130,59.999998 120,20 110,59.999998 100,20 89.999999,59.999998 79.999998,20 69.999999,59.999998 59.999998,20 50,59.999998 39.999999,20 30,59.999998 20,20 10,59.999998"
       id="path952" />
    <path
       style="fill:none;stroke:#000000;stroke-width:0.264583px;stroke-linecap:butt;stroke-linejoin:miter;stroke-opacity:1"
       d="M 10,59.999998 V 50 L 20,20 30,50 39.999999,20 50,50 59.999998,20 69.999999,50 79.999998,20 89.999999,50 100,20 l 10,30 10,-30 10,30 10,-30 10,30 10,-30 10,30 v 9.999998 l 5,5.000001 V 75 l -5,4.999998"
       id="path954" />
    <path
       style="fill:none;stroke:#000000;stroke-width:0.264583px;stroke-linecap:butt;stroke-linejoin:miter;stroke-opacity:1"
       d="M 150,84.999998 V 100 l -5,5 h -10 l -5,-5 V 84.999998"
       id="path964" />
    <path
       style="fill:none;stroke:#000000;stroke-width:0.264583px;stroke-linecap:butt;stroke-linejoin:miter;stroke-opacity:1"
       d="M 110,84.999998 V 100 l -5,5 H 94.999999 l -5,-5 V 84.999998"
       id="path966" />
    <path
       style="fill:none;stroke:#000000;stroke-width:0.264583px;stroke-linecap:butt;stroke-linejoin:miter;stroke-opacity:1"
       d="M 69.999999,84.999998 V 100 l -5,5 H 55 l -5,-5 V 84.999998"
       id="path968" />
    <path
       style="fill:none;stroke:#000000;stroke-width:0.264583px;stroke-linecap:butt;stroke-linejoin:miter;stroke-opacity:1"
       d="M 30,84.999998 V 120 H 10 V 59.999998"
       id="path970" />
  </g>
</svg>
