<?xml version="1.0" encoding="UTF-8" standalone="no"?>
<svg
   xmlns:dc="http://purl.org/dc/elements/1.1/"
   xmlns:cc="http://creativecommons.org/ns#"
   xmlns:rdf="http://www.w3.org/1999/02/22-rdf-syntax-ns#"
   xmlns:svg="http://www.w3.org/2000/svg"
   xmlns="http://www.w3.org/2000/svg"
   version="1.1"
   id="svg919"
   xml:space="preserve"
   width="594.07776mm"
   height="841.02222mm"
   viewBox="0 0 2245.3333 3178.6667"><metadata
     id="metadata925"><rdf:RDF><cc:Work
         rdf:about=""><dc:format>image/svg+xml</dc:format><dc:type
           rdf:resource="http://purl.org/dc/dcmitype/StillImage" /><dc:title></dc:title></cc:Work></rdf:RDF></metadata><defs
     id="defs923"><clipPath
       clipPathUnits="userSpaceOnUse"
       id="clipPath939"><path
         d="M 0,0 H 1648 V 2325 H 0 Z"
         clip-rule="evenodd"
         id="path937" /></clipPath><clipPath
       clipPathUnits="userSpaceOnUse"
       id="clipPath953"><path
         d="M 0,0 H 6865 V 9687 H 0 Z"
         clip-rule="evenodd"
         id="path951" /></clipPath><clipPath
       clipPathUnits="userSpaceOnUse"
       id="clipPath971"><path
         d="M 0,0 H 1878 V 1308 H 0 Z"
         clip-rule="evenodd"
         id="path969" /></clipPath><clipPath
       clipPathUnits="userSpaceOnUse"
       id="clipPath981"><path
         d="M 0,0 H 6865 V 9687 H 0 Z"
         clip-rule="evenodd"
         id="path979" /></clipPath></defs><g
     id="g927"
     transform="matrix(1.3333333,0,0,-1.3333333,0,3178.6667)"><g
       id="g945"
       transform="matrix(0.24,0,0,-0.24,18,2366)" /><path
       d="m 1210.3032,2306.48 v 0 c 0,3.7226 -0.732,7.4086 -2.1576,10.8478 v 0 0 0 c -1.4232,3.4392 -3.5112,6.564 -6.144,9.1963 v 0 0 0 c -2.6328,2.6321 -5.7576,4.7201 -9.1968,6.1447 v 0 0 0 c -3.4392,1.4244 -7.1256,2.1576 -10.848,2.1576 v 0 0 H 104.79216 v 0 c -1.85688,0 -3.70896,-0.1824 -5.53008,-0.5446 v 0 0 0 c -1.82112,-0.3621 -3.60216,-0.9026 -5.31768,-1.613 v 0 0 0 c -1.71552,-0.7106 -3.35688,-1.5881 -4.9008,-2.6196 v 0 0 0 c -1.54368,-1.0315 -2.98248,-2.2123 -4.29552,-3.5251 v 0 0 0 c -1.3128,-1.3131 -2.4936,-2.7519 -3.52512,-4.2955 v 0 0 0 c -1.03152,-1.544 -1.90896,-3.1853 -2.6196,-4.9008 v 0 0 0 c -0.7104,-1.7156 -1.25088,-3.4966 -1.61304,-5.3177 v 0 0 0 c -0.36216,-1.8211 -0.54456,-3.6732 -0.54456,-5.5301 v 0 0 -1020.4632 0 c 0,-3.2232 0.5496,-6.4224 1.62504,-9.4608 v 0 0 0 c 1.07544,-3.036 2.66112,-5.8704 4.68888,-8.3736 v 0 0 0 c 2.02776,-2.5056 4.46784,-4.6464 7.21512,-6.3312 v 0 0 0 c 2.74752,-1.6848 5.76192,-2.8872 8.91408,-3.5592 v 0 0 0 c 89.43288,-19.0416 179.80392,-33.3792 270.73752,-42.9528 v 0 0 0 c 90.936,-9.5736 182.3112,-14.3712 273.7488,-14.3712 v 0 0 0 c 91.4376,0 182.8128,4.7976 273.7464,14.3712 v 0 0 0 c 90.936,9.5736 181.3056,23.9112 270.7392,42.9528 v 0 0 0 c 3.1512,0.672 6.1656,1.8744 8.9136,3.5592 v 0 0 0 c 2.748,1.6848 5.1888,3.8256 7.2144,6.3312 v 0 0 0 c 2.028,2.5032 3.6144,5.3376 4.6896,8.3736 v 0 0 0 c 1.0752,3.0384 1.6248,6.2376 1.6248,9.4608 v 0 0 1020.4632"
       style="fill:none;stroke:#000000;stroke-width:0.288;stroke-linecap:round;stroke-linejoin:round;stroke-miterlimit:10;stroke-dasharray:none;stroke-opacity:1"
       id="path955" /><path
       d="m 76.56,1518.56 h 325.92 v -34.08 H 76.56 Z"
       style="fill:none;stroke:#000000;stroke-width:0.288;stroke-linecap:round;stroke-linejoin:round;stroke-miterlimit:10;stroke-dasharray:none;stroke-opacity:1"
       id="path957" /><path
       d="m 884.4,1929.44 h 325.92 v -34.08 H 884.4 Z"
       style="fill:none;stroke:#000000;stroke-width:0.288;stroke-linecap:round;stroke-linejoin:round;stroke-miterlimit:10;stroke-dasharray:none;stroke-opacity:1"
       id="path959" /><path
       d="m 76.56,1767.92 v -34.8 l 311.76,-66.24 6.96,33.36 z"
       style="fill:none;stroke:#000000;stroke-width:0.288;stroke-linecap:round;stroke-linejoin:round;stroke-miterlimit:10;stroke-dasharray:none;stroke-opacity:1"
       id="path961" /><path
       d="m 1041.36,2334.8 -148.08,-290.4 30.48,-15.36 155.76,305.76 z"
       style="fill:none;stroke:#000000;stroke-width:0.288;stroke-linecap:round;stroke-linejoin:round;stroke-miterlimit:10;stroke-dasharray:none;stroke-opacity:1"
       id="path963" /><g
       id="g965"
       transform="matrix(0.24,0,0,-0.24,18,2366)"><g
         id="g967"
         clip-path="url(#clipPath971)" /></g><g
       id="g973"
       transform="matrix(0.24,0,0,-0.24,18,2366)" /></g></svg>
