<?xml version="1.0" encoding="utf-8" standalone="no"?>
<!DOCTYPE svg PUBLIC "-//W3C//DTD SVG 1.1//EN"
  "http://www.w3.org/Graphics/SVG/1.1/DTD/svg11.dtd">
<!-- Created with matplotlib (https://matplotlib.org/) -->
<svg height="345.6pt" version="1.1" viewBox="0 0 460.8 345.6" width="460.8pt" xmlns="http://www.w3.org/2000/svg" xmlns:xlink="http://www.w3.org/1999/xlink">
 <defs>
  <style type="text/css">
*{stroke-linecap:butt;stroke-linejoin:round;}
  </style>
 </defs>
 <g id="figure_1">
  <g id="patch_1">
   <path d="M 0 345.6 
L 460.8 345.6 
L 460.8 0 
L 0 0 
z
" style="fill:#ffffff;"/>
  </g>
  <g id="axes_1">
   <g id="patch_2">
    <path d="M 57.6 307.584 
L 414.72 307.584 
L 414.72 41.472 
L 57.6 41.472 
z
" style="fill:#ffffff;"/>
   </g>
   <g id="matplotlib.axis_1">
    <g id="xtick_1">
     <g id="line2d_1">
      <defs>
       <path d="M 0 0 
L 0 3.5 
" id="m924ed383a6" style="stroke:#000000;stroke-width:0.8;"/>
      </defs>
      <g>
       <use style="stroke:#000000;stroke-width:0.8;" x="70.553388" xlink:href="#m924ed383a6" y="307.584"/>
      </g>
     </g>
     <g id="text_1">
      <!-- 0 -->
      <defs>
       <path d="M 31.78125 66.40625 
Q 24.171875 66.40625 20.328125 58.90625 
Q 16.5 51.421875 16.5 36.375 
Q 16.5 21.390625 20.328125 13.890625 
Q 24.171875 6.390625 31.78125 6.390625 
Q 39.453125 6.390625 43.28125 13.890625 
Q 47.125 21.390625 47.125 36.375 
Q 47.125 51.421875 43.28125 58.90625 
Q 39.453125 66.40625 31.78125 66.40625 
z
M 31.78125 74.21875 
Q 44.046875 74.21875 50.515625 64.515625 
Q 56.984375 54.828125 56.984375 36.375 
Q 56.984375 17.96875 50.515625 8.265625 
Q 44.046875 -1.421875 31.78125 -1.421875 
Q 19.53125 -1.421875 13.0625 8.265625 
Q 6.59375 17.96875 6.59375 36.375 
Q 6.59375 54.828125 13.0625 64.515625 
Q 19.53125 74.21875 31.78125 74.21875 
z
" id="DejaVuSans-48"/>
      </defs>
      <g transform="translate(67.372138 322.182437)scale(0.1 -0.1)">
       <use xlink:href="#DejaVuSans-48"/>
      </g>
     </g>
    </g>
    <g id="xtick_2">
     <g id="line2d_2">
      <g>
       <use style="stroke:#000000;stroke-width:0.8;" x="136.140165" xlink:href="#m924ed383a6" y="307.584"/>
      </g>
     </g>
     <g id="text_2">
      <!-- 20 -->
      <defs>
       <path d="M 19.1875 8.296875 
L 53.609375 8.296875 
L 53.609375 0 
L 7.328125 0 
L 7.328125 8.296875 
Q 12.9375 14.109375 22.625 23.890625 
Q 32.328125 33.6875 34.8125 36.53125 
Q 39.546875 41.84375 41.421875 45.53125 
Q 43.3125 49.21875 43.3125 52.78125 
Q 43.3125 58.59375 39.234375 62.25 
Q 35.15625 65.921875 28.609375 65.921875 
Q 23.96875 65.921875 18.8125 64.3125 
Q 13.671875 62.703125 7.8125 59.421875 
L 7.8125 69.390625 
Q 13.765625 71.78125 18.9375 73 
Q 24.125 74.21875 28.421875 74.21875 
Q 39.75 74.21875 46.484375 68.546875 
Q 53.21875 62.890625 53.21875 53.421875 
Q 53.21875 48.921875 51.53125 44.890625 
Q 49.859375 40.875 45.40625 35.40625 
Q 44.1875 33.984375 37.640625 27.21875 
Q 31.109375 20.453125 19.1875 8.296875 
z
" id="DejaVuSans-50"/>
      </defs>
      <g transform="translate(129.777665 322.182437)scale(0.1 -0.1)">
       <use xlink:href="#DejaVuSans-50"/>
       <use x="63.623047" xlink:href="#DejaVuSans-48"/>
      </g>
     </g>
    </g>
    <g id="xtick_3">
     <g id="line2d_3">
      <g>
       <use style="stroke:#000000;stroke-width:0.8;" x="201.726942" xlink:href="#m924ed383a6" y="307.584"/>
      </g>
     </g>
     <g id="text_3">
      <!-- 40 -->
      <defs>
       <path d="M 37.796875 64.3125 
L 12.890625 25.390625 
L 37.796875 25.390625 
z
M 35.203125 72.90625 
L 47.609375 72.90625 
L 47.609375 25.390625 
L 58.015625 25.390625 
L 58.015625 17.1875 
L 47.609375 17.1875 
L 47.609375 0 
L 37.796875 0 
L 37.796875 17.1875 
L 4.890625 17.1875 
L 4.890625 26.703125 
z
" id="DejaVuSans-52"/>
      </defs>
      <g transform="translate(195.364442 322.182437)scale(0.1 -0.1)">
       <use xlink:href="#DejaVuSans-52"/>
       <use x="63.623047" xlink:href="#DejaVuSans-48"/>
      </g>
     </g>
    </g>
    <g id="xtick_4">
     <g id="line2d_4">
      <g>
       <use style="stroke:#000000;stroke-width:0.8;" x="267.313719" xlink:href="#m924ed383a6" y="307.584"/>
      </g>
     </g>
     <g id="text_4">
      <!-- 60 -->
      <defs>
       <path d="M 33.015625 40.375 
Q 26.375 40.375 22.484375 35.828125 
Q 18.609375 31.296875 18.609375 23.390625 
Q 18.609375 15.53125 22.484375 10.953125 
Q 26.375 6.390625 33.015625 6.390625 
Q 39.65625 6.390625 43.53125 10.953125 
Q 47.40625 15.53125 47.40625 23.390625 
Q 47.40625 31.296875 43.53125 35.828125 
Q 39.65625 40.375 33.015625 40.375 
z
M 52.59375 71.296875 
L 52.59375 62.3125 
Q 48.875 64.0625 45.09375 64.984375 
Q 41.3125 65.921875 37.59375 65.921875 
Q 27.828125 65.921875 22.671875 59.328125 
Q 17.53125 52.734375 16.796875 39.40625 
Q 19.671875 43.65625 24.015625 45.921875 
Q 28.375 48.1875 33.59375 48.1875 
Q 44.578125 48.1875 50.953125 41.515625 
Q 57.328125 34.859375 57.328125 23.390625 
Q 57.328125 12.15625 50.6875 5.359375 
Q 44.046875 -1.421875 33.015625 -1.421875 
Q 20.359375 -1.421875 13.671875 8.265625 
Q 6.984375 17.96875 6.984375 36.375 
Q 6.984375 53.65625 15.1875 63.9375 
Q 23.390625 74.21875 37.203125 74.21875 
Q 40.921875 74.21875 44.703125 73.484375 
Q 48.484375 72.75 52.59375 71.296875 
z
" id="DejaVuSans-54"/>
      </defs>
      <g transform="translate(260.951219 322.182437)scale(0.1 -0.1)">
       <use xlink:href="#DejaVuSans-54"/>
       <use x="63.623047" xlink:href="#DejaVuSans-48"/>
      </g>
     </g>
    </g>
    <g id="xtick_5">
     <g id="line2d_5">
      <g>
       <use style="stroke:#000000;stroke-width:0.8;" x="332.900496" xlink:href="#m924ed383a6" y="307.584"/>
      </g>
     </g>
     <g id="text_5">
      <!-- 80 -->
      <defs>
       <path d="M 31.78125 34.625 
Q 24.75 34.625 20.71875 30.859375 
Q 16.703125 27.09375 16.703125 20.515625 
Q 16.703125 13.921875 20.71875 10.15625 
Q 24.75 6.390625 31.78125 6.390625 
Q 38.8125 6.390625 42.859375 10.171875 
Q 46.921875 13.96875 46.921875 20.515625 
Q 46.921875 27.09375 42.890625 30.859375 
Q 38.875 34.625 31.78125 34.625 
z
M 21.921875 38.8125 
Q 15.578125 40.375 12.03125 44.71875 
Q 8.5 49.078125 8.5 55.328125 
Q 8.5 64.0625 14.71875 69.140625 
Q 20.953125 74.21875 31.78125 74.21875 
Q 42.671875 74.21875 48.875 69.140625 
Q 55.078125 64.0625 55.078125 55.328125 
Q 55.078125 49.078125 51.53125 44.71875 
Q 48 40.375 41.703125 38.8125 
Q 48.828125 37.15625 52.796875 32.3125 
Q 56.78125 27.484375 56.78125 20.515625 
Q 56.78125 9.90625 50.3125 4.234375 
Q 43.84375 -1.421875 31.78125 -1.421875 
Q 19.734375 -1.421875 13.25 4.234375 
Q 6.78125 9.90625 6.78125 20.515625 
Q 6.78125 27.484375 10.78125 32.3125 
Q 14.796875 37.15625 21.921875 38.8125 
z
M 18.3125 54.390625 
Q 18.3125 48.734375 21.84375 45.5625 
Q 25.390625 42.390625 31.78125 42.390625 
Q 38.140625 42.390625 41.71875 45.5625 
Q 45.3125 48.734375 45.3125 54.390625 
Q 45.3125 60.0625 41.71875 63.234375 
Q 38.140625 66.40625 31.78125 66.40625 
Q 25.390625 66.40625 21.84375 63.234375 
Q 18.3125 60.0625 18.3125 54.390625 
z
" id="DejaVuSans-56"/>
      </defs>
      <g transform="translate(326.537996 322.182437)scale(0.1 -0.1)">
       <use xlink:href="#DejaVuSans-56"/>
       <use x="63.623047" xlink:href="#DejaVuSans-48"/>
      </g>
     </g>
    </g>
    <g id="xtick_6">
     <g id="line2d_6">
      <g>
       <use style="stroke:#000000;stroke-width:0.8;" x="398.487273" xlink:href="#m924ed383a6" y="307.584"/>
      </g>
     </g>
     <g id="text_6">
      <!-- 100 -->
      <defs>
       <path d="M 12.40625 8.296875 
L 28.515625 8.296875 
L 28.515625 63.921875 
L 10.984375 60.40625 
L 10.984375 69.390625 
L 28.421875 72.90625 
L 38.28125 72.90625 
L 38.28125 8.296875 
L 54.390625 8.296875 
L 54.390625 0 
L 12.40625 0 
z
" id="DejaVuSans-49"/>
      </defs>
      <g transform="translate(388.943523 322.182437)scale(0.1 -0.1)">
       <use xlink:href="#DejaVuSans-49"/>
       <use x="63.623047" xlink:href="#DejaVuSans-48"/>
       <use x="127.246094" xlink:href="#DejaVuSans-48"/>
      </g>
     </g>
    </g>
    <g id="text_7">
     <!-- Interation -->
     <defs>
      <path d="M 9.8125 72.90625 
L 19.671875 72.90625 
L 19.671875 0 
L 9.8125 0 
z
" id="DejaVuSans-73"/>
      <path d="M 54.890625 33.015625 
L 54.890625 0 
L 45.90625 0 
L 45.90625 32.71875 
Q 45.90625 40.484375 42.875 44.328125 
Q 39.84375 48.1875 33.796875 48.1875 
Q 26.515625 48.1875 22.3125 43.546875 
Q 18.109375 38.921875 18.109375 30.90625 
L 18.109375 0 
L 9.078125 0 
L 9.078125 54.6875 
L 18.109375 54.6875 
L 18.109375 46.1875 
Q 21.34375 51.125 25.703125 53.5625 
Q 30.078125 56 35.796875 56 
Q 45.21875 56 50.046875 50.171875 
Q 54.890625 44.34375 54.890625 33.015625 
z
" id="DejaVuSans-110"/>
      <path d="M 18.3125 70.21875 
L 18.3125 54.6875 
L 36.8125 54.6875 
L 36.8125 47.703125 
L 18.3125 47.703125 
L 18.3125 18.015625 
Q 18.3125 11.328125 20.140625 9.421875 
Q 21.96875 7.515625 27.59375 7.515625 
L 36.8125 7.515625 
L 36.8125 0 
L 27.59375 0 
Q 17.1875 0 13.234375 3.875 
Q 9.28125 7.765625 9.28125 18.015625 
L 9.28125 47.703125 
L 2.6875 47.703125 
L 2.6875 54.6875 
L 9.28125 54.6875 
L 9.28125 70.21875 
z
" id="DejaVuSans-116"/>
      <path d="M 56.203125 29.59375 
L 56.203125 25.203125 
L 14.890625 25.203125 
Q 15.484375 15.921875 20.484375 11.0625 
Q 25.484375 6.203125 34.421875 6.203125 
Q 39.59375 6.203125 44.453125 7.46875 
Q 49.3125 8.734375 54.109375 11.28125 
L 54.109375 2.78125 
Q 49.265625 0.734375 44.1875 -0.34375 
Q 39.109375 -1.421875 33.890625 -1.421875 
Q 20.796875 -1.421875 13.15625 6.1875 
Q 5.515625 13.8125 5.515625 26.8125 
Q 5.515625 40.234375 12.765625 48.109375 
Q 20.015625 56 32.328125 56 
Q 43.359375 56 49.78125 48.890625 
Q 56.203125 41.796875 56.203125 29.59375 
z
M 47.21875 32.234375 
Q 47.125 39.59375 43.09375 43.984375 
Q 39.0625 48.390625 32.421875 48.390625 
Q 24.90625 48.390625 20.390625 44.140625 
Q 15.875 39.890625 15.1875 32.171875 
z
" id="DejaVuSans-101"/>
      <path d="M 41.109375 46.296875 
Q 39.59375 47.171875 37.8125 47.578125 
Q 36.03125 48 33.890625 48 
Q 26.265625 48 22.1875 43.046875 
Q 18.109375 38.09375 18.109375 28.8125 
L 18.109375 0 
L 9.078125 0 
L 9.078125 54.6875 
L 18.109375 54.6875 
L 18.109375 46.1875 
Q 20.953125 51.171875 25.484375 53.578125 
Q 30.03125 56 36.53125 56 
Q 37.453125 56 38.578125 55.875 
Q 39.703125 55.765625 41.0625 55.515625 
z
" id="DejaVuSans-114"/>
      <path d="M 34.28125 27.484375 
Q 23.390625 27.484375 19.1875 25 
Q 14.984375 22.515625 14.984375 16.5 
Q 14.984375 11.71875 18.140625 8.90625 
Q 21.296875 6.109375 26.703125 6.109375 
Q 34.1875 6.109375 38.703125 11.40625 
Q 43.21875 16.703125 43.21875 25.484375 
L 43.21875 27.484375 
z
M 52.203125 31.203125 
L 52.203125 0 
L 43.21875 0 
L 43.21875 8.296875 
Q 40.140625 3.328125 35.546875 0.953125 
Q 30.953125 -1.421875 24.3125 -1.421875 
Q 15.921875 -1.421875 10.953125 3.296875 
Q 6 8.015625 6 15.921875 
Q 6 25.140625 12.171875 29.828125 
Q 18.359375 34.515625 30.609375 34.515625 
L 43.21875 34.515625 
L 43.21875 35.40625 
Q 43.21875 41.609375 39.140625 45 
Q 35.0625 48.390625 27.6875 48.390625 
Q 23 48.390625 18.546875 47.265625 
Q 14.109375 46.140625 10.015625 43.890625 
L 10.015625 52.203125 
Q 14.9375 54.109375 19.578125 55.046875 
Q 24.21875 56 28.609375 56 
Q 40.484375 56 46.34375 49.84375 
Q 52.203125 43.703125 52.203125 31.203125 
z
" id="DejaVuSans-97"/>
      <path d="M 9.421875 54.6875 
L 18.40625 54.6875 
L 18.40625 0 
L 9.421875 0 
z
M 9.421875 75.984375 
L 18.40625 75.984375 
L 18.40625 64.59375 
L 9.421875 64.59375 
z
" id="DejaVuSans-105"/>
      <path d="M 30.609375 48.390625 
Q 23.390625 48.390625 19.1875 42.75 
Q 14.984375 37.109375 14.984375 27.296875 
Q 14.984375 17.484375 19.15625 11.84375 
Q 23.34375 6.203125 30.609375 6.203125 
Q 37.796875 6.203125 41.984375 11.859375 
Q 46.1875 17.53125 46.1875 27.296875 
Q 46.1875 37.015625 41.984375 42.703125 
Q 37.796875 48.390625 30.609375 48.390625 
z
M 30.609375 56 
Q 42.328125 56 49.015625 48.375 
Q 55.71875 40.765625 55.71875 27.296875 
Q 55.71875 13.875 49.015625 6.21875 
Q 42.328125 -1.421875 30.609375 -1.421875 
Q 18.84375 -1.421875 12.171875 6.21875 
Q 5.515625 13.875 5.515625 27.296875 
Q 5.515625 40.765625 12.171875 48.375 
Q 18.84375 56 30.609375 56 
z
" id="DejaVuSans-111"/>
     </defs>
     <g transform="translate(211.782656 335.860562)scale(0.1 -0.1)">
      <use xlink:href="#DejaVuSans-73"/>
      <use x="29.492188" xlink:href="#DejaVuSans-110"/>
      <use x="92.871094" xlink:href="#DejaVuSans-116"/>
      <use x="132.080078" xlink:href="#DejaVuSans-101"/>
      <use x="193.603516" xlink:href="#DejaVuSans-114"/>
      <use x="234.716797" xlink:href="#DejaVuSans-97"/>
      <use x="295.996094" xlink:href="#DejaVuSans-116"/>
      <use x="335.205078" xlink:href="#DejaVuSans-105"/>
      <use x="362.988281" xlink:href="#DejaVuSans-111"/>
      <use x="424.169922" xlink:href="#DejaVuSans-110"/>
     </g>
    </g>
   </g>
   <g id="matplotlib.axis_2">
    <g id="ytick_1">
     <g id="line2d_7">
      <defs>
       <path d="M 0 0 
L -3.5 0 
" id="m1fdfa28a3a" style="stroke:#000000;stroke-width:0.8;"/>
      </defs>
      <g>
       <use style="stroke:#000000;stroke-width:0.8;" x="57.6" xlink:href="#m1fdfa28a3a" y="271.015784"/>
      </g>
     </g>
     <g id="text_8">
      <!-- 200 -->
      <g transform="translate(31.5125 274.815003)scale(0.1 -0.1)">
       <use xlink:href="#DejaVuSans-50"/>
       <use x="63.623047" xlink:href="#DejaVuSans-48"/>
       <use x="127.246094" xlink:href="#DejaVuSans-48"/>
      </g>
     </g>
    </g>
    <g id="ytick_2">
     <g id="line2d_8">
      <g>
       <use style="stroke:#000000;stroke-width:0.8;" x="57.6" xlink:href="#m1fdfa28a3a" y="233.653622"/>
      </g>
     </g>
     <g id="text_9">
      <!-- 400 -->
      <g transform="translate(31.5125 237.45284)scale(0.1 -0.1)">
       <use xlink:href="#DejaVuSans-52"/>
       <use x="63.623047" xlink:href="#DejaVuSans-48"/>
       <use x="127.246094" xlink:href="#DejaVuSans-48"/>
      </g>
     </g>
    </g>
    <g id="ytick_3">
     <g id="line2d_9">
      <g>
       <use style="stroke:#000000;stroke-width:0.8;" x="57.6" xlink:href="#m1fdfa28a3a" y="196.291459"/>
      </g>
     </g>
     <g id="text_10">
      <!-- 600 -->
      <g transform="translate(31.5125 200.090678)scale(0.1 -0.1)">
       <use xlink:href="#DejaVuSans-54"/>
       <use x="63.623047" xlink:href="#DejaVuSans-48"/>
       <use x="127.246094" xlink:href="#DejaVuSans-48"/>
      </g>
     </g>
    </g>
    <g id="ytick_4">
     <g id="line2d_10">
      <g>
       <use style="stroke:#000000;stroke-width:0.8;" x="57.6" xlink:href="#m1fdfa28a3a" y="158.929297"/>
      </g>
     </g>
     <g id="text_11">
      <!-- 800 -->
      <g transform="translate(31.5125 162.728516)scale(0.1 -0.1)">
       <use xlink:href="#DejaVuSans-56"/>
       <use x="63.623047" xlink:href="#DejaVuSans-48"/>
       <use x="127.246094" xlink:href="#DejaVuSans-48"/>
      </g>
     </g>
    </g>
    <g id="ytick_5">
     <g id="line2d_11">
      <g>
       <use style="stroke:#000000;stroke-width:0.8;" x="57.6" xlink:href="#m1fdfa28a3a" y="121.567135"/>
      </g>
     </g>
     <g id="text_12">
      <!-- 1000 -->
      <g transform="translate(25.15 125.366354)scale(0.1 -0.1)">
       <use xlink:href="#DejaVuSans-49"/>
       <use x="63.623047" xlink:href="#DejaVuSans-48"/>
       <use x="127.246094" xlink:href="#DejaVuSans-48"/>
       <use x="190.869141" xlink:href="#DejaVuSans-48"/>
      </g>
     </g>
    </g>
    <g id="ytick_6">
     <g id="line2d_12">
      <g>
       <use style="stroke:#000000;stroke-width:0.8;" x="57.6" xlink:href="#m1fdfa28a3a" y="84.204973"/>
      </g>
     </g>
     <g id="text_13">
      <!-- 1200 -->
      <g transform="translate(25.15 88.004192)scale(0.1 -0.1)">
       <use xlink:href="#DejaVuSans-49"/>
       <use x="63.623047" xlink:href="#DejaVuSans-50"/>
       <use x="127.246094" xlink:href="#DejaVuSans-48"/>
       <use x="190.869141" xlink:href="#DejaVuSans-48"/>
      </g>
     </g>
    </g>
    <g id="ytick_7">
     <g id="line2d_13">
      <g>
       <use style="stroke:#000000;stroke-width:0.8;" x="57.6" xlink:href="#m1fdfa28a3a" y="46.842811"/>
      </g>
     </g>
     <g id="text_14">
      <!-- 1400 -->
      <g transform="translate(25.15 50.64203)scale(0.1 -0.1)">
       <use xlink:href="#DejaVuSans-49"/>
       <use x="63.623047" xlink:href="#DejaVuSans-52"/>
       <use x="127.246094" xlink:href="#DejaVuSans-48"/>
       <use x="190.869141" xlink:href="#DejaVuSans-48"/>
      </g>
     </g>
    </g>
    <g id="text_15">
     <!-- Sort time in microseconds -->
     <defs>
      <path d="M 53.515625 70.515625 
L 53.515625 60.890625 
Q 47.90625 63.578125 42.921875 64.890625 
Q 37.9375 66.21875 33.296875 66.21875 
Q 25.25 66.21875 20.875 63.09375 
Q 16.5 59.96875 16.5 54.203125 
Q 16.5 49.359375 19.40625 46.890625 
Q 22.3125 44.4375 30.421875 42.921875 
L 36.375 41.703125 
Q 47.40625 39.59375 52.65625 34.296875 
Q 57.90625 29 57.90625 20.125 
Q 57.90625 9.515625 50.796875 4.046875 
Q 43.703125 -1.421875 29.984375 -1.421875 
Q 24.8125 -1.421875 18.96875 -0.25 
Q 13.140625 0.921875 6.890625 3.21875 
L 6.890625 13.375 
Q 12.890625 10.015625 18.65625 8.296875 
Q 24.421875 6.59375 29.984375 6.59375 
Q 38.421875 6.59375 43.015625 9.90625 
Q 47.609375 13.234375 47.609375 19.390625 
Q 47.609375 24.75 44.3125 27.78125 
Q 41.015625 30.8125 33.5 32.328125 
L 27.484375 33.5 
Q 16.453125 35.6875 11.515625 40.375 
Q 6.59375 45.0625 6.59375 53.421875 
Q 6.59375 63.09375 13.40625 68.65625 
Q 20.21875 74.21875 32.171875 74.21875 
Q 37.3125 74.21875 42.625 73.28125 
Q 47.953125 72.359375 53.515625 70.515625 
z
" id="DejaVuSans-83"/>
      <path id="DejaVuSans-32"/>
      <path d="M 52 44.1875 
Q 55.375 50.25 60.0625 53.125 
Q 64.75 56 71.09375 56 
Q 79.640625 56 84.28125 50.015625 
Q 88.921875 44.046875 88.921875 33.015625 
L 88.921875 0 
L 79.890625 0 
L 79.890625 32.71875 
Q 79.890625 40.578125 77.09375 44.375 
Q 74.3125 48.1875 68.609375 48.1875 
Q 61.625 48.1875 57.5625 43.546875 
Q 53.515625 38.921875 53.515625 30.90625 
L 53.515625 0 
L 44.484375 0 
L 44.484375 32.71875 
Q 44.484375 40.625 41.703125 44.40625 
Q 38.921875 48.1875 33.109375 48.1875 
Q 26.21875 48.1875 22.15625 43.53125 
Q 18.109375 38.875 18.109375 30.90625 
L 18.109375 0 
L 9.078125 0 
L 9.078125 54.6875 
L 18.109375 54.6875 
L 18.109375 46.1875 
Q 21.1875 51.21875 25.484375 53.609375 
Q 29.78125 56 35.6875 56 
Q 41.65625 56 45.828125 52.96875 
Q 50 49.953125 52 44.1875 
z
" id="DejaVuSans-109"/>
      <path d="M 48.78125 52.59375 
L 48.78125 44.1875 
Q 44.96875 46.296875 41.140625 47.34375 
Q 37.3125 48.390625 33.40625 48.390625 
Q 24.65625 48.390625 19.8125 42.84375 
Q 14.984375 37.3125 14.984375 27.296875 
Q 14.984375 17.28125 19.8125 11.734375 
Q 24.65625 6.203125 33.40625 6.203125 
Q 37.3125 6.203125 41.140625 7.25 
Q 44.96875 8.296875 48.78125 10.40625 
L 48.78125 2.09375 
Q 45.015625 0.34375 40.984375 -0.53125 
Q 36.96875 -1.421875 32.421875 -1.421875 
Q 20.0625 -1.421875 12.78125 6.34375 
Q 5.515625 14.109375 5.515625 27.296875 
Q 5.515625 40.671875 12.859375 48.328125 
Q 20.21875 56 33.015625 56 
Q 37.15625 56 41.109375 55.140625 
Q 45.0625 54.296875 48.78125 52.59375 
z
" id="DejaVuSans-99"/>
      <path d="M 44.28125 53.078125 
L 44.28125 44.578125 
Q 40.484375 46.53125 36.375 47.5 
Q 32.28125 48.484375 27.875 48.484375 
Q 21.1875 48.484375 17.84375 46.4375 
Q 14.5 44.390625 14.5 40.28125 
Q 14.5 37.15625 16.890625 35.375 
Q 19.28125 33.59375 26.515625 31.984375 
L 29.59375 31.296875 
Q 39.15625 29.25 43.1875 25.515625 
Q 47.21875 21.78125 47.21875 15.09375 
Q 47.21875 7.46875 41.1875 3.015625 
Q 35.15625 -1.421875 24.609375 -1.421875 
Q 20.21875 -1.421875 15.453125 -0.5625 
Q 10.6875 0.296875 5.421875 2 
L 5.421875 11.28125 
Q 10.40625 8.6875 15.234375 7.390625 
Q 20.0625 6.109375 24.8125 6.109375 
Q 31.15625 6.109375 34.5625 8.28125 
Q 37.984375 10.453125 37.984375 14.40625 
Q 37.984375 18.0625 35.515625 20.015625 
Q 33.0625 21.96875 24.703125 23.78125 
L 21.578125 24.515625 
Q 13.234375 26.265625 9.515625 29.90625 
Q 5.8125 33.546875 5.8125 39.890625 
Q 5.8125 47.609375 11.28125 51.796875 
Q 16.75 56 26.8125 56 
Q 31.78125 56 36.171875 55.265625 
Q 40.578125 54.546875 44.28125 53.078125 
z
" id="DejaVuSans-115"/>
      <path d="M 45.40625 46.390625 
L 45.40625 75.984375 
L 54.390625 75.984375 
L 54.390625 0 
L 45.40625 0 
L 45.40625 8.203125 
Q 42.578125 3.328125 38.25 0.953125 
Q 33.9375 -1.421875 27.875 -1.421875 
Q 17.96875 -1.421875 11.734375 6.484375 
Q 5.515625 14.40625 5.515625 27.296875 
Q 5.515625 40.1875 11.734375 48.09375 
Q 17.96875 56 27.875 56 
Q 33.9375 56 38.25 53.625 
Q 42.578125 51.265625 45.40625 46.390625 
z
M 14.796875 27.296875 
Q 14.796875 17.390625 18.875 11.75 
Q 22.953125 6.109375 30.078125 6.109375 
Q 37.203125 6.109375 41.296875 11.75 
Q 45.40625 17.390625 45.40625 27.296875 
Q 45.40625 37.203125 41.296875 42.84375 
Q 37.203125 48.484375 30.078125 48.484375 
Q 22.953125 48.484375 18.875 42.84375 
Q 14.796875 37.203125 14.796875 27.296875 
z
" id="DejaVuSans-100"/>
     </defs>
     <g transform="translate(19.070312 239.957687)rotate(-90)scale(0.1 -0.1)">
      <use xlink:href="#DejaVuSans-83"/>
      <use x="63.476562" xlink:href="#DejaVuSans-111"/>
      <use x="124.658203" xlink:href="#DejaVuSans-114"/>
      <use x="165.771484" xlink:href="#DejaVuSans-116"/>
      <use x="204.980469" xlink:href="#DejaVuSans-32"/>
      <use x="236.767578" xlink:href="#DejaVuSans-116"/>
      <use x="275.976562" xlink:href="#DejaVuSans-105"/>
      <use x="303.759766" xlink:href="#DejaVuSans-109"/>
      <use x="401.171875" xlink:href="#DejaVuSans-101"/>
      <use x="462.695312" xlink:href="#DejaVuSans-32"/>
      <use x="494.482422" xlink:href="#DejaVuSans-105"/>
      <use x="522.265625" xlink:href="#DejaVuSans-110"/>
      <use x="585.644531" xlink:href="#DejaVuSans-32"/>
      <use x="617.431641" xlink:href="#DejaVuSans-109"/>
      <use x="714.84375" xlink:href="#DejaVuSans-105"/>
      <use x="742.626953" xlink:href="#DejaVuSans-99"/>
      <use x="797.607422" xlink:href="#DejaVuSans-114"/>
      <use x="838.689453" xlink:href="#DejaVuSans-111"/>
      <use x="899.871094" xlink:href="#DejaVuSans-115"/>
      <use x="951.970703" xlink:href="#DejaVuSans-101"/>
      <use x="1013.494141" xlink:href="#DejaVuSans-99"/>
      <use x="1068.474609" xlink:href="#DejaVuSans-111"/>
      <use x="1129.65625" xlink:href="#DejaVuSans-110"/>
      <use x="1193.035156" xlink:href="#DejaVuSans-100"/>
      <use x="1256.511719" xlink:href="#DejaVuSans-115"/>
     </g>
    </g>
   </g>
   <g id="line2d_14">
    <path clip-path="url(#p03ee4995e7)" d="M 73.832727 163.973189 
L 77.112066 179.478486 
L 80.391405 281.664 
L 83.670744 276.059676 
L 86.950083 276.059676 
L 90.229421 282.784865 
L 93.50876 284.466162 
L 96.788099 285.400216 
L 100.067438 285.213405 
L 103.346777 284.839784 
L 106.626116 285.213405 
L 109.905455 284.466162 
L 113.184793 285.026595 
L 116.464132 285.400216 
L 119.743471 285.587027 
L 123.02281 285.213405 
L 126.302149 284.839784 
L 129.581488 285.026595 
L 132.860826 285.213405 
L 136.140165 285.960649 
L 139.419504 285.773838 
L 142.698843 285.773838 
L 145.978182 283.718919 
L 149.257521 285.213405 
L 152.53686 285.587027 
L 155.816198 285.400216 
L 159.095537 284.839784 
L 162.374876 286.147459 
L 165.654215 285.587027 
L 168.933554 285.213405 
L 172.212893 285.960649 
L 175.492231 285.587027 
L 178.77157 284.279351 
L 182.050909 285.213405 
L 185.330248 284.466162 
L 188.609587 284.466162 
L 191.888926 285.773838 
L 195.168264 285.773838 
L 198.447603 282.411243 
L 201.726942 284.652973 
L 205.006281 285.773838 
L 208.28562 284.279351 
L 211.564959 285.960649 
L 214.844298 285.587027 
L 218.123636 285.587027 
L 221.402975 285.960649 
L 224.682314 284.466162 
L 227.961653 285.213405 
L 231.240992 284.652973 
L 234.520331 285.026595 
L 237.799669 281.290378 
L 241.079008 285.960649 
L 244.358347 285.400216 
L 247.637686 285.773838 
L 250.917025 285.026595 
L 254.196364 285.773838 
L 257.475702 285.587027 
L 260.755041 285.587027 
L 264.03438 285.960649 
L 267.313719 285.587027 
L 270.593058 285.587027 
L 273.872397 281.477189 
L 277.151736 284.092541 
L 280.431074 282.037622 
L 283.710413 284.652973 
L 286.989752 285.213405 
L 290.269091 285.213405 
L 293.54843 274.938811 
L 296.827769 278.488216 
L 300.107107 279.609081 
L 303.386446 279.235459 
L 306.665785 277.554162 
L 309.945124 275.125622 
L 313.224463 276.433297 
L 316.503802 262.982919 
L 319.78314 280.543135 
L 323.062479 284.092541 
L 326.341818 284.279351 
L 329.621157 284.092541 
L 332.900496 284.839784 
L 336.179835 284.466162 
L 339.459174 282.598054 
L 342.738512 279.235459 
L 346.017851 283.158486 
L 349.29719 283.532108 
L 352.576529 281.664 
L 355.855868 283.718919 
L 359.135207 284.279351 
L 362.414545 285.587027 
L 365.693884 284.279351 
L 368.973223 283.90573 
L 372.252562 281.477189 
L 375.531901 283.532108 
L 378.81124 284.839784 
L 382.090579 285.400216 
L 385.369917 282.971676 
L 388.649256 283.718919 
L 391.928595 282.224432 
L 395.207934 284.839784 
L 398.487273 282.971676 
" style="fill:none;stroke:#000080;stroke-linecap:square;stroke-width:2;"/>
    <defs>
     <path d="M 0 2.5 
C 0.663008 2.5 1.29895 2.236584 1.767767 1.767767 
C 2.236584 1.29895 2.5 0.663008 2.5 0 
C 2.5 -0.663008 2.236584 -1.29895 1.767767 -1.767767 
C 1.29895 -2.236584 0.663008 -2.5 0 -2.5 
C -0.663008 -2.5 -1.29895 -2.236584 -1.767767 -1.767767 
C -2.236584 -1.29895 -2.5 -0.663008 -2.5 0 
C -2.5 0.663008 -2.236584 1.29895 -1.767767 1.767767 
C -1.29895 2.236584 -0.663008 2.5 0 2.5 
z
" id="m5e64f44ee0" style="stroke:#000080;"/>
    </defs>
    <g clip-path="url(#p03ee4995e7)">
     <use style="fill:#000080;stroke:#000080;" x="73.832727" xlink:href="#m5e64f44ee0" y="163.973189"/>
     <use style="fill:#000080;stroke:#000080;" x="77.112066" xlink:href="#m5e64f44ee0" y="179.478486"/>
     <use style="fill:#000080;stroke:#000080;" x="80.391405" xlink:href="#m5e64f44ee0" y="281.664"/>
     <use style="fill:#000080;stroke:#000080;" x="83.670744" xlink:href="#m5e64f44ee0" y="276.059676"/>
     <use style="fill:#000080;stroke:#000080;" x="86.950083" xlink:href="#m5e64f44ee0" y="276.059676"/>
     <use style="fill:#000080;stroke:#000080;" x="90.229421" xlink:href="#m5e64f44ee0" y="282.784865"/>
     <use style="fill:#000080;stroke:#000080;" x="93.50876" xlink:href="#m5e64f44ee0" y="284.466162"/>
     <use style="fill:#000080;stroke:#000080;" x="96.788099" xlink:href="#m5e64f44ee0" y="285.400216"/>
     <use style="fill:#000080;stroke:#000080;" x="100.067438" xlink:href="#m5e64f44ee0" y="285.213405"/>
     <use style="fill:#000080;stroke:#000080;" x="103.346777" xlink:href="#m5e64f44ee0" y="284.839784"/>
     <use style="fill:#000080;stroke:#000080;" x="106.626116" xlink:href="#m5e64f44ee0" y="285.213405"/>
     <use style="fill:#000080;stroke:#000080;" x="109.905455" xlink:href="#m5e64f44ee0" y="284.466162"/>
     <use style="fill:#000080;stroke:#000080;" x="113.184793" xlink:href="#m5e64f44ee0" y="285.026595"/>
     <use style="fill:#000080;stroke:#000080;" x="116.464132" xlink:href="#m5e64f44ee0" y="285.400216"/>
     <use style="fill:#000080;stroke:#000080;" x="119.743471" xlink:href="#m5e64f44ee0" y="285.587027"/>
     <use style="fill:#000080;stroke:#000080;" x="123.02281" xlink:href="#m5e64f44ee0" y="285.213405"/>
     <use style="fill:#000080;stroke:#000080;" x="126.302149" xlink:href="#m5e64f44ee0" y="284.839784"/>
     <use style="fill:#000080;stroke:#000080;" x="129.581488" xlink:href="#m5e64f44ee0" y="285.026595"/>
     <use style="fill:#000080;stroke:#000080;" x="132.860826" xlink:href="#m5e64f44ee0" y="285.213405"/>
     <use style="fill:#000080;stroke:#000080;" x="136.140165" xlink:href="#m5e64f44ee0" y="285.960649"/>
     <use style="fill:#000080;stroke:#000080;" x="139.419504" xlink:href="#m5e64f44ee0" y="285.773838"/>
     <use style="fill:#000080;stroke:#000080;" x="142.698843" xlink:href="#m5e64f44ee0" y="285.773838"/>
     <use style="fill:#000080;stroke:#000080;" x="145.978182" xlink:href="#m5e64f44ee0" y="283.718919"/>
     <use style="fill:#000080;stroke:#000080;" x="149.257521" xlink:href="#m5e64f44ee0" y="285.213405"/>
     <use style="fill:#000080;stroke:#000080;" x="152.53686" xlink:href="#m5e64f44ee0" y="285.587027"/>
     <use style="fill:#000080;stroke:#000080;" x="155.816198" xlink:href="#m5e64f44ee0" y="285.400216"/>
     <use style="fill:#000080;stroke:#000080;" x="159.095537" xlink:href="#m5e64f44ee0" y="284.839784"/>
     <use style="fill:#000080;stroke:#000080;" x="162.374876" xlink:href="#m5e64f44ee0" y="286.147459"/>
     <use style="fill:#000080;stroke:#000080;" x="165.654215" xlink:href="#m5e64f44ee0" y="285.587027"/>
     <use style="fill:#000080;stroke:#000080;" x="168.933554" xlink:href="#m5e64f44ee0" y="285.213405"/>
     <use style="fill:#000080;stroke:#000080;" x="172.212893" xlink:href="#m5e64f44ee0" y="285.960649"/>
     <use style="fill:#000080;stroke:#000080;" x="175.492231" xlink:href="#m5e64f44ee0" y="285.587027"/>
     <use style="fill:#000080;stroke:#000080;" x="178.77157" xlink:href="#m5e64f44ee0" y="284.279351"/>
     <use style="fill:#000080;stroke:#000080;" x="182.050909" xlink:href="#m5e64f44ee0" y="285.213405"/>
     <use style="fill:#000080;stroke:#000080;" x="185.330248" xlink:href="#m5e64f44ee0" y="284.466162"/>
     <use style="fill:#000080;stroke:#000080;" x="188.609587" xlink:href="#m5e64f44ee0" y="284.466162"/>
     <use style="fill:#000080;stroke:#000080;" x="191.888926" xlink:href="#m5e64f44ee0" y="285.773838"/>
     <use style="fill:#000080;stroke:#000080;" x="195.168264" xlink:href="#m5e64f44ee0" y="285.773838"/>
     <use style="fill:#000080;stroke:#000080;" x="198.447603" xlink:href="#m5e64f44ee0" y="282.411243"/>
     <use style="fill:#000080;stroke:#000080;" x="201.726942" xlink:href="#m5e64f44ee0" y="284.652973"/>
     <use style="fill:#000080;stroke:#000080;" x="205.006281" xlink:href="#m5e64f44ee0" y="285.773838"/>
     <use style="fill:#000080;stroke:#000080;" x="208.28562" xlink:href="#m5e64f44ee0" y="284.279351"/>
     <use style="fill:#000080;stroke:#000080;" x="211.564959" xlink:href="#m5e64f44ee0" y="285.960649"/>
     <use style="fill:#000080;stroke:#000080;" x="214.844298" xlink:href="#m5e64f44ee0" y="285.587027"/>
     <use style="fill:#000080;stroke:#000080;" x="218.123636" xlink:href="#m5e64f44ee0" y="285.587027"/>
     <use style="fill:#000080;stroke:#000080;" x="221.402975" xlink:href="#m5e64f44ee0" y="285.960649"/>
     <use style="fill:#000080;stroke:#000080;" x="224.682314" xlink:href="#m5e64f44ee0" y="284.466162"/>
     <use style="fill:#000080;stroke:#000080;" x="227.961653" xlink:href="#m5e64f44ee0" y="285.213405"/>
     <use style="fill:#000080;stroke:#000080;" x="231.240992" xlink:href="#m5e64f44ee0" y="284.652973"/>
     <use style="fill:#000080;stroke:#000080;" x="234.520331" xlink:href="#m5e64f44ee0" y="285.026595"/>
     <use style="fill:#000080;stroke:#000080;" x="237.799669" xlink:href="#m5e64f44ee0" y="281.290378"/>
     <use style="fill:#000080;stroke:#000080;" x="241.079008" xlink:href="#m5e64f44ee0" y="285.960649"/>
     <use style="fill:#000080;stroke:#000080;" x="244.358347" xlink:href="#m5e64f44ee0" y="285.400216"/>
     <use style="fill:#000080;stroke:#000080;" x="247.637686" xlink:href="#m5e64f44ee0" y="285.773838"/>
     <use style="fill:#000080;stroke:#000080;" x="250.917025" xlink:href="#m5e64f44ee0" y="285.026595"/>
     <use style="fill:#000080;stroke:#000080;" x="254.196364" xlink:href="#m5e64f44ee0" y="285.773838"/>
     <use style="fill:#000080;stroke:#000080;" x="257.475702" xlink:href="#m5e64f44ee0" y="285.587027"/>
     <use style="fill:#000080;stroke:#000080;" x="260.755041" xlink:href="#m5e64f44ee0" y="285.587027"/>
     <use style="fill:#000080;stroke:#000080;" x="264.03438" xlink:href="#m5e64f44ee0" y="285.960649"/>
     <use style="fill:#000080;stroke:#000080;" x="267.313719" xlink:href="#m5e64f44ee0" y="285.587027"/>
     <use style="fill:#000080;stroke:#000080;" x="270.593058" xlink:href="#m5e64f44ee0" y="285.587027"/>
     <use style="fill:#000080;stroke:#000080;" x="273.872397" xlink:href="#m5e64f44ee0" y="281.477189"/>
     <use style="fill:#000080;stroke:#000080;" x="277.151736" xlink:href="#m5e64f44ee0" y="284.092541"/>
     <use style="fill:#000080;stroke:#000080;" x="280.431074" xlink:href="#m5e64f44ee0" y="282.037622"/>
     <use style="fill:#000080;stroke:#000080;" x="283.710413" xlink:href="#m5e64f44ee0" y="284.652973"/>
     <use style="fill:#000080;stroke:#000080;" x="286.989752" xlink:href="#m5e64f44ee0" y="285.213405"/>
     <use style="fill:#000080;stroke:#000080;" x="290.269091" xlink:href="#m5e64f44ee0" y="285.213405"/>
     <use style="fill:#000080;stroke:#000080;" x="293.54843" xlink:href="#m5e64f44ee0" y="274.938811"/>
     <use style="fill:#000080;stroke:#000080;" x="296.827769" xlink:href="#m5e64f44ee0" y="278.488216"/>
     <use style="fill:#000080;stroke:#000080;" x="300.107107" xlink:href="#m5e64f44ee0" y="279.609081"/>
     <use style="fill:#000080;stroke:#000080;" x="303.386446" xlink:href="#m5e64f44ee0" y="279.235459"/>
     <use style="fill:#000080;stroke:#000080;" x="306.665785" xlink:href="#m5e64f44ee0" y="277.554162"/>
     <use style="fill:#000080;stroke:#000080;" x="309.945124" xlink:href="#m5e64f44ee0" y="275.125622"/>
     <use style="fill:#000080;stroke:#000080;" x="313.224463" xlink:href="#m5e64f44ee0" y="276.433297"/>
     <use style="fill:#000080;stroke:#000080;" x="316.503802" xlink:href="#m5e64f44ee0" y="262.982919"/>
     <use style="fill:#000080;stroke:#000080;" x="319.78314" xlink:href="#m5e64f44ee0" y="280.543135"/>
     <use style="fill:#000080;stroke:#000080;" x="323.062479" xlink:href="#m5e64f44ee0" y="284.092541"/>
     <use style="fill:#000080;stroke:#000080;" x="326.341818" xlink:href="#m5e64f44ee0" y="284.279351"/>
     <use style="fill:#000080;stroke:#000080;" x="329.621157" xlink:href="#m5e64f44ee0" y="284.092541"/>
     <use style="fill:#000080;stroke:#000080;" x="332.900496" xlink:href="#m5e64f44ee0" y="284.839784"/>
     <use style="fill:#000080;stroke:#000080;" x="336.179835" xlink:href="#m5e64f44ee0" y="284.466162"/>
     <use style="fill:#000080;stroke:#000080;" x="339.459174" xlink:href="#m5e64f44ee0" y="282.598054"/>
     <use style="fill:#000080;stroke:#000080;" x="342.738512" xlink:href="#m5e64f44ee0" y="279.235459"/>
     <use style="fill:#000080;stroke:#000080;" x="346.017851" xlink:href="#m5e64f44ee0" y="283.158486"/>
     <use style="fill:#000080;stroke:#000080;" x="349.29719" xlink:href="#m5e64f44ee0" y="283.532108"/>
     <use style="fill:#000080;stroke:#000080;" x="352.576529" xlink:href="#m5e64f44ee0" y="281.664"/>
     <use style="fill:#000080;stroke:#000080;" x="355.855868" xlink:href="#m5e64f44ee0" y="283.718919"/>
     <use style="fill:#000080;stroke:#000080;" x="359.135207" xlink:href="#m5e64f44ee0" y="284.279351"/>
     <use style="fill:#000080;stroke:#000080;" x="362.414545" xlink:href="#m5e64f44ee0" y="285.587027"/>
     <use style="fill:#000080;stroke:#000080;" x="365.693884" xlink:href="#m5e64f44ee0" y="284.279351"/>
     <use style="fill:#000080;stroke:#000080;" x="368.973223" xlink:href="#m5e64f44ee0" y="283.90573"/>
     <use style="fill:#000080;stroke:#000080;" x="372.252562" xlink:href="#m5e64f44ee0" y="281.477189"/>
     <use style="fill:#000080;stroke:#000080;" x="375.531901" xlink:href="#m5e64f44ee0" y="283.532108"/>
     <use style="fill:#000080;stroke:#000080;" x="378.81124" xlink:href="#m5e64f44ee0" y="284.839784"/>
     <use style="fill:#000080;stroke:#000080;" x="382.090579" xlink:href="#m5e64f44ee0" y="285.400216"/>
     <use style="fill:#000080;stroke:#000080;" x="385.369917" xlink:href="#m5e64f44ee0" y="282.971676"/>
     <use style="fill:#000080;stroke:#000080;" x="388.649256" xlink:href="#m5e64f44ee0" y="283.718919"/>
     <use style="fill:#000080;stroke:#000080;" x="391.928595" xlink:href="#m5e64f44ee0" y="282.224432"/>
     <use style="fill:#000080;stroke:#000080;" x="395.207934" xlink:href="#m5e64f44ee0" y="284.839784"/>
     <use style="fill:#000080;stroke:#000080;" x="398.487273" xlink:href="#m5e64f44ee0" y="282.971676"/>
    </g>
   </g>
   <g id="line2d_15">
    <path clip-path="url(#p03ee4995e7)" d="M 73.832727 227.302054 
L 77.112066 216.280216 
L 80.391405 279.609081 
L 83.670744 270.455351 
L 86.950083 293.619892 
L 90.229421 294.553946 
L 93.50876 294.927568 
L 96.788099 294.180324 
L 100.067438 288.015568 
L 103.346777 293.993514 
L 106.626116 294.927568 
L 109.905455 293.059459 
L 113.184793 294.553946 
L 116.464132 294.927568 
L 119.743471 295.114378 
L 123.02281 293.619892 
L 126.302149 294.367135 
L 129.581488 295.114378 
L 132.860826 293.619892 
L 136.140165 294.927568 
L 139.419504 294.927568 
L 142.698843 295.488 
L 145.978182 294.367135 
L 149.257521 294.927568 
L 152.53686 295.488 
L 155.816198 293.433081 
L 159.095537 294.367135 
L 162.374876 295.114378 
L 165.654215 295.301189 
L 168.933554 293.619892 
L 172.212893 295.114378 
L 175.492231 294.927568 
L 178.77157 293.993514 
L 182.050909 294.927568 
L 185.330248 294.927568 
L 188.609587 295.301189 
L 191.888926 294.367135 
L 195.168264 295.114378 
L 198.447603 291.191351 
L 201.726942 292.685838 
L 205.006281 294.367135 
L 208.28562 294.927568 
L 211.564959 295.488 
L 214.844298 293.619892 
L 218.123636 294.553946 
L 221.402975 295.488 
L 224.682314 294.180324 
L 227.961653 294.740757 
L 231.240992 295.488 
L 234.520331 295.488 
L 237.799669 294.180324 
L 241.079008 294.927568 
L 244.358347 295.301189 
L 247.637686 293.993514 
L 250.917025 293.993514 
L 254.196364 295.114378 
L 257.475702 293.433081 
L 260.755041 292.125405 
L 264.03438 294.553946 
L 267.313719 294.927568 
L 270.593058 294.180324 
L 273.872397 293.619892 
L 277.151736 293.806703 
L 280.431074 293.806703 
L 283.710413 294.553946 
L 286.989752 294.180324 
L 290.269091 291.751784 
L 293.54843 290.444108 
L 296.827769 288.762811 
L 300.107107 292.312216 
L 303.386446 291.564973 
L 306.665785 289.883676 
L 309.945124 289.696865 
L 313.224463 285.773838 
L 316.503802 287.828757 
L 319.78314 292.872649 
L 323.062479 294.927568 
L 326.341818 294.180324 
L 329.621157 293.059459 
L 332.900496 293.806703 
L 336.179835 294.367135 
L 339.459174 292.125405 
L 342.738512 291.191351 
L 346.017851 294.927568 
L 349.29719 291.751784 
L 352.576529 293.993514 
L 355.855868 292.685838 
L 359.135207 294.367135 
L 362.414545 292.872649 
L 365.693884 290.257297 
L 368.973223 292.872649 
L 372.252562 295.488 
L 375.531901 293.059459 
L 378.81124 294.927568 
L 382.090579 294.927568 
L 385.369917 293.059459 
L 388.649256 294.367135 
L 391.928595 293.619892 
L 395.207934 294.553946 
L 398.487273 293.993514 
" style="fill:none;stroke:#00d4ff;stroke-linecap:square;stroke-width:2;"/>
    <defs>
     <path d="M 0 2.5 
C 0.663008 2.5 1.29895 2.236584 1.767767 1.767767 
C 2.236584 1.29895 2.5 0.663008 2.5 0 
C 2.5 -0.663008 2.236584 -1.29895 1.767767 -1.767767 
C 1.29895 -2.236584 0.663008 -2.5 0 -2.5 
C -0.663008 -2.5 -1.29895 -2.236584 -1.767767 -1.767767 
C -2.236584 -1.29895 -2.5 -0.663008 -2.5 0 
C -2.5 0.663008 -2.236584 1.29895 -1.767767 1.767767 
C -1.29895 2.236584 -0.663008 2.5 0 2.5 
z
" id="mda81a4b980" style="stroke:#00d4ff;"/>
    </defs>
    <g clip-path="url(#p03ee4995e7)">
     <use style="fill:#00d4ff;stroke:#00d4ff;" x="73.832727" xlink:href="#mda81a4b980" y="227.302054"/>
     <use style="fill:#00d4ff;stroke:#00d4ff;" x="77.112066" xlink:href="#mda81a4b980" y="216.280216"/>
     <use style="fill:#00d4ff;stroke:#00d4ff;" x="80.391405" xlink:href="#mda81a4b980" y="279.609081"/>
     <use style="fill:#00d4ff;stroke:#00d4ff;" x="83.670744" xlink:href="#mda81a4b980" y="270.455351"/>
     <use style="fill:#00d4ff;stroke:#00d4ff;" x="86.950083" xlink:href="#mda81a4b980" y="293.619892"/>
     <use style="fill:#00d4ff;stroke:#00d4ff;" x="90.229421" xlink:href="#mda81a4b980" y="294.553946"/>
     <use style="fill:#00d4ff;stroke:#00d4ff;" x="93.50876" xlink:href="#mda81a4b980" y="294.927568"/>
     <use style="fill:#00d4ff;stroke:#00d4ff;" x="96.788099" xlink:href="#mda81a4b980" y="294.180324"/>
     <use style="fill:#00d4ff;stroke:#00d4ff;" x="100.067438" xlink:href="#mda81a4b980" y="288.015568"/>
     <use style="fill:#00d4ff;stroke:#00d4ff;" x="103.346777" xlink:href="#mda81a4b980" y="293.993514"/>
     <use style="fill:#00d4ff;stroke:#00d4ff;" x="106.626116" xlink:href="#mda81a4b980" y="294.927568"/>
     <use style="fill:#00d4ff;stroke:#00d4ff;" x="109.905455" xlink:href="#mda81a4b980" y="293.059459"/>
     <use style="fill:#00d4ff;stroke:#00d4ff;" x="113.184793" xlink:href="#mda81a4b980" y="294.553946"/>
     <use style="fill:#00d4ff;stroke:#00d4ff;" x="116.464132" xlink:href="#mda81a4b980" y="294.927568"/>
     <use style="fill:#00d4ff;stroke:#00d4ff;" x="119.743471" xlink:href="#mda81a4b980" y="295.114378"/>
     <use style="fill:#00d4ff;stroke:#00d4ff;" x="123.02281" xlink:href="#mda81a4b980" y="293.619892"/>
     <use style="fill:#00d4ff;stroke:#00d4ff;" x="126.302149" xlink:href="#mda81a4b980" y="294.367135"/>
     <use style="fill:#00d4ff;stroke:#00d4ff;" x="129.581488" xlink:href="#mda81a4b980" y="295.114378"/>
     <use style="fill:#00d4ff;stroke:#00d4ff;" x="132.860826" xlink:href="#mda81a4b980" y="293.619892"/>
     <use style="fill:#00d4ff;stroke:#00d4ff;" x="136.140165" xlink:href="#mda81a4b980" y="294.927568"/>
     <use style="fill:#00d4ff;stroke:#00d4ff;" x="139.419504" xlink:href="#mda81a4b980" y="294.927568"/>
     <use style="fill:#00d4ff;stroke:#00d4ff;" x="142.698843" xlink:href="#mda81a4b980" y="295.488"/>
     <use style="fill:#00d4ff;stroke:#00d4ff;" x="145.978182" xlink:href="#mda81a4b980" y="294.367135"/>
     <use style="fill:#00d4ff;stroke:#00d4ff;" x="149.257521" xlink:href="#mda81a4b980" y="294.927568"/>
     <use style="fill:#00d4ff;stroke:#00d4ff;" x="152.53686" xlink:href="#mda81a4b980" y="295.488"/>
     <use style="fill:#00d4ff;stroke:#00d4ff;" x="155.816198" xlink:href="#mda81a4b980" y="293.433081"/>
     <use style="fill:#00d4ff;stroke:#00d4ff;" x="159.095537" xlink:href="#mda81a4b980" y="294.367135"/>
     <use style="fill:#00d4ff;stroke:#00d4ff;" x="162.374876" xlink:href="#mda81a4b980" y="295.114378"/>
     <use style="fill:#00d4ff;stroke:#00d4ff;" x="165.654215" xlink:href="#mda81a4b980" y="295.301189"/>
     <use style="fill:#00d4ff;stroke:#00d4ff;" x="168.933554" xlink:href="#mda81a4b980" y="293.619892"/>
     <use style="fill:#00d4ff;stroke:#00d4ff;" x="172.212893" xlink:href="#mda81a4b980" y="295.114378"/>
     <use style="fill:#00d4ff;stroke:#00d4ff;" x="175.492231" xlink:href="#mda81a4b980" y="294.927568"/>
     <use style="fill:#00d4ff;stroke:#00d4ff;" x="178.77157" xlink:href="#mda81a4b980" y="293.993514"/>
     <use style="fill:#00d4ff;stroke:#00d4ff;" x="182.050909" xlink:href="#mda81a4b980" y="294.927568"/>
     <use style="fill:#00d4ff;stroke:#00d4ff;" x="185.330248" xlink:href="#mda81a4b980" y="294.927568"/>
     <use style="fill:#00d4ff;stroke:#00d4ff;" x="188.609587" xlink:href="#mda81a4b980" y="295.301189"/>
     <use style="fill:#00d4ff;stroke:#00d4ff;" x="191.888926" xlink:href="#mda81a4b980" y="294.367135"/>
     <use style="fill:#00d4ff;stroke:#00d4ff;" x="195.168264" xlink:href="#mda81a4b980" y="295.114378"/>
     <use style="fill:#00d4ff;stroke:#00d4ff;" x="198.447603" xlink:href="#mda81a4b980" y="291.191351"/>
     <use style="fill:#00d4ff;stroke:#00d4ff;" x="201.726942" xlink:href="#mda81a4b980" y="292.685838"/>
     <use style="fill:#00d4ff;stroke:#00d4ff;" x="205.006281" xlink:href="#mda81a4b980" y="294.367135"/>
     <use style="fill:#00d4ff;stroke:#00d4ff;" x="208.28562" xlink:href="#mda81a4b980" y="294.927568"/>
     <use style="fill:#00d4ff;stroke:#00d4ff;" x="211.564959" xlink:href="#mda81a4b980" y="295.488"/>
     <use style="fill:#00d4ff;stroke:#00d4ff;" x="214.844298" xlink:href="#mda81a4b980" y="293.619892"/>
     <use style="fill:#00d4ff;stroke:#00d4ff;" x="218.123636" xlink:href="#mda81a4b980" y="294.553946"/>
     <use style="fill:#00d4ff;stroke:#00d4ff;" x="221.402975" xlink:href="#mda81a4b980" y="295.488"/>
     <use style="fill:#00d4ff;stroke:#00d4ff;" x="224.682314" xlink:href="#mda81a4b980" y="294.180324"/>
     <use style="fill:#00d4ff;stroke:#00d4ff;" x="227.961653" xlink:href="#mda81a4b980" y="294.740757"/>
     <use style="fill:#00d4ff;stroke:#00d4ff;" x="231.240992" xlink:href="#mda81a4b980" y="295.488"/>
     <use style="fill:#00d4ff;stroke:#00d4ff;" x="234.520331" xlink:href="#mda81a4b980" y="295.488"/>
     <use style="fill:#00d4ff;stroke:#00d4ff;" x="237.799669" xlink:href="#mda81a4b980" y="294.180324"/>
     <use style="fill:#00d4ff;stroke:#00d4ff;" x="241.079008" xlink:href="#mda81a4b980" y="294.927568"/>
     <use style="fill:#00d4ff;stroke:#00d4ff;" x="244.358347" xlink:href="#mda81a4b980" y="295.301189"/>
     <use style="fill:#00d4ff;stroke:#00d4ff;" x="247.637686" xlink:href="#mda81a4b980" y="293.993514"/>
     <use style="fill:#00d4ff;stroke:#00d4ff;" x="250.917025" xlink:href="#mda81a4b980" y="293.993514"/>
     <use style="fill:#00d4ff;stroke:#00d4ff;" x="254.196364" xlink:href="#mda81a4b980" y="295.114378"/>
     <use style="fill:#00d4ff;stroke:#00d4ff;" x="257.475702" xlink:href="#mda81a4b980" y="293.433081"/>
     <use style="fill:#00d4ff;stroke:#00d4ff;" x="260.755041" xlink:href="#mda81a4b980" y="292.125405"/>
     <use style="fill:#00d4ff;stroke:#00d4ff;" x="264.03438" xlink:href="#mda81a4b980" y="294.553946"/>
     <use style="fill:#00d4ff;stroke:#00d4ff;" x="267.313719" xlink:href="#mda81a4b980" y="294.927568"/>
     <use style="fill:#00d4ff;stroke:#00d4ff;" x="270.593058" xlink:href="#mda81a4b980" y="294.180324"/>
     <use style="fill:#00d4ff;stroke:#00d4ff;" x="273.872397" xlink:href="#mda81a4b980" y="293.619892"/>
     <use style="fill:#00d4ff;stroke:#00d4ff;" x="277.151736" xlink:href="#mda81a4b980" y="293.806703"/>
     <use style="fill:#00d4ff;stroke:#00d4ff;" x="280.431074" xlink:href="#mda81a4b980" y="293.806703"/>
     <use style="fill:#00d4ff;stroke:#00d4ff;" x="283.710413" xlink:href="#mda81a4b980" y="294.553946"/>
     <use style="fill:#00d4ff;stroke:#00d4ff;" x="286.989752" xlink:href="#mda81a4b980" y="294.180324"/>
     <use style="fill:#00d4ff;stroke:#00d4ff;" x="290.269091" xlink:href="#mda81a4b980" y="291.751784"/>
     <use style="fill:#00d4ff;stroke:#00d4ff;" x="293.54843" xlink:href="#mda81a4b980" y="290.444108"/>
     <use style="fill:#00d4ff;stroke:#00d4ff;" x="296.827769" xlink:href="#mda81a4b980" y="288.762811"/>
     <use style="fill:#00d4ff;stroke:#00d4ff;" x="300.107107" xlink:href="#mda81a4b980" y="292.312216"/>
     <use style="fill:#00d4ff;stroke:#00d4ff;" x="303.386446" xlink:href="#mda81a4b980" y="291.564973"/>
     <use style="fill:#00d4ff;stroke:#00d4ff;" x="306.665785" xlink:href="#mda81a4b980" y="289.883676"/>
     <use style="fill:#00d4ff;stroke:#00d4ff;" x="309.945124" xlink:href="#mda81a4b980" y="289.696865"/>
     <use style="fill:#00d4ff;stroke:#00d4ff;" x="313.224463" xlink:href="#mda81a4b980" y="285.773838"/>
     <use style="fill:#00d4ff;stroke:#00d4ff;" x="316.503802" xlink:href="#mda81a4b980" y="287.828757"/>
     <use style="fill:#00d4ff;stroke:#00d4ff;" x="319.78314" xlink:href="#mda81a4b980" y="292.872649"/>
     <use style="fill:#00d4ff;stroke:#00d4ff;" x="323.062479" xlink:href="#mda81a4b980" y="294.927568"/>
     <use style="fill:#00d4ff;stroke:#00d4ff;" x="326.341818" xlink:href="#mda81a4b980" y="294.180324"/>
     <use style="fill:#00d4ff;stroke:#00d4ff;" x="329.621157" xlink:href="#mda81a4b980" y="293.059459"/>
     <use style="fill:#00d4ff;stroke:#00d4ff;" x="332.900496" xlink:href="#mda81a4b980" y="293.806703"/>
     <use style="fill:#00d4ff;stroke:#00d4ff;" x="336.179835" xlink:href="#mda81a4b980" y="294.367135"/>
     <use style="fill:#00d4ff;stroke:#00d4ff;" x="339.459174" xlink:href="#mda81a4b980" y="292.125405"/>
     <use style="fill:#00d4ff;stroke:#00d4ff;" x="342.738512" xlink:href="#mda81a4b980" y="291.191351"/>
     <use style="fill:#00d4ff;stroke:#00d4ff;" x="346.017851" xlink:href="#mda81a4b980" y="294.927568"/>
     <use style="fill:#00d4ff;stroke:#00d4ff;" x="349.29719" xlink:href="#mda81a4b980" y="291.751784"/>
     <use style="fill:#00d4ff;stroke:#00d4ff;" x="352.576529" xlink:href="#mda81a4b980" y="293.993514"/>
     <use style="fill:#00d4ff;stroke:#00d4ff;" x="355.855868" xlink:href="#mda81a4b980" y="292.685838"/>
     <use style="fill:#00d4ff;stroke:#00d4ff;" x="359.135207" xlink:href="#mda81a4b980" y="294.367135"/>
     <use style="fill:#00d4ff;stroke:#00d4ff;" x="362.414545" xlink:href="#mda81a4b980" y="292.872649"/>
     <use style="fill:#00d4ff;stroke:#00d4ff;" x="365.693884" xlink:href="#mda81a4b980" y="290.257297"/>
     <use style="fill:#00d4ff;stroke:#00d4ff;" x="368.973223" xlink:href="#mda81a4b980" y="292.872649"/>
     <use style="fill:#00d4ff;stroke:#00d4ff;" x="372.252562" xlink:href="#mda81a4b980" y="295.488"/>
     <use style="fill:#00d4ff;stroke:#00d4ff;" x="375.531901" xlink:href="#mda81a4b980" y="293.059459"/>
     <use style="fill:#00d4ff;stroke:#00d4ff;" x="378.81124" xlink:href="#mda81a4b980" y="294.927568"/>
     <use style="fill:#00d4ff;stroke:#00d4ff;" x="382.090579" xlink:href="#mda81a4b980" y="294.927568"/>
     <use style="fill:#00d4ff;stroke:#00d4ff;" x="385.369917" xlink:href="#mda81a4b980" y="293.059459"/>
     <use style="fill:#00d4ff;stroke:#00d4ff;" x="388.649256" xlink:href="#mda81a4b980" y="294.367135"/>
     <use style="fill:#00d4ff;stroke:#00d4ff;" x="391.928595" xlink:href="#mda81a4b980" y="293.619892"/>
     <use style="fill:#00d4ff;stroke:#00d4ff;" x="395.207934" xlink:href="#mda81a4b980" y="294.553946"/>
     <use style="fill:#00d4ff;stroke:#00d4ff;" x="398.487273" xlink:href="#mda81a4b980" y="293.993514"/>
    </g>
   </g>
   <g id="line2d_16">
    <path clip-path="url(#p03ee4995e7)" d="M 73.832727 144.918486 
L 77.112066 250.466595 
L 80.391405 280.543135 
L 83.670744 273.070703 
L 86.950083 284.839784 
L 90.229421 283.718919 
L 93.50876 284.466162 
L 96.788099 284.092541 
L 100.067438 259.620324 
L 103.346777 284.279351 
L 106.626116 283.532108 
L 109.905455 284.466162 
L 113.184793 284.466162 
L 116.464132 285.400216 
L 119.743471 284.652973 
L 123.02281 285.026595 
L 126.302149 283.90573 
L 129.581488 284.466162 
L 132.860826 284.839784 
L 136.140165 285.587027 
L 139.419504 284.652973 
L 142.698843 285.400216 
L 145.978182 284.466162 
L 149.257521 285.587027 
L 152.53686 285.213405 
L 155.816198 285.026595 
L 159.095537 283.90573 
L 162.374876 285.400216 
L 165.654215 283.718919 
L 168.933554 285.213405 
L 172.212893 285.587027 
L 175.492231 285.026595 
L 178.77157 285.400216 
L 182.050909 283.532108 
L 185.330248 285.213405 
L 188.609587 284.839784 
L 191.888926 284.839784 
L 195.168264 283.90573 
L 198.447603 273.444324 
L 201.726942 284.279351 
L 205.006281 285.026595 
L 208.28562 284.839784 
L 211.564959 284.466162 
L 214.844298 276.059676 
L 218.123636 285.400216 
L 221.402975 284.652973 
L 224.682314 285.587027 
L 227.961653 285.587027 
L 231.240992 285.587027 
L 234.520331 284.839784 
L 237.799669 285.773838 
L 241.079008 285.213405 
L 244.358347 285.400216 
L 247.637686 285.026595 
L 250.917025 284.466162 
L 254.196364 285.213405 
L 257.475702 285.213405 
L 260.755041 285.400216 
L 264.03438 284.839784 
L 267.313719 285.213405 
L 270.593058 285.400216 
L 273.872397 282.411243 
L 277.151736 278.675027 
L 280.431074 283.718919 
L 283.710413 285.400216 
L 286.989752 283.718919 
L 290.269091 276.433297 
L 293.54843 275.872865 
L 296.827769 279.609081 
L 300.107107 273.444324 
L 303.386446 276.059676 
L 306.665785 272.51027 
L 309.945124 274.004757 
L 313.224463 267.653189 
L 316.503802 271.763027 
L 319.78314 283.532108 
L 323.062479 283.718919 
L 326.341818 283.345297 
L 329.621157 283.532108 
L 332.900496 283.90573 
L 336.179835 284.279351 
L 339.459174 277.180541 
L 342.738512 277.927784 
L 346.017851 281.290378 
L 349.29719 279.982703 
L 352.576529 279.42227 
L 355.855868 281.103568 
L 359.135207 284.839784 
L 362.414545 282.971676 
L 365.693884 281.103568 
L 368.973223 282.411243 
L 372.252562 284.092541 
L 375.531901 283.90573 
L 378.81124 284.279351 
L 382.090579 284.839784 
L 385.369917 284.839784 
L 388.649256 280.729946 
L 391.928595 284.466162 
L 395.207934 280.729946 
L 398.487273 284.839784 
" style="fill:none;stroke:#ffe600;stroke-linecap:square;stroke-width:2;"/>
    <defs>
     <path d="M 0 2.5 
C 0.663008 2.5 1.29895 2.236584 1.767767 1.767767 
C 2.236584 1.29895 2.5 0.663008 2.5 0 
C 2.5 -0.663008 2.236584 -1.29895 1.767767 -1.767767 
C 1.29895 -2.236584 0.663008 -2.5 0 -2.5 
C -0.663008 -2.5 -1.29895 -2.236584 -1.767767 -1.767767 
C -2.236584 -1.29895 -2.5 -0.663008 -2.5 0 
C -2.5 0.663008 -2.236584 1.29895 -1.767767 1.767767 
C -1.29895 2.236584 -0.663008 2.5 0 2.5 
z
" id="m33d9019670" style="stroke:#ffe600;"/>
    </defs>
    <g clip-path="url(#p03ee4995e7)">
     <use style="fill:#ffe600;stroke:#ffe600;" x="73.832727" xlink:href="#m33d9019670" y="144.918486"/>
     <use style="fill:#ffe600;stroke:#ffe600;" x="77.112066" xlink:href="#m33d9019670" y="250.466595"/>
     <use style="fill:#ffe600;stroke:#ffe600;" x="80.391405" xlink:href="#m33d9019670" y="280.543135"/>
     <use style="fill:#ffe600;stroke:#ffe600;" x="83.670744" xlink:href="#m33d9019670" y="273.070703"/>
     <use style="fill:#ffe600;stroke:#ffe600;" x="86.950083" xlink:href="#m33d9019670" y="284.839784"/>
     <use style="fill:#ffe600;stroke:#ffe600;" x="90.229421" xlink:href="#m33d9019670" y="283.718919"/>
     <use style="fill:#ffe600;stroke:#ffe600;" x="93.50876" xlink:href="#m33d9019670" y="284.466162"/>
     <use style="fill:#ffe600;stroke:#ffe600;" x="96.788099" xlink:href="#m33d9019670" y="284.092541"/>
     <use style="fill:#ffe600;stroke:#ffe600;" x="100.067438" xlink:href="#m33d9019670" y="259.620324"/>
     <use style="fill:#ffe600;stroke:#ffe600;" x="103.346777" xlink:href="#m33d9019670" y="284.279351"/>
     <use style="fill:#ffe600;stroke:#ffe600;" x="106.626116" xlink:href="#m33d9019670" y="283.532108"/>
     <use style="fill:#ffe600;stroke:#ffe600;" x="109.905455" xlink:href="#m33d9019670" y="284.466162"/>
     <use style="fill:#ffe600;stroke:#ffe600;" x="113.184793" xlink:href="#m33d9019670" y="284.466162"/>
     <use style="fill:#ffe600;stroke:#ffe600;" x="116.464132" xlink:href="#m33d9019670" y="285.400216"/>
     <use style="fill:#ffe600;stroke:#ffe600;" x="119.743471" xlink:href="#m33d9019670" y="284.652973"/>
     <use style="fill:#ffe600;stroke:#ffe600;" x="123.02281" xlink:href="#m33d9019670" y="285.026595"/>
     <use style="fill:#ffe600;stroke:#ffe600;" x="126.302149" xlink:href="#m33d9019670" y="283.90573"/>
     <use style="fill:#ffe600;stroke:#ffe600;" x="129.581488" xlink:href="#m33d9019670" y="284.466162"/>
     <use style="fill:#ffe600;stroke:#ffe600;" x="132.860826" xlink:href="#m33d9019670" y="284.839784"/>
     <use style="fill:#ffe600;stroke:#ffe600;" x="136.140165" xlink:href="#m33d9019670" y="285.587027"/>
     <use style="fill:#ffe600;stroke:#ffe600;" x="139.419504" xlink:href="#m33d9019670" y="284.652973"/>
     <use style="fill:#ffe600;stroke:#ffe600;" x="142.698843" xlink:href="#m33d9019670" y="285.400216"/>
     <use style="fill:#ffe600;stroke:#ffe600;" x="145.978182" xlink:href="#m33d9019670" y="284.466162"/>
     <use style="fill:#ffe600;stroke:#ffe600;" x="149.257521" xlink:href="#m33d9019670" y="285.587027"/>
     <use style="fill:#ffe600;stroke:#ffe600;" x="152.53686" xlink:href="#m33d9019670" y="285.213405"/>
     <use style="fill:#ffe600;stroke:#ffe600;" x="155.816198" xlink:href="#m33d9019670" y="285.026595"/>
     <use style="fill:#ffe600;stroke:#ffe600;" x="159.095537" xlink:href="#m33d9019670" y="283.90573"/>
     <use style="fill:#ffe600;stroke:#ffe600;" x="162.374876" xlink:href="#m33d9019670" y="285.400216"/>
     <use style="fill:#ffe600;stroke:#ffe600;" x="165.654215" xlink:href="#m33d9019670" y="283.718919"/>
     <use style="fill:#ffe600;stroke:#ffe600;" x="168.933554" xlink:href="#m33d9019670" y="285.213405"/>
     <use style="fill:#ffe600;stroke:#ffe600;" x="172.212893" xlink:href="#m33d9019670" y="285.587027"/>
     <use style="fill:#ffe600;stroke:#ffe600;" x="175.492231" xlink:href="#m33d9019670" y="285.026595"/>
     <use style="fill:#ffe600;stroke:#ffe600;" x="178.77157" xlink:href="#m33d9019670" y="285.400216"/>
     <use style="fill:#ffe600;stroke:#ffe600;" x="182.050909" xlink:href="#m33d9019670" y="283.532108"/>
     <use style="fill:#ffe600;stroke:#ffe600;" x="185.330248" xlink:href="#m33d9019670" y="285.213405"/>
     <use style="fill:#ffe600;stroke:#ffe600;" x="188.609587" xlink:href="#m33d9019670" y="284.839784"/>
     <use style="fill:#ffe600;stroke:#ffe600;" x="191.888926" xlink:href="#m33d9019670" y="284.839784"/>
     <use style="fill:#ffe600;stroke:#ffe600;" x="195.168264" xlink:href="#m33d9019670" y="283.90573"/>
     <use style="fill:#ffe600;stroke:#ffe600;" x="198.447603" xlink:href="#m33d9019670" y="273.444324"/>
     <use style="fill:#ffe600;stroke:#ffe600;" x="201.726942" xlink:href="#m33d9019670" y="284.279351"/>
     <use style="fill:#ffe600;stroke:#ffe600;" x="205.006281" xlink:href="#m33d9019670" y="285.026595"/>
     <use style="fill:#ffe600;stroke:#ffe600;" x="208.28562" xlink:href="#m33d9019670" y="284.839784"/>
     <use style="fill:#ffe600;stroke:#ffe600;" x="211.564959" xlink:href="#m33d9019670" y="284.466162"/>
     <use style="fill:#ffe600;stroke:#ffe600;" x="214.844298" xlink:href="#m33d9019670" y="276.059676"/>
     <use style="fill:#ffe600;stroke:#ffe600;" x="218.123636" xlink:href="#m33d9019670" y="285.400216"/>
     <use style="fill:#ffe600;stroke:#ffe600;" x="221.402975" xlink:href="#m33d9019670" y="284.652973"/>
     <use style="fill:#ffe600;stroke:#ffe600;" x="224.682314" xlink:href="#m33d9019670" y="285.587027"/>
     <use style="fill:#ffe600;stroke:#ffe600;" x="227.961653" xlink:href="#m33d9019670" y="285.587027"/>
     <use style="fill:#ffe600;stroke:#ffe600;" x="231.240992" xlink:href="#m33d9019670" y="285.587027"/>
     <use style="fill:#ffe600;stroke:#ffe600;" x="234.520331" xlink:href="#m33d9019670" y="284.839784"/>
     <use style="fill:#ffe600;stroke:#ffe600;" x="237.799669" xlink:href="#m33d9019670" y="285.773838"/>
     <use style="fill:#ffe600;stroke:#ffe600;" x="241.079008" xlink:href="#m33d9019670" y="285.213405"/>
     <use style="fill:#ffe600;stroke:#ffe600;" x="244.358347" xlink:href="#m33d9019670" y="285.400216"/>
     <use style="fill:#ffe600;stroke:#ffe600;" x="247.637686" xlink:href="#m33d9019670" y="285.026595"/>
     <use style="fill:#ffe600;stroke:#ffe600;" x="250.917025" xlink:href="#m33d9019670" y="284.466162"/>
     <use style="fill:#ffe600;stroke:#ffe600;" x="254.196364" xlink:href="#m33d9019670" y="285.213405"/>
     <use style="fill:#ffe600;stroke:#ffe600;" x="257.475702" xlink:href="#m33d9019670" y="285.213405"/>
     <use style="fill:#ffe600;stroke:#ffe600;" x="260.755041" xlink:href="#m33d9019670" y="285.400216"/>
     <use style="fill:#ffe600;stroke:#ffe600;" x="264.03438" xlink:href="#m33d9019670" y="284.839784"/>
     <use style="fill:#ffe600;stroke:#ffe600;" x="267.313719" xlink:href="#m33d9019670" y="285.213405"/>
     <use style="fill:#ffe600;stroke:#ffe600;" x="270.593058" xlink:href="#m33d9019670" y="285.400216"/>
     <use style="fill:#ffe600;stroke:#ffe600;" x="273.872397" xlink:href="#m33d9019670" y="282.411243"/>
     <use style="fill:#ffe600;stroke:#ffe600;" x="277.151736" xlink:href="#m33d9019670" y="278.675027"/>
     <use style="fill:#ffe600;stroke:#ffe600;" x="280.431074" xlink:href="#m33d9019670" y="283.718919"/>
     <use style="fill:#ffe600;stroke:#ffe600;" x="283.710413" xlink:href="#m33d9019670" y="285.400216"/>
     <use style="fill:#ffe600;stroke:#ffe600;" x="286.989752" xlink:href="#m33d9019670" y="283.718919"/>
     <use style="fill:#ffe600;stroke:#ffe600;" x="290.269091" xlink:href="#m33d9019670" y="276.433297"/>
     <use style="fill:#ffe600;stroke:#ffe600;" x="293.54843" xlink:href="#m33d9019670" y="275.872865"/>
     <use style="fill:#ffe600;stroke:#ffe600;" x="296.827769" xlink:href="#m33d9019670" y="279.609081"/>
     <use style="fill:#ffe600;stroke:#ffe600;" x="300.107107" xlink:href="#m33d9019670" y="273.444324"/>
     <use style="fill:#ffe600;stroke:#ffe600;" x="303.386446" xlink:href="#m33d9019670" y="276.059676"/>
     <use style="fill:#ffe600;stroke:#ffe600;" x="306.665785" xlink:href="#m33d9019670" y="272.51027"/>
     <use style="fill:#ffe600;stroke:#ffe600;" x="309.945124" xlink:href="#m33d9019670" y="274.004757"/>
     <use style="fill:#ffe600;stroke:#ffe600;" x="313.224463" xlink:href="#m33d9019670" y="267.653189"/>
     <use style="fill:#ffe600;stroke:#ffe600;" x="316.503802" xlink:href="#m33d9019670" y="271.763027"/>
     <use style="fill:#ffe600;stroke:#ffe600;" x="319.78314" xlink:href="#m33d9019670" y="283.532108"/>
     <use style="fill:#ffe600;stroke:#ffe600;" x="323.062479" xlink:href="#m33d9019670" y="283.718919"/>
     <use style="fill:#ffe600;stroke:#ffe600;" x="326.341818" xlink:href="#m33d9019670" y="283.345297"/>
     <use style="fill:#ffe600;stroke:#ffe600;" x="329.621157" xlink:href="#m33d9019670" y="283.532108"/>
     <use style="fill:#ffe600;stroke:#ffe600;" x="332.900496" xlink:href="#m33d9019670" y="283.90573"/>
     <use style="fill:#ffe600;stroke:#ffe600;" x="336.179835" xlink:href="#m33d9019670" y="284.279351"/>
     <use style="fill:#ffe600;stroke:#ffe600;" x="339.459174" xlink:href="#m33d9019670" y="277.180541"/>
     <use style="fill:#ffe600;stroke:#ffe600;" x="342.738512" xlink:href="#m33d9019670" y="277.927784"/>
     <use style="fill:#ffe600;stroke:#ffe600;" x="346.017851" xlink:href="#m33d9019670" y="281.290378"/>
     <use style="fill:#ffe600;stroke:#ffe600;" x="349.29719" xlink:href="#m33d9019670" y="279.982703"/>
     <use style="fill:#ffe600;stroke:#ffe600;" x="352.576529" xlink:href="#m33d9019670" y="279.42227"/>
     <use style="fill:#ffe600;stroke:#ffe600;" x="355.855868" xlink:href="#m33d9019670" y="281.103568"/>
     <use style="fill:#ffe600;stroke:#ffe600;" x="359.135207" xlink:href="#m33d9019670" y="284.839784"/>
     <use style="fill:#ffe600;stroke:#ffe600;" x="362.414545" xlink:href="#m33d9019670" y="282.971676"/>
     <use style="fill:#ffe600;stroke:#ffe600;" x="365.693884" xlink:href="#m33d9019670" y="281.103568"/>
     <use style="fill:#ffe600;stroke:#ffe600;" x="368.973223" xlink:href="#m33d9019670" y="282.411243"/>
     <use style="fill:#ffe600;stroke:#ffe600;" x="372.252562" xlink:href="#m33d9019670" y="284.092541"/>
     <use style="fill:#ffe600;stroke:#ffe600;" x="375.531901" xlink:href="#m33d9019670" y="283.90573"/>
     <use style="fill:#ffe600;stroke:#ffe600;" x="378.81124" xlink:href="#m33d9019670" y="284.279351"/>
     <use style="fill:#ffe600;stroke:#ffe600;" x="382.090579" xlink:href="#m33d9019670" y="284.839784"/>
     <use style="fill:#ffe600;stroke:#ffe600;" x="385.369917" xlink:href="#m33d9019670" y="284.839784"/>
     <use style="fill:#ffe600;stroke:#ffe600;" x="388.649256" xlink:href="#m33d9019670" y="280.729946"/>
     <use style="fill:#ffe600;stroke:#ffe600;" x="391.928595" xlink:href="#m33d9019670" y="284.466162"/>
     <use style="fill:#ffe600;stroke:#ffe600;" x="395.207934" xlink:href="#m33d9019670" y="280.729946"/>
     <use style="fill:#ffe600;stroke:#ffe600;" x="398.487273" xlink:href="#m33d9019670" y="284.839784"/>
    </g>
   </g>
   <g id="line2d_17">
    <path clip-path="url(#p03ee4995e7)" d="M 73.832727 213.291243 
L 77.112066 53.568 
L 80.391405 189.939892 
L 83.670744 217.21427 
L 86.950083 203.950703 
L 90.229421 280.916757 
L 93.50876 290.444108 
L 96.788099 289.510054 
L 100.067438 287.268324 
L 103.346777 290.070486 
L 106.626116 290.070486 
L 109.905455 289.883676 
L 113.184793 289.883676 
L 116.464132 290.257297 
L 119.743471 290.444108 
L 123.02281 289.883676 
L 126.302149 289.883676 
L 129.581488 290.444108 
L 132.860826 290.630919 
L 136.140165 290.257297 
L 139.419504 289.323243 
L 142.698843 275.686054 
L 145.978182 290.257297 
L 149.257521 289.883676 
L 152.53686 288.389189 
L 155.816198 285.213405 
L 159.095537 290.81773 
L 162.374876 285.400216 
L 165.654215 290.630919 
L 168.933554 290.444108 
L 172.212893 290.070486 
L 175.492231 290.257297 
L 178.77157 290.81773 
L 182.050909 290.81773 
L 185.330248 273.444324 
L 188.609587 291.004541 
L 191.888926 290.444108 
L 195.168264 289.883676 
L 198.447603 287.268324 
L 201.726942 290.630919 
L 205.006281 289.883676 
L 208.28562 290.81773 
L 211.564959 290.630919 
L 214.844298 285.213405 
L 218.123636 291.004541 
L 221.402975 290.630919 
L 224.682314 290.070486 
L 227.961653 290.630919 
L 231.240992 290.444108 
L 234.520331 288.949622 
L 237.799669 290.630919 
L 241.079008 290.630919 
L 244.358347 291.004541 
L 247.637686 291.004541 
L 250.917025 290.257297 
L 254.196364 290.81773 
L 257.475702 290.630919 
L 260.755041 290.81773 
L 264.03438 290.81773 
L 267.313719 290.444108 
L 270.593058 290.257297 
L 273.872397 289.136432 
L 277.151736 286.894703 
L 280.431074 289.510054 
L 283.710413 290.444108 
L 286.989752 290.630919 
L 290.269091 284.839784 
L 293.54843 286.521081 
L 296.827769 285.773838 
L 300.107107 279.235459 
L 303.386446 282.411243 
L 306.665785 284.466162 
L 309.945124 284.279351 
L 313.224463 285.773838 
L 316.503802 282.224432 
L 319.78314 290.070486 
L 323.062479 289.696865 
L 326.341818 288.949622 
L 329.621157 290.070486 
L 332.900496 290.630919 
L 336.179835 290.257297 
L 339.459174 285.587027 
L 342.738512 288.015568 
L 346.017851 288.202378 
L 349.29719 286.894703 
L 352.576529 289.510054 
L 355.855868 289.510054 
L 359.135207 289.696865 
L 362.414545 289.510054 
L 365.693884 287.641946 
L 368.973223 288.015568 
L 372.252562 289.696865 
L 375.531901 290.070486 
L 378.81124 288.202378 
L 382.090579 288.015568 
L 385.369917 288.949622 
L 388.649256 288.949622 
L 391.928595 288.576 
L 395.207934 289.696865 
L 398.487273 290.81773 
" style="fill:none;stroke:#800000;stroke-linecap:square;stroke-width:2;"/>
    <defs>
     <path d="M 0 2.5 
C 0.663008 2.5 1.29895 2.236584 1.767767 1.767767 
C 2.236584 1.29895 2.5 0.663008 2.5 0 
C 2.5 -0.663008 2.236584 -1.29895 1.767767 -1.767767 
C 1.29895 -2.236584 0.663008 -2.5 0 -2.5 
C -0.663008 -2.5 -1.29895 -2.236584 -1.767767 -1.767767 
C -2.236584 -1.29895 -2.5 -0.663008 -2.5 0 
C -2.5 0.663008 -2.236584 1.29895 -1.767767 1.767767 
C -1.29895 2.236584 -0.663008 2.5 0 2.5 
z
" id="m7c4f1b389e" style="stroke:#800000;"/>
    </defs>
    <g clip-path="url(#p03ee4995e7)">
     <use style="fill:#800000;stroke:#800000;" x="73.832727" xlink:href="#m7c4f1b389e" y="213.291243"/>
     <use style="fill:#800000;stroke:#800000;" x="77.112066" xlink:href="#m7c4f1b389e" y="53.568"/>
     <use style="fill:#800000;stroke:#800000;" x="80.391405" xlink:href="#m7c4f1b389e" y="189.939892"/>
     <use style="fill:#800000;stroke:#800000;" x="83.670744" xlink:href="#m7c4f1b389e" y="217.21427"/>
     <use style="fill:#800000;stroke:#800000;" x="86.950083" xlink:href="#m7c4f1b389e" y="203.950703"/>
     <use style="fill:#800000;stroke:#800000;" x="90.229421" xlink:href="#m7c4f1b389e" y="280.916757"/>
     <use style="fill:#800000;stroke:#800000;" x="93.50876" xlink:href="#m7c4f1b389e" y="290.444108"/>
     <use style="fill:#800000;stroke:#800000;" x="96.788099" xlink:href="#m7c4f1b389e" y="289.510054"/>
     <use style="fill:#800000;stroke:#800000;" x="100.067438" xlink:href="#m7c4f1b389e" y="287.268324"/>
     <use style="fill:#800000;stroke:#800000;" x="103.346777" xlink:href="#m7c4f1b389e" y="290.070486"/>
     <use style="fill:#800000;stroke:#800000;" x="106.626116" xlink:href="#m7c4f1b389e" y="290.070486"/>
     <use style="fill:#800000;stroke:#800000;" x="109.905455" xlink:href="#m7c4f1b389e" y="289.883676"/>
     <use style="fill:#800000;stroke:#800000;" x="113.184793" xlink:href="#m7c4f1b389e" y="289.883676"/>
     <use style="fill:#800000;stroke:#800000;" x="116.464132" xlink:href="#m7c4f1b389e" y="290.257297"/>
     <use style="fill:#800000;stroke:#800000;" x="119.743471" xlink:href="#m7c4f1b389e" y="290.444108"/>
     <use style="fill:#800000;stroke:#800000;" x="123.02281" xlink:href="#m7c4f1b389e" y="289.883676"/>
     <use style="fill:#800000;stroke:#800000;" x="126.302149" xlink:href="#m7c4f1b389e" y="289.883676"/>
     <use style="fill:#800000;stroke:#800000;" x="129.581488" xlink:href="#m7c4f1b389e" y="290.444108"/>
     <use style="fill:#800000;stroke:#800000;" x="132.860826" xlink:href="#m7c4f1b389e" y="290.630919"/>
     <use style="fill:#800000;stroke:#800000;" x="136.140165" xlink:href="#m7c4f1b389e" y="290.257297"/>
     <use style="fill:#800000;stroke:#800000;" x="139.419504" xlink:href="#m7c4f1b389e" y="289.323243"/>
     <use style="fill:#800000;stroke:#800000;" x="142.698843" xlink:href="#m7c4f1b389e" y="275.686054"/>
     <use style="fill:#800000;stroke:#800000;" x="145.978182" xlink:href="#m7c4f1b389e" y="290.257297"/>
     <use style="fill:#800000;stroke:#800000;" x="149.257521" xlink:href="#m7c4f1b389e" y="289.883676"/>
     <use style="fill:#800000;stroke:#800000;" x="152.53686" xlink:href="#m7c4f1b389e" y="288.389189"/>
     <use style="fill:#800000;stroke:#800000;" x="155.816198" xlink:href="#m7c4f1b389e" y="285.213405"/>
     <use style="fill:#800000;stroke:#800000;" x="159.095537" xlink:href="#m7c4f1b389e" y="290.81773"/>
     <use style="fill:#800000;stroke:#800000;" x="162.374876" xlink:href="#m7c4f1b389e" y="285.400216"/>
     <use style="fill:#800000;stroke:#800000;" x="165.654215" xlink:href="#m7c4f1b389e" y="290.630919"/>
     <use style="fill:#800000;stroke:#800000;" x="168.933554" xlink:href="#m7c4f1b389e" y="290.444108"/>
     <use style="fill:#800000;stroke:#800000;" x="172.212893" xlink:href="#m7c4f1b389e" y="290.070486"/>
     <use style="fill:#800000;stroke:#800000;" x="175.492231" xlink:href="#m7c4f1b389e" y="290.257297"/>
     <use style="fill:#800000;stroke:#800000;" x="178.77157" xlink:href="#m7c4f1b389e" y="290.81773"/>
     <use style="fill:#800000;stroke:#800000;" x="182.050909" xlink:href="#m7c4f1b389e" y="290.81773"/>
     <use style="fill:#800000;stroke:#800000;" x="185.330248" xlink:href="#m7c4f1b389e" y="273.444324"/>
     <use style="fill:#800000;stroke:#800000;" x="188.609587" xlink:href="#m7c4f1b389e" y="291.004541"/>
     <use style="fill:#800000;stroke:#800000;" x="191.888926" xlink:href="#m7c4f1b389e" y="290.444108"/>
     <use style="fill:#800000;stroke:#800000;" x="195.168264" xlink:href="#m7c4f1b389e" y="289.883676"/>
     <use style="fill:#800000;stroke:#800000;" x="198.447603" xlink:href="#m7c4f1b389e" y="287.268324"/>
     <use style="fill:#800000;stroke:#800000;" x="201.726942" xlink:href="#m7c4f1b389e" y="290.630919"/>
     <use style="fill:#800000;stroke:#800000;" x="205.006281" xlink:href="#m7c4f1b389e" y="289.883676"/>
     <use style="fill:#800000;stroke:#800000;" x="208.28562" xlink:href="#m7c4f1b389e" y="290.81773"/>
     <use style="fill:#800000;stroke:#800000;" x="211.564959" xlink:href="#m7c4f1b389e" y="290.630919"/>
     <use style="fill:#800000;stroke:#800000;" x="214.844298" xlink:href="#m7c4f1b389e" y="285.213405"/>
     <use style="fill:#800000;stroke:#800000;" x="218.123636" xlink:href="#m7c4f1b389e" y="291.004541"/>
     <use style="fill:#800000;stroke:#800000;" x="221.402975" xlink:href="#m7c4f1b389e" y="290.630919"/>
     <use style="fill:#800000;stroke:#800000;" x="224.682314" xlink:href="#m7c4f1b389e" y="290.070486"/>
     <use style="fill:#800000;stroke:#800000;" x="227.961653" xlink:href="#m7c4f1b389e" y="290.630919"/>
     <use style="fill:#800000;stroke:#800000;" x="231.240992" xlink:href="#m7c4f1b389e" y="290.444108"/>
     <use style="fill:#800000;stroke:#800000;" x="234.520331" xlink:href="#m7c4f1b389e" y="288.949622"/>
     <use style="fill:#800000;stroke:#800000;" x="237.799669" xlink:href="#m7c4f1b389e" y="290.630919"/>
     <use style="fill:#800000;stroke:#800000;" x="241.079008" xlink:href="#m7c4f1b389e" y="290.630919"/>
     <use style="fill:#800000;stroke:#800000;" x="244.358347" xlink:href="#m7c4f1b389e" y="291.004541"/>
     <use style="fill:#800000;stroke:#800000;" x="247.637686" xlink:href="#m7c4f1b389e" y="291.004541"/>
     <use style="fill:#800000;stroke:#800000;" x="250.917025" xlink:href="#m7c4f1b389e" y="290.257297"/>
     <use style="fill:#800000;stroke:#800000;" x="254.196364" xlink:href="#m7c4f1b389e" y="290.81773"/>
     <use style="fill:#800000;stroke:#800000;" x="257.475702" xlink:href="#m7c4f1b389e" y="290.630919"/>
     <use style="fill:#800000;stroke:#800000;" x="260.755041" xlink:href="#m7c4f1b389e" y="290.81773"/>
     <use style="fill:#800000;stroke:#800000;" x="264.03438" xlink:href="#m7c4f1b389e" y="290.81773"/>
     <use style="fill:#800000;stroke:#800000;" x="267.313719" xlink:href="#m7c4f1b389e" y="290.444108"/>
     <use style="fill:#800000;stroke:#800000;" x="270.593058" xlink:href="#m7c4f1b389e" y="290.257297"/>
     <use style="fill:#800000;stroke:#800000;" x="273.872397" xlink:href="#m7c4f1b389e" y="289.136432"/>
     <use style="fill:#800000;stroke:#800000;" x="277.151736" xlink:href="#m7c4f1b389e" y="286.894703"/>
     <use style="fill:#800000;stroke:#800000;" x="280.431074" xlink:href="#m7c4f1b389e" y="289.510054"/>
     <use style="fill:#800000;stroke:#800000;" x="283.710413" xlink:href="#m7c4f1b389e" y="290.444108"/>
     <use style="fill:#800000;stroke:#800000;" x="286.989752" xlink:href="#m7c4f1b389e" y="290.630919"/>
     <use style="fill:#800000;stroke:#800000;" x="290.269091" xlink:href="#m7c4f1b389e" y="284.839784"/>
     <use style="fill:#800000;stroke:#800000;" x="293.54843" xlink:href="#m7c4f1b389e" y="286.521081"/>
     <use style="fill:#800000;stroke:#800000;" x="296.827769" xlink:href="#m7c4f1b389e" y="285.773838"/>
     <use style="fill:#800000;stroke:#800000;" x="300.107107" xlink:href="#m7c4f1b389e" y="279.235459"/>
     <use style="fill:#800000;stroke:#800000;" x="303.386446" xlink:href="#m7c4f1b389e" y="282.411243"/>
     <use style="fill:#800000;stroke:#800000;" x="306.665785" xlink:href="#m7c4f1b389e" y="284.466162"/>
     <use style="fill:#800000;stroke:#800000;" x="309.945124" xlink:href="#m7c4f1b389e" y="284.279351"/>
     <use style="fill:#800000;stroke:#800000;" x="313.224463" xlink:href="#m7c4f1b389e" y="285.773838"/>
     <use style="fill:#800000;stroke:#800000;" x="316.503802" xlink:href="#m7c4f1b389e" y="282.224432"/>
     <use style="fill:#800000;stroke:#800000;" x="319.78314" xlink:href="#m7c4f1b389e" y="290.070486"/>
     <use style="fill:#800000;stroke:#800000;" x="323.062479" xlink:href="#m7c4f1b389e" y="289.696865"/>
     <use style="fill:#800000;stroke:#800000;" x="326.341818" xlink:href="#m7c4f1b389e" y="288.949622"/>
     <use style="fill:#800000;stroke:#800000;" x="329.621157" xlink:href="#m7c4f1b389e" y="290.070486"/>
     <use style="fill:#800000;stroke:#800000;" x="332.900496" xlink:href="#m7c4f1b389e" y="290.630919"/>
     <use style="fill:#800000;stroke:#800000;" x="336.179835" xlink:href="#m7c4f1b389e" y="290.257297"/>
     <use style="fill:#800000;stroke:#800000;" x="339.459174" xlink:href="#m7c4f1b389e" y="285.587027"/>
     <use style="fill:#800000;stroke:#800000;" x="342.738512" xlink:href="#m7c4f1b389e" y="288.015568"/>
     <use style="fill:#800000;stroke:#800000;" x="346.017851" xlink:href="#m7c4f1b389e" y="288.202378"/>
     <use style="fill:#800000;stroke:#800000;" x="349.29719" xlink:href="#m7c4f1b389e" y="286.894703"/>
     <use style="fill:#800000;stroke:#800000;" x="352.576529" xlink:href="#m7c4f1b389e" y="289.510054"/>
     <use style="fill:#800000;stroke:#800000;" x="355.855868" xlink:href="#m7c4f1b389e" y="289.510054"/>
     <use style="fill:#800000;stroke:#800000;" x="359.135207" xlink:href="#m7c4f1b389e" y="289.696865"/>
     <use style="fill:#800000;stroke:#800000;" x="362.414545" xlink:href="#m7c4f1b389e" y="289.510054"/>
     <use style="fill:#800000;stroke:#800000;" x="365.693884" xlink:href="#m7c4f1b389e" y="287.641946"/>
     <use style="fill:#800000;stroke:#800000;" x="368.973223" xlink:href="#m7c4f1b389e" y="288.015568"/>
     <use style="fill:#800000;stroke:#800000;" x="372.252562" xlink:href="#m7c4f1b389e" y="289.696865"/>
     <use style="fill:#800000;stroke:#800000;" x="375.531901" xlink:href="#m7c4f1b389e" y="290.070486"/>
     <use style="fill:#800000;stroke:#800000;" x="378.81124" xlink:href="#m7c4f1b389e" y="288.202378"/>
     <use style="fill:#800000;stroke:#800000;" x="382.090579" xlink:href="#m7c4f1b389e" y="288.015568"/>
     <use style="fill:#800000;stroke:#800000;" x="385.369917" xlink:href="#m7c4f1b389e" y="288.949622"/>
     <use style="fill:#800000;stroke:#800000;" x="388.649256" xlink:href="#m7c4f1b389e" y="288.949622"/>
     <use style="fill:#800000;stroke:#800000;" x="391.928595" xlink:href="#m7c4f1b389e" y="288.576"/>
     <use style="fill:#800000;stroke:#800000;" x="395.207934" xlink:href="#m7c4f1b389e" y="289.696865"/>
     <use style="fill:#800000;stroke:#800000;" x="398.487273" xlink:href="#m7c4f1b389e" y="290.81773"/>
    </g>
   </g>
   <g id="patch_3">
    <path d="M 57.6 307.584 
L 57.6 41.472 
" style="fill:none;stroke:#000000;stroke-linecap:square;stroke-linejoin:miter;stroke-width:0.8;"/>
   </g>
   <g id="patch_4">
    <path d="M 414.72 307.584 
L 414.72 41.472 
" style="fill:none;stroke:#000000;stroke-linecap:square;stroke-linejoin:miter;stroke-width:0.8;"/>
   </g>
   <g id="patch_5">
    <path d="M 57.6 307.584 
L 414.72 307.584 
" style="fill:none;stroke:#000000;stroke-linecap:square;stroke-linejoin:miter;stroke-width:0.8;"/>
   </g>
   <g id="patch_6">
    <path d="M 57.6 41.472 
L 414.72 41.472 
" style="fill:none;stroke:#000000;stroke-linecap:square;stroke-linejoin:miter;stroke-width:0.8;"/>
   </g>
   <g id="text_16">
    <!-- Task2 experiment -->
    <defs>
     <path d="M -0.296875 72.90625 
L 61.375 72.90625 
L 61.375 64.59375 
L 35.5 64.59375 
L 35.5 0 
L 25.59375 0 
L 25.59375 64.59375 
L -0.296875 64.59375 
z
" id="DejaVuSans-84"/>
     <path d="M 9.078125 75.984375 
L 18.109375 75.984375 
L 18.109375 31.109375 
L 44.921875 54.6875 
L 56.390625 54.6875 
L 27.390625 29.109375 
L 57.625 0 
L 45.90625 0 
L 18.109375 26.703125 
L 18.109375 0 
L 9.078125 0 
z
" id="DejaVuSans-107"/>
     <path d="M 54.890625 54.6875 
L 35.109375 28.078125 
L 55.90625 0 
L 45.3125 0 
L 29.390625 21.484375 
L 13.484375 0 
L 2.875 0 
L 24.125 28.609375 
L 4.6875 54.6875 
L 15.28125 54.6875 
L 29.78125 35.203125 
L 44.28125 54.6875 
z
" id="DejaVuSans-120"/>
     <path d="M 18.109375 8.203125 
L 18.109375 -20.796875 
L 9.078125 -20.796875 
L 9.078125 54.6875 
L 18.109375 54.6875 
L 18.109375 46.390625 
Q 20.953125 51.265625 25.265625 53.625 
Q 29.59375 56 35.59375 56 
Q 45.5625 56 51.78125 48.09375 
Q 58.015625 40.1875 58.015625 27.296875 
Q 58.015625 14.40625 51.78125 6.484375 
Q 45.5625 -1.421875 35.59375 -1.421875 
Q 29.59375 -1.421875 25.265625 0.953125 
Q 20.953125 3.328125 18.109375 8.203125 
z
M 48.6875 27.296875 
Q 48.6875 37.203125 44.609375 42.84375 
Q 40.53125 48.484375 33.40625 48.484375 
Q 26.265625 48.484375 22.1875 42.84375 
Q 18.109375 37.203125 18.109375 27.296875 
Q 18.109375 17.390625 22.1875 11.75 
Q 26.265625 6.109375 33.40625 6.109375 
Q 40.53125 6.109375 44.609375 11.75 
Q 48.6875 17.390625 48.6875 27.296875 
z
" id="DejaVuSans-112"/>
    </defs>
    <g transform="translate(181.941563 35.472)scale(0.12 -0.12)">
     <use xlink:href="#DejaVuSans-84"/>
     <use x="60.833984" xlink:href="#DejaVuSans-97"/>
     <use x="122.113281" xlink:href="#DejaVuSans-115"/>
     <use x="174.212891" xlink:href="#DejaVuSans-107"/>
     <use x="232.123047" xlink:href="#DejaVuSans-50"/>
     <use x="295.746094" xlink:href="#DejaVuSans-32"/>
     <use x="327.533203" xlink:href="#DejaVuSans-101"/>
     <use x="389.041016" xlink:href="#DejaVuSans-120"/>
     <use x="448.220703" xlink:href="#DejaVuSans-112"/>
     <use x="511.697266" xlink:href="#DejaVuSans-101"/>
     <use x="573.220703" xlink:href="#DejaVuSans-114"/>
     <use x="614.333984" xlink:href="#DejaVuSans-105"/>
     <use x="642.117188" xlink:href="#DejaVuSans-109"/>
     <use x="739.529297" xlink:href="#DejaVuSans-101"/>
     <use x="801.052734" xlink:href="#DejaVuSans-110"/>
     <use x="864.431641" xlink:href="#DejaVuSans-116"/>
    </g>
   </g>
   <g id="legend_1">
    <g id="patch_7">
     <path d="M 273.27 108.1845 
L 407.72 108.1845 
Q 409.72 108.1845 409.72 106.1845 
L 409.72 48.472 
Q 409.72 46.472 407.72 46.472 
L 273.27 46.472 
Q 271.27 46.472 271.27 48.472 
L 271.27 106.1845 
Q 271.27 108.1845 273.27 108.1845 
z
" style="fill:#ffffff;opacity:0.8;stroke:#cccccc;stroke-linejoin:miter;"/>
    </g>
    <g id="line2d_18">
     <path d="M 275.27 54.570438 
L 295.27 54.570438 
" style="fill:none;stroke:#000080;stroke-linecap:square;stroke-width:2;"/>
    </g>
    <g id="line2d_19">
     <g>
      <use style="fill:#000080;stroke:#000080;" x="285.27" xlink:href="#m5e64f44ee0" y="54.570438"/>
     </g>
    </g>
    <g id="text_17">
     <!-- Mergesort -->
     <defs>
      <path d="M 9.8125 72.90625 
L 24.515625 72.90625 
L 43.109375 23.296875 
L 61.8125 72.90625 
L 76.515625 72.90625 
L 76.515625 0 
L 66.890625 0 
L 66.890625 64.015625 
L 48.09375 14.015625 
L 38.1875 14.015625 
L 19.390625 64.015625 
L 19.390625 0 
L 9.8125 0 
z
" id="DejaVuSans-77"/>
      <path d="M 45.40625 27.984375 
Q 45.40625 37.75 41.375 43.109375 
Q 37.359375 48.484375 30.078125 48.484375 
Q 22.859375 48.484375 18.828125 43.109375 
Q 14.796875 37.75 14.796875 27.984375 
Q 14.796875 18.265625 18.828125 12.890625 
Q 22.859375 7.515625 30.078125 7.515625 
Q 37.359375 7.515625 41.375 12.890625 
Q 45.40625 18.265625 45.40625 27.984375 
z
M 54.390625 6.78125 
Q 54.390625 -7.171875 48.1875 -13.984375 
Q 42 -20.796875 29.203125 -20.796875 
Q 24.46875 -20.796875 20.265625 -20.09375 
Q 16.0625 -19.390625 12.109375 -17.921875 
L 12.109375 -9.1875 
Q 16.0625 -11.328125 19.921875 -12.34375 
Q 23.78125 -13.375 27.78125 -13.375 
Q 36.625 -13.375 41.015625 -8.765625 
Q 45.40625 -4.15625 45.40625 5.171875 
L 45.40625 9.625 
Q 42.625 4.78125 38.28125 2.390625 
Q 33.9375 0 27.875 0 
Q 17.828125 0 11.671875 7.65625 
Q 5.515625 15.328125 5.515625 27.984375 
Q 5.515625 40.671875 11.671875 48.328125 
Q 17.828125 56 27.875 56 
Q 33.9375 56 38.28125 53.609375 
Q 42.625 51.21875 45.40625 46.390625 
L 45.40625 54.6875 
L 54.390625 54.6875 
z
" id="DejaVuSans-103"/>
     </defs>
     <g transform="translate(303.27 58.070438)scale(0.1 -0.1)">
      <use xlink:href="#DejaVuSans-77"/>
      <use x="86.279297" xlink:href="#DejaVuSans-101"/>
      <use x="147.802734" xlink:href="#DejaVuSans-114"/>
      <use x="188.900391" xlink:href="#DejaVuSans-103"/>
      <use x="252.376953" xlink:href="#DejaVuSans-101"/>
      <use x="313.900391" xlink:href="#DejaVuSans-115"/>
      <use x="366" xlink:href="#DejaVuSans-111"/>
      <use x="427.181641" xlink:href="#DejaVuSans-114"/>
      <use x="468.294922" xlink:href="#DejaVuSans-116"/>
     </g>
    </g>
    <g id="line2d_20">
     <path d="M 275.27 69.248563 
L 295.27 69.248563 
" style="fill:none;stroke:#00d4ff;stroke-linecap:square;stroke-width:2;"/>
    </g>
    <g id="line2d_21">
     <g>
      <use style="fill:#00d4ff;stroke:#00d4ff;" x="285.27" xlink:href="#mda81a4b980" y="69.248563"/>
     </g>
    </g>
    <g id="text_18">
     <!-- Quicksort -->
     <defs>
      <path d="M 39.40625 66.21875 
Q 28.65625 66.21875 22.328125 58.203125 
Q 16.015625 50.203125 16.015625 36.375 
Q 16.015625 22.609375 22.328125 14.59375 
Q 28.65625 6.59375 39.40625 6.59375 
Q 50.140625 6.59375 56.421875 14.59375 
Q 62.703125 22.609375 62.703125 36.375 
Q 62.703125 50.203125 56.421875 58.203125 
Q 50.140625 66.21875 39.40625 66.21875 
z
M 53.21875 1.3125 
L 66.21875 -12.890625 
L 54.296875 -12.890625 
L 43.5 -1.21875 
Q 41.890625 -1.3125 41.03125 -1.359375 
Q 40.1875 -1.421875 39.40625 -1.421875 
Q 24.03125 -1.421875 14.8125 8.859375 
Q 5.609375 19.140625 5.609375 36.375 
Q 5.609375 53.65625 14.8125 63.9375 
Q 24.03125 74.21875 39.40625 74.21875 
Q 54.734375 74.21875 63.90625 63.9375 
Q 73.09375 53.65625 73.09375 36.375 
Q 73.09375 23.6875 67.984375 14.640625 
Q 62.890625 5.609375 53.21875 1.3125 
z
" id="DejaVuSans-81"/>
      <path d="M 8.5 21.578125 
L 8.5 54.6875 
L 17.484375 54.6875 
L 17.484375 21.921875 
Q 17.484375 14.15625 20.5 10.265625 
Q 23.53125 6.390625 29.59375 6.390625 
Q 36.859375 6.390625 41.078125 11.03125 
Q 45.3125 15.671875 45.3125 23.6875 
L 45.3125 54.6875 
L 54.296875 54.6875 
L 54.296875 0 
L 45.3125 0 
L 45.3125 8.40625 
Q 42.046875 3.421875 37.71875 1 
Q 33.40625 -1.421875 27.6875 -1.421875 
Q 18.265625 -1.421875 13.375 4.4375 
Q 8.5 10.296875 8.5 21.578125 
z
M 31.109375 56 
z
" id="DejaVuSans-117"/>
     </defs>
     <g transform="translate(303.27 72.748563)scale(0.1 -0.1)">
      <use xlink:href="#DejaVuSans-81"/>
      <use x="78.710938" xlink:href="#DejaVuSans-117"/>
      <use x="142.089844" xlink:href="#DejaVuSans-105"/>
      <use x="169.873047" xlink:href="#DejaVuSans-99"/>
      <use x="224.853516" xlink:href="#DejaVuSans-107"/>
      <use x="282.763672" xlink:href="#DejaVuSans-115"/>
      <use x="334.863281" xlink:href="#DejaVuSans-111"/>
      <use x="396.044922" xlink:href="#DejaVuSans-114"/>
      <use x="437.158203" xlink:href="#DejaVuSans-116"/>
     </g>
    </g>
    <g id="line2d_22">
     <path d="M 275.27 83.926688 
L 295.27 83.926688 
" style="fill:none;stroke:#ffe600;stroke-linecap:square;stroke-width:2;"/>
    </g>
    <g id="line2d_23">
     <g>
      <use style="fill:#ffe600;stroke:#ffe600;" x="285.27" xlink:href="#m33d9019670" y="83.926688"/>
     </g>
    </g>
    <g id="text_19">
     <!-- Heapsort -->
     <defs>
      <path d="M 9.8125 72.90625 
L 19.671875 72.90625 
L 19.671875 43.015625 
L 55.515625 43.015625 
L 55.515625 72.90625 
L 65.375 72.90625 
L 65.375 0 
L 55.515625 0 
L 55.515625 34.71875 
L 19.671875 34.71875 
L 19.671875 0 
L 9.8125 0 
z
" id="DejaVuSans-72"/>
     </defs>
     <g transform="translate(303.27 87.426688)scale(0.1 -0.1)">
      <use xlink:href="#DejaVuSans-72"/>
      <use x="75.195312" xlink:href="#DejaVuSans-101"/>
      <use x="136.71875" xlink:href="#DejaVuSans-97"/>
      <use x="197.998047" xlink:href="#DejaVuSans-112"/>
      <use x="261.474609" xlink:href="#DejaVuSans-115"/>
      <use x="313.574219" xlink:href="#DejaVuSans-111"/>
      <use x="374.755859" xlink:href="#DejaVuSans-114"/>
      <use x="415.869141" xlink:href="#DejaVuSans-116"/>
     </g>
    </g>
    <g id="line2d_24">
     <path d="M 275.27 98.604813 
L 295.27 98.604813 
" style="fill:none;stroke:#800000;stroke-linecap:square;stroke-width:2;"/>
    </g>
    <g id="line2d_25">
     <g>
      <use style="fill:#800000;stroke:#800000;" x="285.27" xlink:href="#m7c4f1b389e" y="98.604813"/>
     </g>
    </g>
    <g id="text_20">
     <!-- Dual-pivot Quicksort -->
     <defs>
      <path d="M 19.671875 64.796875 
L 19.671875 8.109375 
L 31.59375 8.109375 
Q 46.6875 8.109375 53.6875 14.9375 
Q 60.6875 21.78125 60.6875 36.53125 
Q 60.6875 51.171875 53.6875 57.984375 
Q 46.6875 64.796875 31.59375 64.796875 
z
M 9.8125 72.90625 
L 30.078125 72.90625 
Q 51.265625 72.90625 61.171875 64.09375 
Q 71.09375 55.28125 71.09375 36.53125 
Q 71.09375 17.671875 61.125 8.828125 
Q 51.171875 0 30.078125 0 
L 9.8125 0 
z
" id="DejaVuSans-68"/>
      <path d="M 9.421875 75.984375 
L 18.40625 75.984375 
L 18.40625 0 
L 9.421875 0 
z
" id="DejaVuSans-108"/>
      <path d="M 4.890625 31.390625 
L 31.203125 31.390625 
L 31.203125 23.390625 
L 4.890625 23.390625 
z
" id="DejaVuSans-45"/>
      <path d="M 2.984375 54.6875 
L 12.5 54.6875 
L 29.59375 8.796875 
L 46.6875 54.6875 
L 56.203125 54.6875 
L 35.6875 0 
L 23.484375 0 
z
" id="DejaVuSans-118"/>
     </defs>
     <g transform="translate(303.27 102.104813)scale(0.1 -0.1)">
      <use xlink:href="#DejaVuSans-68"/>
      <use x="77.001953" xlink:href="#DejaVuSans-117"/>
      <use x="140.380859" xlink:href="#DejaVuSans-97"/>
      <use x="201.660156" xlink:href="#DejaVuSans-108"/>
      <use x="229.443359" xlink:href="#DejaVuSans-45"/>
      <use x="265.527344" xlink:href="#DejaVuSans-112"/>
      <use x="329.003906" xlink:href="#DejaVuSans-105"/>
      <use x="356.787109" xlink:href="#DejaVuSans-118"/>
      <use x="415.966797" xlink:href="#DejaVuSans-111"/>
      <use x="477.148438" xlink:href="#DejaVuSans-116"/>
      <use x="516.357422" xlink:href="#DejaVuSans-32"/>
      <use x="548.144531" xlink:href="#DejaVuSans-81"/>
      <use x="626.855469" xlink:href="#DejaVuSans-117"/>
      <use x="690.234375" xlink:href="#DejaVuSans-105"/>
      <use x="718.017578" xlink:href="#DejaVuSans-99"/>
      <use x="772.998047" xlink:href="#DejaVuSans-107"/>
      <use x="830.908203" xlink:href="#DejaVuSans-115"/>
      <use x="883.007812" xlink:href="#DejaVuSans-111"/>
      <use x="944.189453" xlink:href="#DejaVuSans-114"/>
      <use x="985.302734" xlink:href="#DejaVuSans-116"/>
     </g>
    </g>
   </g>
  </g>
 </g>
 <defs>
  <clipPath id="p03ee4995e7">
   <rect height="266.112" width="357.12" x="57.6" y="41.472"/>
  </clipPath>
 </defs>
</svg>
