Interation;Mergesort;Quicksort;Heapsort;Dual-pivot Quicksort;RadixSort
1;275;165;321;246;191;
2;228;166;294;179;187;
3;224;176;297;181;188;
4;254;174;298;177;187;
5;222;164;299;184;198;
6;223;171;308;183;189;
7;240;164;298;177;188;
8;229;168;298;179;187;
9;222;181;303;177;186;
10;217;157;280;158;225;
