{
    "name": "Hydroqc Add-on",
    "version": "v0.12.3-1",
    "slug": "hydroqc",
    "description": "Get your consumption data from your HydroQuebec account to your MQTT using this hass addon",
    "url": "https://gitlab.com/fabio.germann/hydroqc-hass-addons",
    "image": "registry.gitlab.com/fabio.germann/hydroqc-hass-addons/{arch}",
    "arch": [
        "armhf",
        "armv7",
        "aarch64",
        "amd64",
        "i386"
    ],
    "init": "false",
    "homeassistant_api": true,
    "apparmor": true,
    "codenotary": "fabio.germann@gmail.com",
    "map": [
        "config:rw"
    ],
    "services": [
        "mqtt:need"
    ],
    "options": {
        "hq_username": null,
        "hq_password": null,
        "hq_customer": null,
        "hq_account": null,
        "hq_contract": null,
        "sync_hourly_consumption": true,
        "preheat_duration_minutes": 180
    },
    "schema": {
        "hq_username": "email",
        "hq_password": "password",
        "hq_customer": "match(^\\d{10}$)",
        "hq_account": "match(^\\d{12}$)",
        "hq_contract": "match(^\\d{10}$)",
        "hq_rate": "str?",
        "hq_rate_option": "str?",
        "sync_hourly_consumption": "bool",
        "preheat_duration_minutes": "int(0,)?",
        "mqtt_discovery_data_topic": "str?",
        "mqtt_data_root_topic": "str?",
        "mqtt_username": "str?",
        "mqtt_password": "password?",
        "mqtt_server": "str?",
        "mqtt_port": "str?",
        "ha_url": "str?",
        "ha_token": "str?",
        "timezone": "str?",
        "log_level": "list(DEBUG|INFO|WARNING|ERROR|CRITICAL)?",
        "hydroqc_config_file": "str?"
    }
}
