{
  "$anchor": "hello-pando-component",
  "$schema": "https://json-schema.org/draft/2020-12/schema",
  "type": "object",
  "$merge": {
    "source": {
      "$ref": "component"
    },
    "with": {
      "required": [
        "_items"
      ],
      "properties": {
        "_supportedLayout": {
          "type": "string",
          "title": "Supported layout",
          "default": "full-width",
          "_adapt": {
            "editorOnly": true
          }
        },
        "instruction": {
          "type": "string",
          "title": "Instrução",
          "default": "Selecione o item do lado esquerdo, depois selecione o item do lado direito que corresponda ao esquerdo.",
          "_adapt": {
            "translatable": true
          }
        },
        "_setCompletionOn": {
          "type": "string",
          "title": "Set completion on:",
          "description": "Whether completion is based on the learner having viewed all the items - or just having viewed the component",
          "default": "allItems",
          "enum": [
            "inview",
            "allItems"
          ],
          "_backboneForms": "Select"
        },
        "_items": {
          "type": "array",
          "title": "Items",
          "items": {
            "type": "object",
            "properties": {
              "title": {
                "type": "string",
                "title": "Título do item",
                "default": "",
                "_adapt": {
                  "translatable": true
                }
              },
              "_classes": {
                "type": "string",
                "title": "Classe do item",
                "description": "Digite uma classe personalizada.",
                "default": ""
              },
              "_value": {
                "type": "number",
                "title": "Valor de comparação",
                "description": "Coloque o valor que será correspondente ao outro item",
                "default": ""
              }
            }
          }
        },
        "_items2": {
          "type": "array",
          "title": "Items 2",
          "items": {
            "type": "object",
            "properties": {
              "title": {
                "type": "string",
                "title": "Título do item",
                "default": "",
                "_adapt": {
                  "translatable": true
                }
              },
              "_classes": {
                "type": "string",
                "title": "Classe do item",
                "description": "Digite uma classe personalizada.",
                "default": ""
              },
              "_value": {
                "type": "number",
                "title": "Valor de comparação",
                "description": "Coloque o valor que será correspondente ao outro item",
                "default": ""
              }
            }
          }
        }
      }
    }
  }
}
