(kicad_sch (version 20211123) (generator eeschema)

  (uuid b4d73ef7-d069-453b-a7bd-227eec81fabc)

  (paper "A4")

  (title_block
    (title "ESP32 Relaiskarte")
    (date "2022-03-23")
    (rev "0.0.2")
    (company "makerspace Bocholt")
    (comment 1 "+ optionale Servo Ansteuerung")
    (comment 2 "+ optionale Lan Karte")
    (comment 4 "Frank Tobergte")
  )

  (lib_symbols
    (symbol "Connector:Conn_01x05_Female" (pin_names (offset 1.016) hide) (in_bom yes) (on_board yes)
      (property "Reference" "J" (id 0) (at 0 7.62 0)
        (effects (font (size 1.27 1.27)))
      )
      (property "Value" "Conn_01x05_Female" (id 1) (at 0 -7.62 0)
        (effects (font (size 1.27 1.27)))
      )
      (property "Footprint" "" (id 2) (at 0 0 0)
        (effects (font (size 1.27 1.27)) hide)
      )
      (property "Datasheet" "~" (id 3) (at 0 0 0)
        (effects (font (size 1.27 1.27)) hide)
      )
      (property "ki_keywords" "connector" (id 4) (at 0 0 0)
        (effects (font (size 1.27 1.27)) hide)
      )
      (property "ki_description" "Generic connector, single row, 01x05, script generated (kicad-library-utils/schlib/autogen/connector/)" (id 5) (at 0 0 0)
        (effects (font (size 1.27 1.27)) hide)
      )
      (property "ki_fp_filters" "Connector*:*_1x??_*" (id 6) (at 0 0 0)
        (effects (font (size 1.27 1.27)) hide)
      )
      (symbol "Conn_01x05_Female_1_1"
        (arc (start 0 -4.572) (mid -0.508 -5.08) (end 0 -5.588)
          (stroke (width 0.1524) (type default) (color 0 0 0 0))
          (fill (type none))
        )
        (arc (start 0 -2.032) (mid -0.508 -2.54) (end 0 -3.048)
          (stroke (width 0.1524) (type default) (color 0 0 0 0))
          (fill (type none))
        )
        (polyline
          (pts
            (xy -1.27 -5.08)
            (xy -0.508 -5.08)
          )
          (stroke (width 0.1524) (type default) (color 0 0 0 0))
          (fill (type none))
        )
        (polyline
          (pts
            (xy -1.27 -2.54)
            (xy -0.508 -2.54)
          )
          (stroke (width 0.1524) (type default) (color 0 0 0 0))
          (fill (type none))
        )
        (polyline
          (pts
            (xy -1.27 0)
            (xy -0.508 0)
          )
          (stroke (width 0.1524) (type default) (color 0 0 0 0))
          (fill (type none))
        )
        (polyline
          (pts
            (xy -1.27 2.54)
            (xy -0.508 2.54)
          )
          (stroke (width 0.1524) (type default) (color 0 0 0 0))
          (fill (type none))
        )
        (polyline
          (pts
            (xy -1.27 5.08)
            (xy -0.508 5.08)
          )
          (stroke (width 0.1524) (type default) (color 0 0 0 0))
          (fill (type none))
        )
        (arc (start 0 0.508) (mid -0.508 0) (end 0 -0.508)
          (stroke (width 0.1524) (type default) (color 0 0 0 0))
          (fill (type none))
        )
        (arc (start 0 3.048) (mid -0.508 2.54) (end 0 2.032)
          (stroke (width 0.1524) (type default) (color 0 0 0 0))
          (fill (type none))
        )
        (arc (start 0 5.588) (mid -0.508 5.08) (end 0 4.572)
          (stroke (width 0.1524) (type default) (color 0 0 0 0))
          (fill (type none))
        )
        (pin passive line (at -5.08 5.08 0) (length 3.81)
          (name "Pin_1" (effects (font (size 1.27 1.27))))
          (number "1" (effects (font (size 1.27 1.27))))
        )
        (pin passive line (at -5.08 2.54 0) (length 3.81)
          (name "Pin_2" (effects (font (size 1.27 1.27))))
          (number "2" (effects (font (size 1.27 1.27))))
        )
        (pin passive line (at -5.08 0 0) (length 3.81)
          (name "Pin_3" (effects (font (size 1.27 1.27))))
          (number "3" (effects (font (size 1.27 1.27))))
        )
        (pin passive line (at -5.08 -2.54 0) (length 3.81)
          (name "Pin_4" (effects (font (size 1.27 1.27))))
          (number "4" (effects (font (size 1.27 1.27))))
        )
        (pin passive line (at -5.08 -5.08 0) (length 3.81)
          (name "Pin_5" (effects (font (size 1.27 1.27))))
          (number "5" (effects (font (size 1.27 1.27))))
        )
      )
    )
    (symbol "Connector:Conn_01x05_Male" (pin_names (offset 1.016) hide) (in_bom yes) (on_board yes)
      (property "Reference" "J" (id 0) (at 0 7.62 0)
        (effects (font (size 1.27 1.27)))
      )
      (property "Value" "Conn_01x05_Male" (id 1) (at 0 -7.62 0)
        (effects (font (size 1.27 1.27)))
      )
      (property "Footprint" "" (id 2) (at 0 0 0)
        (effects (font (size 1.27 1.27)) hide)
      )
      (property "Datasheet" "~" (id 3) (at 0 0 0)
        (effects (font (size 1.27 1.27)) hide)
      )
      (property "ki_keywords" "connector" (id 4) (at 0 0 0)
        (effects (font (size 1.27 1.27)) hide)
      )
      (property "ki_description" "Generic connector, single row, 01x05, script generated (kicad-library-utils/schlib/autogen/connector/)" (id 5) (at 0 0 0)
        (effects (font (size 1.27 1.27)) hide)
      )
      (property "ki_fp_filters" "Connector*:*_1x??_*" (id 6) (at 0 0 0)
        (effects (font (size 1.27 1.27)) hide)
      )
      (symbol "Conn_01x05_Male_1_1"
        (polyline
          (pts
            (xy 1.27 -5.08)
            (xy 0.8636 -5.08)
          )
          (stroke (width 0.1524) (type default) (color 0 0 0 0))
          (fill (type none))
        )
        (polyline
          (pts
            (xy 1.27 -2.54)
            (xy 0.8636 -2.54)
          )
          (stroke (width 0.1524) (type default) (color 0 0 0 0))
          (fill (type none))
        )
        (polyline
          (pts
            (xy 1.27 0)
            (xy 0.8636 0)
          )
          (stroke (width 0.1524) (type default) (color 0 0 0 0))
          (fill (type none))
        )
        (polyline
          (pts
            (xy 1.27 2.54)
            (xy 0.8636 2.54)
          )
          (stroke (width 0.1524) (type default) (color 0 0 0 0))
          (fill (type none))
        )
        (polyline
          (pts
            (xy 1.27 5.08)
            (xy 0.8636 5.08)
          )
          (stroke (width 0.1524) (type default) (color 0 0 0 0))
          (fill (type none))
        )
        (rectangle (start 0.8636 -4.953) (end 0 -5.207)
          (stroke (width 0.1524) (type default) (color 0 0 0 0))
          (fill (type outline))
        )
        (rectangle (start 0.8636 -2.413) (end 0 -2.667)
          (stroke (width 0.1524) (type default) (color 0 0 0 0))
          (fill (type outline))
        )
        (rectangle (start 0.8636 0.127) (end 0 -0.127)
          (stroke (width 0.1524) (type default) (color 0 0 0 0))
          (fill (type outline))
        )
        (rectangle (start 0.8636 2.667) (end 0 2.413)
          (stroke (width 0.1524) (type default) (color 0 0 0 0))
          (fill (type outline))
        )
        (rectangle (start 0.8636 5.207) (end 0 4.953)
          (stroke (width 0.1524) (type default) (color 0 0 0 0))
          (fill (type outline))
        )
        (pin passive line (at 5.08 5.08 180) (length 3.81)
          (name "Pin_1" (effects (font (size 1.27 1.27))))
          (number "1" (effects (font (size 1.27 1.27))))
        )
        (pin passive line (at 5.08 2.54 180) (length 3.81)
          (name "Pin_2" (effects (font (size 1.27 1.27))))
          (number "2" (effects (font (size 1.27 1.27))))
        )
        (pin passive line (at 5.08 0 180) (length 3.81)
          (name "Pin_3" (effects (font (size 1.27 1.27))))
          (number "3" (effects (font (size 1.27 1.27))))
        )
        (pin passive line (at 5.08 -2.54 180) (length 3.81)
          (name "Pin_4" (effects (font (size 1.27 1.27))))
          (number "4" (effects (font (size 1.27 1.27))))
        )
        (pin passive line (at 5.08 -5.08 180) (length 3.81)
          (name "Pin_5" (effects (font (size 1.27 1.27))))
          (number "5" (effects (font (size 1.27 1.27))))
        )
      )
    )
    (symbol "Connector:Screw_Terminal_01x02" (pin_names (offset 1.016) hide) (in_bom yes) (on_board yes)
      (property "Reference" "J" (id 0) (at 0 2.54 0)
        (effects (font (size 1.27 1.27)))
      )
      (property "Value" "Screw_Terminal_01x02" (id 1) (at 0 -5.08 0)
        (effects (font (size 1.27 1.27)))
      )
      (property "Footprint" "" (id 2) (at 0 0 0)
        (effects (font (size 1.27 1.27)) hide)
      )
      (property "Datasheet" "~" (id 3) (at 0 0 0)
        (effects (font (size 1.27 1.27)) hide)
      )
      (property "ki_keywords" "screw terminal" (id 4) (at 0 0 0)
        (effects (font (size 1.27 1.27)) hide)
      )
      (property "ki_description" "Generic screw terminal, single row, 01x02, script generated (kicad-library-utils/schlib/autogen/connector/)" (id 5) (at 0 0 0)
        (effects (font (size 1.27 1.27)) hide)
      )
      (property "ki_fp_filters" "TerminalBlock*:*" (id 6) (at 0 0 0)
        (effects (font (size 1.27 1.27)) hide)
      )
      (symbol "Screw_Terminal_01x02_1_1"
        (rectangle (start -1.27 1.27) (end 1.27 -3.81)
          (stroke (width 0.254) (type default) (color 0 0 0 0))
          (fill (type background))
        )
        (circle (center 0 -2.54) (radius 0.635)
          (stroke (width 0.1524) (type default) (color 0 0 0 0))
          (fill (type none))
        )
        (polyline
          (pts
            (xy -0.5334 -2.2098)
            (xy 0.3302 -3.048)
          )
          (stroke (width 0.1524) (type default) (color 0 0 0 0))
          (fill (type none))
        )
        (polyline
          (pts
            (xy -0.5334 0.3302)
            (xy 0.3302 -0.508)
          )
          (stroke (width 0.1524) (type default) (color 0 0 0 0))
          (fill (type none))
        )
        (polyline
          (pts
            (xy -0.3556 -2.032)
            (xy 0.508 -2.8702)
          )
          (stroke (width 0.1524) (type default) (color 0 0 0 0))
          (fill (type none))
        )
        (polyline
          (pts
            (xy -0.3556 0.508)
            (xy 0.508 -0.3302)
          )
          (stroke (width 0.1524) (type default) (color 0 0 0 0))
          (fill (type none))
        )
        (circle (center 0 0) (radius 0.635)
          (stroke (width 0.1524) (type default) (color 0 0 0 0))
          (fill (type none))
        )
        (pin passive line (at -5.08 0 0) (length 3.81)
          (name "Pin_1" (effects (font (size 1.27 1.27))))
          (number "1" (effects (font (size 1.27 1.27))))
        )
        (pin passive line (at -5.08 -2.54 0) (length 3.81)
          (name "Pin_2" (effects (font (size 1.27 1.27))))
          (number "2" (effects (font (size 1.27 1.27))))
        )
      )
    )
    (symbol "Connector:Screw_Terminal_01x04" (pin_names (offset 1.016) hide) (in_bom yes) (on_board yes)
      (property "Reference" "J" (id 0) (at 0 5.08 0)
        (effects (font (size 1.27 1.27)))
      )
      (property "Value" "Screw_Terminal_01x04" (id 1) (at 0 -7.62 0)
        (effects (font (size 1.27 1.27)))
      )
      (property "Footprint" "" (id 2) (at 0 0 0)
        (effects (font (size 1.27 1.27)) hide)
      )
      (property "Datasheet" "~" (id 3) (at 0 0 0)
        (effects (font (size 1.27 1.27)) hide)
      )
      (property "ki_keywords" "screw terminal" (id 4) (at 0 0 0)
        (effects (font (size 1.27 1.27)) hide)
      )
      (property "ki_description" "Generic screw terminal, single row, 01x04, script generated (kicad-library-utils/schlib/autogen/connector/)" (id 5) (at 0 0 0)
        (effects (font (size 1.27 1.27)) hide)
      )
      (property "ki_fp_filters" "TerminalBlock*:*" (id 6) (at 0 0 0)
        (effects (font (size 1.27 1.27)) hide)
      )
      (symbol "Screw_Terminal_01x04_1_1"
        (rectangle (start -1.27 3.81) (end 1.27 -6.35)
          (stroke (width 0.254) (type default) (color 0 0 0 0))
          (fill (type background))
        )
        (circle (center 0 -5.08) (radius 0.635)
          (stroke (width 0.1524) (type default) (color 0 0 0 0))
          (fill (type none))
        )
        (circle (center 0 -2.54) (radius 0.635)
          (stroke (width 0.1524) (type default) (color 0 0 0 0))
          (fill (type none))
        )
        (polyline
          (pts
            (xy -0.5334 -4.7498)
            (xy 0.3302 -5.588)
          )
          (stroke (width 0.1524) (type default) (color 0 0 0 0))
          (fill (type none))
        )
        (polyline
          (pts
            (xy -0.5334 -2.2098)
            (xy 0.3302 -3.048)
          )
          (stroke (width 0.1524) (type default) (color 0 0 0 0))
          (fill (type none))
        )
        (polyline
          (pts
            (xy -0.5334 0.3302)
            (xy 0.3302 -0.508)
          )
          (stroke (width 0.1524) (type default) (color 0 0 0 0))
          (fill (type none))
        )
        (polyline
          (pts
            (xy -0.5334 2.8702)
            (xy 0.3302 2.032)
          )
          (stroke (width 0.1524) (type default) (color 0 0 0 0))
          (fill (type none))
        )
        (polyline
          (pts
            (xy -0.3556 -4.572)
            (xy 0.508 -5.4102)
          )
          (stroke (width 0.1524) (type default) (color 0 0 0 0))
          (fill (type none))
        )
        (polyline
          (pts
            (xy -0.3556 -2.032)
            (xy 0.508 -2.8702)
          )
          (stroke (width 0.1524) (type default) (color 0 0 0 0))
          (fill (type none))
        )
        (polyline
          (pts
            (xy -0.3556 0.508)
            (xy 0.508 -0.3302)
          )
          (stroke (width 0.1524) (type default) (color 0 0 0 0))
          (fill (type none))
        )
        (polyline
          (pts
            (xy -0.3556 3.048)
            (xy 0.508 2.2098)
          )
          (stroke (width 0.1524) (type default) (color 0 0 0 0))
          (fill (type none))
        )
        (circle (center 0 0) (radius 0.635)
          (stroke (width 0.1524) (type default) (color 0 0 0 0))
          (fill (type none))
        )
        (circle (center 0 2.54) (radius 0.635)
          (stroke (width 0.1524) (type default) (color 0 0 0 0))
          (fill (type none))
        )
        (pin passive line (at -5.08 2.54 0) (length 3.81)
          (name "Pin_1" (effects (font (size 1.27 1.27))))
          (number "1" (effects (font (size 1.27 1.27))))
        )
        (pin passive line (at -5.08 0 0) (length 3.81)
          (name "Pin_2" (effects (font (size 1.27 1.27))))
          (number "2" (effects (font (size 1.27 1.27))))
        )
        (pin passive line (at -5.08 -2.54 0) (length 3.81)
          (name "Pin_3" (effects (font (size 1.27 1.27))))
          (number "3" (effects (font (size 1.27 1.27))))
        )
        (pin passive line (at -5.08 -5.08 0) (length 3.81)
          (name "Pin_4" (effects (font (size 1.27 1.27))))
          (number "4" (effects (font (size 1.27 1.27))))
        )
      )
    )
    (symbol "Device:R" (pin_numbers hide) (pin_names (offset 0)) (in_bom yes) (on_board yes)
      (property "Reference" "R" (id 0) (at 2.032 0 90)
        (effects (font (size 1.27 1.27)))
      )
      (property "Value" "R" (id 1) (at 0 0 90)
        (effects (font (size 1.27 1.27)))
      )
      (property "Footprint" "" (id 2) (at -1.778 0 90)
        (effects (font (size 1.27 1.27)) hide)
      )
      (property "Datasheet" "~" (id 3) (at 0 0 0)
        (effects (font (size 1.27 1.27)) hide)
      )
      (property "ki_keywords" "R res resistor" (id 4) (at 0 0 0)
        (effects (font (size 1.27 1.27)) hide)
      )
      (property "ki_description" "Resistor" (id 5) (at 0 0 0)
        (effects (font (size 1.27 1.27)) hide)
      )
      (property "ki_fp_filters" "R_*" (id 6) (at 0 0 0)
        (effects (font (size 1.27 1.27)) hide)
      )
      (symbol "R_0_1"
        (rectangle (start -1.016 -2.54) (end 1.016 2.54)
          (stroke (width 0.254) (type default) (color 0 0 0 0))
          (fill (type none))
        )
      )
      (symbol "R_1_1"
        (pin passive line (at 0 3.81 270) (length 1.27)
          (name "~" (effects (font (size 1.27 1.27))))
          (number "1" (effects (font (size 1.27 1.27))))
        )
        (pin passive line (at 0 -3.81 90) (length 1.27)
          (name "~" (effects (font (size 1.27 1.27))))
          (number "2" (effects (font (size 1.27 1.27))))
        )
      )
    )
    (symbol "Espressif:ESP32-DevKitC" (pin_names (offset 1.016)) (in_bom yes) (on_board yes)
      (property "Reference" "U" (id 0) (at -8.89 26.67 0)
        (effects (font (size 1.27 1.27)))
      )
      (property "Value" "ESP32-DevKitC" (id 1) (at 0 -29.21 0)
        (effects (font (size 1.27 1.27)))
      )
      (property "Footprint" "Espressif:ESP32-DevKitC" (id 2) (at 0 -31.75 0)
        (effects (font (size 1.27 1.27)) hide)
      )
      (property "Datasheet" "https://docs.espressif.com/projects/esp-idf/zh_CN/latest/esp32/hw-reference/esp32/get-started-devkitc.html" (id 3) (at 3.81 -31.75 0)
        (effects (font (size 1.27 1.27)) hide)
      )
      (property "ki_keywords" "ESP32" (id 4) (at 0 0 0)
        (effects (font (size 1.27 1.27)) hide)
      )
      (property "ki_description" "Development Kit" (id 5) (at 0 0 0)
        (effects (font (size 1.27 1.27)) hide)
      )
      (symbol "ESP32-DevKitC_0_0"
        (pin power_in line (at -33.02 -11.43 0) (length 2.54)
          (name "GND" (effects (font (size 1.27 1.27))))
          (number "14" (effects (font (size 1.27 1.27))))
        )
        (pin power_in line (at -33.02 -24.13 0) (length 2.54)
          (name "5V" (effects (font (size 1.27 1.27))))
          (number "19" (effects (font (size 1.27 1.27))))
        )
      )
      (symbol "ESP32-DevKitC_0_1"
        (rectangle (start -30.48 25.4) (end 34.29 -27.94)
          (stroke (width 0) (type default) (color 0 0 0 0))
          (fill (type background))
        )
      )
      (symbol "ESP32-DevKitC_1_1"
        (pin power_in line (at -33.02 21.59 0) (length 2.54)
          (name "3V3" (effects (font (size 1.27 1.27))))
          (number "1" (effects (font (size 1.27 1.27))))
        )
        (pin bidirectional line (at -33.02 -1.27 0) (length 2.54)
          (name "DAC_2/ADC2_CH9/GPIO26" (effects (font (size 1.27 1.27))))
          (number "10" (effects (font (size 1.27 1.27))))
        )
        (pin bidirectional line (at -33.02 -3.81 0) (length 2.54)
          (name "ADC2_CH7/GPIO27" (effects (font (size 1.27 1.27))))
          (number "11" (effects (font (size 1.27 1.27))))
        )
        (pin bidirectional line (at -33.02 -6.35 0) (length 2.54)
          (name "MTMS/GPIO14/ADC2_CH6" (effects (font (size 1.27 1.27))))
          (number "12" (effects (font (size 1.27 1.27))))
        )
        (pin bidirectional line (at -33.02 -8.89 0) (length 2.54)
          (name "*MTDI/GPIO12/ADC2_CH5" (effects (font (size 1.27 1.27))))
          (number "13" (effects (font (size 1.27 1.27))))
        )
        (pin bidirectional line (at -33.02 -13.97 0) (length 2.54)
          (name "MTCK/GPIO13/ADC2_CH4" (effects (font (size 1.27 1.27))))
          (number "15" (effects (font (size 1.27 1.27))))
        )
        (pin bidirectional line (at -33.02 -16.51 0) (length 2.54)
          (name "SD_DATA2/GPIO9" (effects (font (size 1.27 1.27))))
          (number "16" (effects (font (size 1.27 1.27))))
        )
        (pin bidirectional line (at -33.02 -19.05 0) (length 2.54)
          (name "SD_DATA3/GPIO10" (effects (font (size 1.27 1.27))))
          (number "17" (effects (font (size 1.27 1.27))))
        )
        (pin bidirectional line (at -33.02 -21.59 0) (length 2.54)
          (name "CMD" (effects (font (size 1.27 1.27))))
          (number "18" (effects (font (size 1.27 1.27))))
        )
        (pin input line (at -33.02 19.05 0) (length 2.54)
          (name "CHIP_PU" (effects (font (size 1.27 1.27))))
          (number "2" (effects (font (size 1.27 1.27))))
        )
        (pin bidirectional line (at 36.83 -24.13 180) (length 2.54)
          (name "SD_CLK/GPIO6" (effects (font (size 1.27 1.27))))
          (number "20" (effects (font (size 1.27 1.27))))
        )
        (pin bidirectional line (at 36.83 -21.59 180) (length 2.54)
          (name "SD_DATA0/GPIO7" (effects (font (size 1.27 1.27))))
          (number "21" (effects (font (size 1.27 1.27))))
        )
        (pin bidirectional line (at 36.83 -19.05 180) (length 2.54)
          (name "SD_DATA1/GPIO8" (effects (font (size 1.27 1.27))))
          (number "22" (effects (font (size 1.27 1.27))))
        )
        (pin bidirectional line (at 36.83 -16.51 180) (length 2.54)
          (name "*MTDO/GPIO15/ADC2_CH3" (effects (font (size 1.27 1.27))))
          (number "23" (effects (font (size 1.27 1.27))))
        )
        (pin bidirectional line (at 36.83 -13.97 180) (length 2.54)
          (name "ADC2_CH2/*GPIO2" (effects (font (size 1.27 1.27))))
          (number "24" (effects (font (size 1.27 1.27))))
        )
        (pin bidirectional line (at 36.83 -11.43 180) (length 2.54)
          (name "*GPIO0/BOOT/ADC2_CH1" (effects (font (size 1.27 1.27))))
          (number "25" (effects (font (size 1.27 1.27))))
        )
        (pin bidirectional line (at 36.83 -8.89 180) (length 2.54)
          (name "ADC2_CH0/GPIO4" (effects (font (size 1.27 1.27))))
          (number "26" (effects (font (size 1.27 1.27))))
        )
        (pin bidirectional line (at 36.83 -6.35 180) (length 2.54)
          (name "GPIO16" (effects (font (size 1.27 1.27))))
          (number "27" (effects (font (size 1.27 1.27))))
        )
        (pin bidirectional line (at 36.83 -3.81 180) (length 2.54)
          (name "GPIO17" (effects (font (size 1.27 1.27))))
          (number "28" (effects (font (size 1.27 1.27))))
        )
        (pin bidirectional line (at 36.83 -1.27 180) (length 2.54)
          (name "*GPIO5" (effects (font (size 1.27 1.27))))
          (number "29" (effects (font (size 1.27 1.27))))
        )
        (pin input line (at -33.02 16.51 0) (length 2.54)
          (name "SENSOR_VP/GPIO36/ADC1_CH0" (effects (font (size 1.27 1.27))))
          (number "3" (effects (font (size 1.27 1.27))))
        )
        (pin bidirectional line (at 36.83 1.27 180) (length 2.54)
          (name "GPIO18" (effects (font (size 1.27 1.27))))
          (number "30" (effects (font (size 1.27 1.27))))
        )
        (pin bidirectional line (at 36.83 3.81 180) (length 2.54)
          (name "GPIO19" (effects (font (size 1.27 1.27))))
          (number "31" (effects (font (size 1.27 1.27))))
        )
        (pin power_in line (at 36.83 6.35 180) (length 2.54)
          (name "GND" (effects (font (size 1.27 1.27))))
          (number "32" (effects (font (size 1.27 1.27))))
        )
        (pin bidirectional line (at 36.83 8.89 180) (length 2.54)
          (name "GPIO21" (effects (font (size 1.27 1.27))))
          (number "33" (effects (font (size 1.27 1.27))))
        )
        (pin bidirectional line (at 36.83 11.43 180) (length 2.54)
          (name "U0RXD/GPIO3" (effects (font (size 1.27 1.27))))
          (number "34" (effects (font (size 1.27 1.27))))
        )
        (pin bidirectional line (at 36.83 13.97 180) (length 2.54)
          (name "U0TXD/GPIO1" (effects (font (size 1.27 1.27))))
          (number "35" (effects (font (size 1.27 1.27))))
        )
        (pin bidirectional line (at 36.83 16.51 180) (length 2.54)
          (name "GPIO22" (effects (font (size 1.27 1.27))))
          (number "36" (effects (font (size 1.27 1.27))))
        )
        (pin bidirectional line (at 36.83 19.05 180) (length 2.54)
          (name "GPIO23" (effects (font (size 1.27 1.27))))
          (number "37" (effects (font (size 1.27 1.27))))
        )
        (pin power_in line (at 36.83 21.59 180) (length 2.54)
          (name "GND" (effects (font (size 1.27 1.27))))
          (number "38" (effects (font (size 1.27 1.27))))
        )
        (pin input line (at -33.02 13.97 0) (length 2.54)
          (name "SENSOR_VN/GPIO39/ADC1_CH3" (effects (font (size 1.27 1.27))))
          (number "4" (effects (font (size 1.27 1.27))))
        )
        (pin input line (at -33.02 11.43 0) (length 2.54)
          (name "VDET_1/GPIO34/ADC1_CH6" (effects (font (size 1.27 1.27))))
          (number "5" (effects (font (size 1.27 1.27))))
        )
        (pin input line (at -33.02 8.89 0) (length 2.54)
          (name "VDET_2/GPIO35/ADC1_CH7" (effects (font (size 1.27 1.27))))
          (number "6" (effects (font (size 1.27 1.27))))
        )
        (pin bidirectional line (at -33.02 6.35 0) (length 2.54)
          (name "32K_XP/GPIO32/ADC1_CH4" (effects (font (size 1.27 1.27))))
          (number "7" (effects (font (size 1.27 1.27))))
        )
        (pin bidirectional line (at -33.02 3.81 0) (length 2.54)
          (name "32K_XN/GPIO33/ADC1_CH5" (effects (font (size 1.27 1.27))))
          (number "8" (effects (font (size 1.27 1.27))))
        )
        (pin bidirectional line (at -33.02 1.27 0) (length 2.54)
          (name "DAC_1/ADC2_CH8/GPIO25" (effects (font (size 1.27 1.27))))
          (number "9" (effects (font (size 1.27 1.27))))
        )
      )
    )
    (symbol "Jumper:Jumper_2_Open" (pin_names (offset 0) hide) (in_bom yes) (on_board yes)
      (property "Reference" "JP" (id 0) (at 0 2.794 0)
        (effects (font (size 1.27 1.27)))
      )
      (property "Value" "Jumper_2_Open" (id 1) (at 0 -2.286 0)
        (effects (font (size 1.27 1.27)))
      )
      (property "Footprint" "" (id 2) (at 0 0 0)
        (effects (font (size 1.27 1.27)) hide)
      )
      (property "Datasheet" "~" (id 3) (at 0 0 0)
        (effects (font (size 1.27 1.27)) hide)
      )
      (property "ki_keywords" "Jumper SPST" (id 4) (at 0 0 0)
        (effects (font (size 1.27 1.27)) hide)
      )
      (property "ki_description" "Jumper, 2-pole, open" (id 5) (at 0 0 0)
        (effects (font (size 1.27 1.27)) hide)
      )
      (property "ki_fp_filters" "Jumper* TestPoint*2Pads* TestPoint*Bridge*" (id 6) (at 0 0 0)
        (effects (font (size 1.27 1.27)) hide)
      )
      (symbol "Jumper_2_Open_0_0"
        (circle (center -2.032 0) (radius 0.508)
          (stroke (width 0) (type default) (color 0 0 0 0))
          (fill (type none))
        )
        (circle (center 2.032 0) (radius 0.508)
          (stroke (width 0) (type default) (color 0 0 0 0))
          (fill (type none))
        )
      )
      (symbol "Jumper_2_Open_0_1"
        (arc (start 1.524 1.27) (mid 0 1.778) (end -1.524 1.27)
          (stroke (width 0) (type default) (color 0 0 0 0))
          (fill (type none))
        )
      )
      (symbol "Jumper_2_Open_1_1"
        (pin passive line (at -5.08 0 0) (length 2.54)
          (name "A" (effects (font (size 1.27 1.27))))
          (number "1" (effects (font (size 1.27 1.27))))
        )
        (pin passive line (at 5.08 0 180) (length 2.54)
          (name "B" (effects (font (size 1.27 1.27))))
          (number "2" (effects (font (size 1.27 1.27))))
        )
      )
    )
    (symbol "power:+12V" (power) (pin_names (offset 0)) (in_bom yes) (on_board yes)
      (property "Reference" "#PWR" (id 0) (at 0 -3.81 0)
        (effects (font (size 1.27 1.27)) hide)
      )
      (property "Value" "+12V" (id 1) (at 0 3.556 0)
        (effects (font (size 1.27 1.27)))
      )
      (property "Footprint" "" (id 2) (at 0 0 0)
        (effects (font (size 1.27 1.27)) hide)
      )
      (property "Datasheet" "" (id 3) (at 0 0 0)
        (effects (font (size 1.27 1.27)) hide)
      )
      (property "ki_keywords" "power-flag" (id 4) (at 0 0 0)
        (effects (font (size 1.27 1.27)) hide)
      )
      (property "ki_description" "Power symbol creates a global label with name \"+12V\"" (id 5) (at 0 0 0)
        (effects (font (size 1.27 1.27)) hide)
      )
      (symbol "+12V_0_1"
        (polyline
          (pts
            (xy -0.762 1.27)
            (xy 0 2.54)
          )
          (stroke (width 0) (type default) (color 0 0 0 0))
          (fill (type none))
        )
        (polyline
          (pts
            (xy 0 0)
            (xy 0 2.54)
          )
          (stroke (width 0) (type default) (color 0 0 0 0))
          (fill (type none))
        )
        (polyline
          (pts
            (xy 0 2.54)
            (xy 0.762 1.27)
          )
          (stroke (width 0) (type default) (color 0 0 0 0))
          (fill (type none))
        )
      )
      (symbol "+12V_1_1"
        (pin power_in line (at 0 0 90) (length 0) hide
          (name "+12V" (effects (font (size 1.27 1.27))))
          (number "1" (effects (font (size 1.27 1.27))))
        )
      )
    )
    (symbol "power:+3.3V" (power) (pin_names (offset 0)) (in_bom yes) (on_board yes)
      (property "Reference" "#PWR" (id 0) (at 0 -3.81 0)
        (effects (font (size 1.27 1.27)) hide)
      )
      (property "Value" "+3.3V" (id 1) (at 0 3.556 0)
        (effects (font (size 1.27 1.27)))
      )
      (property "Footprint" "" (id 2) (at 0 0 0)
        (effects (font (size 1.27 1.27)) hide)
      )
      (property "Datasheet" "" (id 3) (at 0 0 0)
        (effects (font (size 1.27 1.27)) hide)
      )
      (property "ki_keywords" "power-flag" (id 4) (at 0 0 0)
        (effects (font (size 1.27 1.27)) hide)
      )
      (property "ki_description" "Power symbol creates a global label with name \"+3.3V\"" (id 5) (at 0 0 0)
        (effects (font (size 1.27 1.27)) hide)
      )
      (symbol "+3.3V_0_1"
        (polyline
          (pts
            (xy -0.762 1.27)
            (xy 0 2.54)
          )
          (stroke (width 0) (type default) (color 0 0 0 0))
          (fill (type none))
        )
        (polyline
          (pts
            (xy 0 0)
            (xy 0 2.54)
          )
          (stroke (width 0) (type default) (color 0 0 0 0))
          (fill (type none))
        )
        (polyline
          (pts
            (xy 0 2.54)
            (xy 0.762 1.27)
          )
          (stroke (width 0) (type default) (color 0 0 0 0))
          (fill (type none))
        )
      )
      (symbol "+3.3V_1_1"
        (pin power_in line (at 0 0 90) (length 0) hide
          (name "+3V3" (effects (font (size 1.27 1.27))))
          (number "1" (effects (font (size 1.27 1.27))))
        )
      )
    )
    (symbol "power:+5V" (power) (pin_names (offset 0)) (in_bom yes) (on_board yes)
      (property "Reference" "#PWR" (id 0) (at 0 -3.81 0)
        (effects (font (size 1.27 1.27)) hide)
      )
      (property "Value" "+5V" (id 1) (at 0 3.556 0)
        (effects (font (size 1.27 1.27)))
      )
      (property "Footprint" "" (id 2) (at 0 0 0)
        (effects (font (size 1.27 1.27)) hide)
      )
      (property "Datasheet" "" (id 3) (at 0 0 0)
        (effects (font (size 1.27 1.27)) hide)
      )
      (property "ki_keywords" "power-flag" (id 4) (at 0 0 0)
        (effects (font (size 1.27 1.27)) hide)
      )
      (property "ki_description" "Power symbol creates a global label with name \"+5V\"" (id 5) (at 0 0 0)
        (effects (font (size 1.27 1.27)) hide)
      )
      (symbol "+5V_0_1"
        (polyline
          (pts
            (xy -0.762 1.27)
            (xy 0 2.54)
          )
          (stroke (width 0) (type default) (color 0 0 0 0))
          (fill (type none))
        )
        (polyline
          (pts
            (xy 0 0)
            (xy 0 2.54)
          )
          (stroke (width 0) (type default) (color 0 0 0 0))
          (fill (type none))
        )
        (polyline
          (pts
            (xy 0 2.54)
            (xy 0.762 1.27)
          )
          (stroke (width 0) (type default) (color 0 0 0 0))
          (fill (type none))
        )
      )
      (symbol "+5V_1_1"
        (pin power_in line (at 0 0 90) (length 0) hide
          (name "+5V" (effects (font (size 1.27 1.27))))
          (number "1" (effects (font (size 1.27 1.27))))
        )
      )
    )
    (symbol "power:GND" (power) (pin_names (offset 0)) (in_bom yes) (on_board yes)
      (property "Reference" "#PWR" (id 0) (at 0 -6.35 0)
        (effects (font (size 1.27 1.27)) hide)
      )
      (property "Value" "GND" (id 1) (at 0 -3.81 0)
        (effects (font (size 1.27 1.27)))
      )
      (property "Footprint" "" (id 2) (at 0 0 0)
        (effects (font (size 1.27 1.27)) hide)
      )
      (property "Datasheet" "" (id 3) (at 0 0 0)
        (effects (font (size 1.27 1.27)) hide)
      )
      (property "ki_keywords" "power-flag" (id 4) (at 0 0 0)
        (effects (font (size 1.27 1.27)) hide)
      )
      (property "ki_description" "Power symbol creates a global label with name \"GND\" , ground" (id 5) (at 0 0 0)
        (effects (font (size 1.27 1.27)) hide)
      )
      (symbol "GND_0_1"
        (polyline
          (pts
            (xy 0 0)
            (xy 0 -1.27)
            (xy 1.27 -1.27)
            (xy 0 -2.54)
            (xy -1.27 -1.27)
            (xy 0 -1.27)
          )
          (stroke (width 0) (type default) (color 0 0 0 0))
          (fill (type none))
        )
      )
      (symbol "GND_1_1"
        (pin power_in line (at 0 0 270) (length 0) hide
          (name "GND" (effects (font (size 1.27 1.27))))
          (number "1" (effects (font (size 1.27 1.27))))
        )
      )
    )
  )

  (junction (at 238.76 88.9) (diameter 0) (color 0 0 0 0)
    (uuid 218fdd35-eac1-475c-80a5-7c1d0c7e3970)
  )
  (junction (at 264.16 49.53) (diameter 0) (color 0 0 0 0)
    (uuid 27a5391b-c325-4465-9344-e6a55d2052e3)
  )
  (junction (at 238.76 36.83) (diameter 0) (color 0 0 0 0)
    (uuid 2c9a3511-61b6-4877-ad58-a88c2e1f27c7)
  )
  (junction (at 271.78 54.61) (diameter 0) (color 0 0 0 0)
    (uuid 44d1266c-6ec1-46e2-857f-ffbeeafe448d)
  )
  (junction (at 236.22 91.44) (diameter 0) (color 0 0 0 0)
    (uuid 59314e5a-7df8-46b8-a702-8434592d8cc8)
  )
  (junction (at 119.38 19.05) (diameter 0) (color 0 0 0 0)
    (uuid 5bb39c8a-bf36-4aa9-988a-95eb79177c59)
  )
  (junction (at 149.86 86.36) (diameter 0) (color 0 0 0 0)
    (uuid 5da78c6f-d868-4505-9545-4216dd3babce)
  )
  (junction (at 266.7 55.88) (diameter 0) (color 0 0 0 0)
    (uuid 671dff2d-b2be-4989-8caf-348ff060ba14)
  )
  (junction (at 201.93 25.4) (diameter 0) (color 0 0 0 0)
    (uuid 772256b8-8431-4b52-9b37-ab6d53bbd9af)
  )
  (junction (at 261.62 46.99) (diameter 0) (color 0 0 0 0)
    (uuid 951b8677-3dee-43ab-9d01-a593591b0aac)
  )
  (junction (at 133.35 78.74) (diameter 0) (color 0 0 0 0)
    (uuid ab487890-2ad5-491b-ace8-067c8a33b21d)
  )
  (junction (at 236.22 34.29) (diameter 0) (color 0 0 0 0)
    (uuid e0b62fde-8448-4029-b7c4-26ca6385caec)
  )
  (junction (at 152.4 82.55) (diameter 0) (color 0 0 0 0)
    (uuid e3f29df4-9ca0-44f3-acda-68260183e106)
  )
  (junction (at 269.24 50.8) (diameter 0) (color 0 0 0 0)
    (uuid fb0870f4-892d-40c9-986c-d8e4838dbaa1)
  )
  (junction (at 133.35 86.36) (diameter 0) (color 0 0 0 0)
    (uuid ff5be13c-7908-4c7a-9a4d-90966716f39a)
  )

  (no_connect (at 104.14 53.34) (uuid 762c3c0b-490f-4700-be51-c6a7ba896fe3))
  (no_connect (at 104.14 38.1) (uuid 873baf39-0050-4841-be36-ea835c57c0a8))
  (no_connect (at 104.14 40.64) (uuid 873baf39-0050-4841-be36-ea835c57c0a9))
  (no_connect (at 104.14 43.18) (uuid 873baf39-0050-4841-be36-ea835c57c0aa))
  (no_connect (at 104.14 68.58) (uuid 873baf39-0050-4841-be36-ea835c57c0ac))
  (no_connect (at 104.14 66.04) (uuid 873baf39-0050-4841-be36-ea835c57c0ad))
  (no_connect (at 34.29 33.02) (uuid 873baf39-0050-4841-be36-ea835c57c0ae))
  (no_connect (at 34.29 73.66) (uuid 873baf39-0050-4841-be36-ea835c57c0af))
  (no_connect (at 34.29 71.12) (uuid 873baf39-0050-4841-be36-ea835c57c0b0))
  (no_connect (at 34.29 68.58) (uuid 873baf39-0050-4841-be36-ea835c57c0b1))
  (no_connect (at 104.14 50.8) (uuid 873baf39-0050-4841-be36-ea835c57c0b2))
  (no_connect (at 104.14 55.88) (uuid 873baf39-0050-4841-be36-ea835c57c0b3))
  (no_connect (at 104.14 58.42) (uuid 873baf39-0050-4841-be36-ea835c57c0b4))
  (no_connect (at 104.14 63.5) (uuid 873baf39-0050-4841-be36-ea835c57c0b5))
  (no_connect (at 34.29 43.18) (uuid f557f7fd-50a8-470a-bb9d-b29bba095a90))
  (no_connect (at 34.29 40.64) (uuid f557f7fd-50a8-470a-bb9d-b29bba095a91))

  (bus_entry (at 118.11 73.66) (size 2.54 -2.54)
    (stroke (width 0) (type default) (color 0 0 0 0))
    (uuid 04b4315a-abd6-4d04-8ca4-aa20734b7778)
  )
  (bus_entry (at 118.11 76.2) (size 2.54 -2.54)
    (stroke (width 0) (type default) (color 0 0 0 0))
    (uuid 04b4315a-abd6-4d04-8ca4-aa20734b7779)
  )
  (bus_entry (at 120.65 83.82) (size 2.54 2.54)
    (stroke (width 0) (type default) (color 0 0 0 0))
    (uuid 720dab0d-1418-49f9-b369-fdf5fd7c72d9)
  )
  (bus_entry (at 120.65 76.2) (size 2.54 2.54)
    (stroke (width 0) (type default) (color 0 0 0 0))
    (uuid 720dab0d-1418-49f9-b369-fdf5fd7c72da)
  )
  (bus_entry (at 201.93 34.29) (size 2.54 2.54)
    (stroke (width 0) (type default) (color 0 0 0 0))
    (uuid 89b4a09e-b819-42d9-b168-9ad9f90031c5)
  )
  (bus_entry (at 179.07 49.53) (size 2.54 2.54)
    (stroke (width 0) (type default) (color 0 0 0 0))
    (uuid b859818e-52e7-4740-9da5-94d1dafd5ce6)
  )
  (bus_entry (at 179.07 46.99) (size 2.54 2.54)
    (stroke (width 0) (type default) (color 0 0 0 0))
    (uuid b859818e-52e7-4740-9da5-94d1dafd5ce7)
  )
  (bus_entry (at 13.97 33.02) (size 2.54 2.54)
    (stroke (width 0) (type default) (color 0 0 0 0))
    (uuid b8f8c374-0785-47df-9952-6aef91a53fcd)
  )
  (bus_entry (at 13.97 50.8) (size 2.54 2.54)
    (stroke (width 0) (type default) (color 0 0 0 0))
    (uuid b8f8c374-0785-47df-9952-6aef91a53fce)
  )
  (bus_entry (at 201.93 31.75) (size 2.54 2.54)
    (stroke (width 0) (type default) (color 0 0 0 0))
    (uuid c04b173e-22f4-46b2-bb83-a052254d4c29)
  )
  (bus_entry (at 16.51 38.1) (size -2.54 -2.54)
    (stroke (width 0) (type default) (color 0 0 0 0))
    (uuid d9a0557d-2066-4762-9c78-538f77b8afeb)
  )
  (bus_entry (at 16.51 45.72) (size -2.54 -2.54)
    (stroke (width 0) (type default) (color 0 0 0 0))
    (uuid d9a0557d-2066-4762-9c78-538f77b8afee)
  )
  (bus_entry (at 16.51 48.26) (size -2.54 -2.54)
    (stroke (width 0) (type default) (color 0 0 0 0))
    (uuid d9a0557d-2066-4762-9c78-538f77b8afef)
  )
  (bus_entry (at 16.51 50.8) (size -2.54 -2.54)
    (stroke (width 0) (type default) (color 0 0 0 0))
    (uuid d9a0557d-2066-4762-9c78-538f77b8aff0)
  )
  (bus_entry (at 186.69 97.79) (size 2.54 2.54)
    (stroke (width 0) (type default) (color 0 0 0 0))
    (uuid f5edecff-c7e4-4ade-b33f-898c336b9ff1)
  )
  (bus_entry (at 186.69 100.33) (size 2.54 2.54)
    (stroke (width 0) (type default) (color 0 0 0 0))
    (uuid f5edecff-c7e4-4ade-b33f-898c336b9ff2)
  )
  (bus_entry (at 186.69 102.87) (size 2.54 2.54)
    (stroke (width 0) (type default) (color 0 0 0 0))
    (uuid f5edecff-c7e4-4ade-b33f-898c336b9ff3)
  )
  (bus_entry (at 189.23 107.95) (size -2.54 -2.54)
    (stroke (width 0) (type default) (color 0 0 0 0))
    (uuid f5edecff-c7e4-4ade-b33f-898c336b9ff4)
  )
  (bus_entry (at 186.69 85.09) (size 2.54 2.54)
    (stroke (width 0) (type default) (color 0 0 0 0))
    (uuid f5edecff-c7e4-4ade-b33f-898c336b9ff5)
  )
  (bus_entry (at 186.69 87.63) (size 2.54 2.54)
    (stroke (width 0) (type default) (color 0 0 0 0))
    (uuid f5edecff-c7e4-4ade-b33f-898c336b9ff6)
  )
  (bus_entry (at 186.69 90.17) (size 2.54 2.54)
    (stroke (width 0) (type default) (color 0 0 0 0))
    (uuid f5edecff-c7e4-4ade-b33f-898c336b9ff7)
  )
  (bus_entry (at 186.69 92.71) (size 2.54 2.54)
    (stroke (width 0) (type default) (color 0 0 0 0))
    (uuid f5edecff-c7e4-4ade-b33f-898c336b9ff8)
  )
  (bus_entry (at 116.84 35.56) (size 2.54 -2.54)
    (stroke (width 0) (type default) (color 0 0 0 0))
    (uuid f66225e7-de8e-4dd6-a97e-d01b7a2d8248)
  )
  (bus_entry (at 116.84 33.02) (size 2.54 -2.54)
    (stroke (width 0) (type default) (color 0 0 0 0))
    (uuid f66225e7-de8e-4dd6-a97e-d01b7a2d8249)
  )
  (bus_entry (at 247.65 46.99) (size 2.54 2.54)
    (stroke (width 0) (type default) (color 0 0 0 0))
    (uuid f7f4bd65-d7ce-4773-bc19-639690095443)
  )
  (bus_entry (at 247.65 44.45) (size 2.54 2.54)
    (stroke (width 0) (type default) (color 0 0 0 0))
    (uuid f7f4bd65-d7ce-4773-bc19-639690095444)
  )

  (wire (pts (xy 236.22 20.32) (xy 236.22 34.29))
    (stroke (width 0) (type default) (color 0 0 0 0))
    (uuid 006c72fd-0805-4807-a7ed-fd0d20538839)
  )
  (wire (pts (xy 104.14 35.56) (xy 116.84 35.56))
    (stroke (width 0) (type default) (color 0 0 0 0))
    (uuid 00e3be8c-26fd-46a2-994c-089b46628289)
  )
  (wire (pts (xy 232.41 113.03) (xy 232.41 106.68))
    (stroke (width 0) (type default) (color 0 0 0 0))
    (uuid 00f4c050-97cc-4b68-9bf3-9ef2f64c7cc9)
  )
  (wire (pts (xy 34.29 82.55) (xy 34.29 96.52))
    (stroke (width 0) (type default) (color 0 0 0 0))
    (uuid 04264c76-adde-4c68-9bbd-c7cd4e56eaa5)
  )
  (wire (pts (xy 105.41 30.48) (xy 104.14 30.48))
    (stroke (width 0) (type default) (color 0 0 0 0))
    (uuid 051eb165-3999-4699-8914-8a7eb55d85ce)
  )
  (bus (pts (xy 186.69 97.79) (xy 186.69 100.33))
    (stroke (width 0) (type default) (color 0 0 0 0))
    (uuid 072f6ca9-019e-4117-a14f-1748bef4c764)
  )
  (bus (pts (xy 168.91 69.85) (xy 168.91 19.05))
    (stroke (width 0) (type default) (color 0 0 0 0))
    (uuid 0bdaf87a-2674-40d5-8a2b-e8f6290f20ea)
  )

  (wire (pts (xy 36.83 86.36) (xy 31.75 86.36))
    (stroke (width 0) (type default) (color 0 0 0 0))
    (uuid 11694ac2-d11d-4dfd-91d6-00244bd3f62a)
  )
  (wire (pts (xy 36.83 91.44) (xy 29.21 91.44))
    (stroke (width 0) (type default) (color 0 0 0 0))
    (uuid 13a43682-2acb-4afd-abed-12d02fe09afb)
  )
  (wire (pts (xy 269.24 44.45) (xy 269.24 50.8))
    (stroke (width 0) (type default) (color 0 0 0 0))
    (uuid 13eb95bb-f337-46bc-a904-7de2895beeb1)
  )
  (bus (pts (xy 120.65 73.66) (xy 120.65 76.2))
    (stroke (width 0) (type default) (color 0 0 0 0))
    (uuid 14d7bab6-83eb-4766-b047-d59aead7750f)
  )
  (bus (pts (xy 13.97 35.56) (xy 13.97 43.18))
    (stroke (width 0) (type default) (color 0 0 0 0))
    (uuid 158d4917-4701-4fd9-91a8-27c12ec51018)
  )
  (bus (pts (xy 179.07 46.99) (xy 179.07 49.53))
    (stroke (width 0) (type default) (color 0 0 0 0))
    (uuid 19822050-0561-40c8-b6a4-ae2349ffa86d)
  )

  (wire (pts (xy 123.19 78.74) (xy 133.35 78.74))
    (stroke (width 0) (type default) (color 0 0 0 0))
    (uuid 1ac7d70b-049b-43e6-95aa-c9bd5200fceb)
  )
  (wire (pts (xy 152.4 82.55) (xy 154.94 82.55))
    (stroke (width 0) (type default) (color 0 0 0 0))
    (uuid 1b27142f-0022-4ef8-b31b-8086006bcd92)
  )
  (wire (pts (xy 133.35 86.36) (xy 133.35 82.55))
    (stroke (width 0) (type default) (color 0 0 0 0))
    (uuid 1d20460f-6d7c-4787-9682-73a7b81cbf4a)
  )
  (wire (pts (xy 224.79 97.79) (xy 241.3 97.79))
    (stroke (width 0) (type default) (color 0 0 0 0))
    (uuid 1d94be50-5e52-4007-a4be-540993b5907d)
  )
  (bus (pts (xy 201.93 25.4) (xy 247.65 25.4))
    (stroke (width 0) (type default) (color 0 0 0 0))
    (uuid 1f5b93c4-f71a-4bb4-9a53-f46e3c38bf88)
  )
  (bus (pts (xy 13.97 43.18) (xy 13.97 45.72))
    (stroke (width 0) (type default) (color 0 0 0 0))
    (uuid 20f6c779-84ec-434d-9450-be8962723611)
  )

  (wire (pts (xy 181.61 52.07) (xy 189.23 52.07))
    (stroke (width 0) (type default) (color 0 0 0 0))
    (uuid 2134df9e-7591-4b33-adfc-f6cfb5853aa2)
  )
  (bus (pts (xy 186.69 102.87) (xy 186.69 105.41))
    (stroke (width 0) (type default) (color 0 0 0 0))
    (uuid 2265274a-1cf0-4b44-bf85-d1544e62bb85)
  )
  (bus (pts (xy 119.38 30.48) (xy 119.38 33.02))
    (stroke (width 0) (type default) (color 0 0 0 0))
    (uuid 231b9ddb-57dd-4fe7-8eda-a2339393fee7)
  )

  (wire (pts (xy 238.76 81.28) (xy 238.76 88.9))
    (stroke (width 0) (type default) (color 0 0 0 0))
    (uuid 248ba5aa-5a5e-40a2-9f89-f275d2b1e4f0)
  )
  (wire (pts (xy 133.35 74.93) (xy 139.7 74.93))
    (stroke (width 0) (type default) (color 0 0 0 0))
    (uuid 27581dda-332e-41f9-af6e-12247f8e2c3d)
  )
  (wire (pts (xy 31.75 66.04) (xy 34.29 66.04))
    (stroke (width 0) (type default) (color 0 0 0 0))
    (uuid 29b95dfc-2a47-4ebc-9445-6b455387f883)
  )
  (wire (pts (xy 27.94 55.88) (xy 34.29 55.88))
    (stroke (width 0) (type default) (color 0 0 0 0))
    (uuid 29f614ca-6b46-4494-83af-30f3631251ed)
  )
  (wire (pts (xy 30.48 60.96) (xy 30.48 88.9))
    (stroke (width 0) (type default) (color 0 0 0 0))
    (uuid 2e9a27c5-2eee-469d-8701-8440f039bf7c)
  )
  (wire (pts (xy 238.76 88.9) (xy 238.76 113.03))
    (stroke (width 0) (type default) (color 0 0 0 0))
    (uuid 2f25cbbf-23bb-4df9-a79c-6286318bc4ae)
  )
  (wire (pts (xy 113.03 24.13) (xy 113.03 25.4))
    (stroke (width 0) (type default) (color 0 0 0 0))
    (uuid 2fa4ec0b-954d-4444-b443-a17d08af2fb0)
  )
  (wire (pts (xy 236.22 83.82) (xy 236.22 91.44))
    (stroke (width 0) (type default) (color 0 0 0 0))
    (uuid 30a707f3-474d-4276-8d46-6199317b894f)
  )
  (bus (pts (xy 179.07 43.18) (xy 179.07 46.99))
    (stroke (width 0) (type default) (color 0 0 0 0))
    (uuid 319c36b8-fba9-4c0a-8984-87bf3ac7fd1a)
  )

  (wire (pts (xy 31.75 66.04) (xy 31.75 86.36))
    (stroke (width 0) (type default) (color 0 0 0 0))
    (uuid 32814b45-2083-4311-87ca-b28eb5faf963)
  )
  (bus (pts (xy 13.97 33.02) (xy 13.97 35.56))
    (stroke (width 0) (type default) (color 0 0 0 0))
    (uuid 33855b55-d8ca-4025-93ff-bde42f0af16c)
  )
  (bus (pts (xy 120.65 76.2) (xy 120.65 83.82))
    (stroke (width 0) (type default) (color 0 0 0 0))
    (uuid 33c1204a-d4ca-46e9-912c-a7b37171dcd6)
  )

  (wire (pts (xy 264.16 49.53) (xy 264.16 57.15))
    (stroke (width 0) (type default) (color 0 0 0 0))
    (uuid 34229725-d301-4184-81af-9d89a6c6eb57)
  )
  (wire (pts (xy 133.35 78.74) (xy 133.35 74.93))
    (stroke (width 0) (type default) (color 0 0 0 0))
    (uuid 382ca512-b4f7-460c-abd6-5fd8f38132bd)
  )
  (wire (pts (xy 130.81 67.31) (xy 130.81 55.88))
    (stroke (width 0) (type default) (color 0 0 0 0))
    (uuid 38b6c5b5-2cc9-445e-9a0e-45ba0e147dc4)
  )
  (wire (pts (xy 189.23 92.71) (xy 205.74 92.71))
    (stroke (width 0) (type default) (color 0 0 0 0))
    (uuid 3d65096b-2ccd-4f03-afa3-bd1be62a8c57)
  )
  (wire (pts (xy 189.23 90.17) (xy 205.74 90.17))
    (stroke (width 0) (type default) (color 0 0 0 0))
    (uuid 3f996ac3-594f-4e77-8f6c-6ec9cf4dda69)
  )
  (wire (pts (xy 104.14 71.12) (xy 111.76 71.12))
    (stroke (width 0) (type default) (color 0 0 0 0))
    (uuid 3fa08bb3-73bc-4792-893f-49b42facbffa)
  )
  (wire (pts (xy 104.14 45.72) (xy 113.03 45.72))
    (stroke (width 0) (type default) (color 0 0 0 0))
    (uuid 40bbc30b-6cf6-4937-861e-d06ee976b309)
  )
  (wire (pts (xy 149.86 86.36) (xy 160.02 86.36))
    (stroke (width 0) (type default) (color 0 0 0 0))
    (uuid 40c97f4c-cca1-4dbc-8310-5ab298884ed0)
  )
  (wire (pts (xy 104.14 60.96) (xy 107.95 60.96))
    (stroke (width 0) (type default) (color 0 0 0 0))
    (uuid 411e97c1-d3e9-448e-bc75-7356a7b515ea)
  )
  (wire (pts (xy 111.76 67.31) (xy 130.81 67.31))
    (stroke (width 0) (type default) (color 0 0 0 0))
    (uuid 41472811-c127-43a3-b81b-aea436a4687b)
  )
  (wire (pts (xy 133.35 82.55) (xy 139.7 82.55))
    (stroke (width 0) (type default) (color 0 0 0 0))
    (uuid 42192181-be84-43cb-8f59-caa16460fae9)
  )
  (wire (pts (xy 16.51 53.34) (xy 34.29 53.34))
    (stroke (width 0) (type default) (color 0 0 0 0))
    (uuid 43118421-0739-4346-a876-4d4c2d81c6d9)
  )
  (bus (pts (xy 168.91 19.05) (xy 119.38 19.05))
    (stroke (width 0) (type default) (color 0 0 0 0))
    (uuid 43a97a34-6e09-450c-9d6c-7a2d4023ae58)
  )

  (wire (pts (xy 224.79 88.9) (xy 238.76 88.9))
    (stroke (width 0) (type default) (color 0 0 0 0))
    (uuid 471ad5a2-5a30-4fee-a180-5b80211e4b56)
  )
  (wire (pts (xy 31.75 29.21) (xy 31.75 30.48))
    (stroke (width 0) (type default) (color 0 0 0 0))
    (uuid 474f0be4-e95f-4f1e-83d6-90146c56fd0d)
  )
  (wire (pts (xy 261.62 46.99) (xy 261.62 57.15))
    (stroke (width 0) (type default) (color 0 0 0 0))
    (uuid 497d87b6-0e9b-4d97-ad94-8b8cd4f19928)
  )
  (wire (pts (xy 30.48 60.96) (xy 34.29 60.96))
    (stroke (width 0) (type default) (color 0 0 0 0))
    (uuid 4a01f246-c8a0-48b7-8ade-7e5ea63d57ab)
  )
  (wire (pts (xy 236.22 91.44) (xy 236.22 113.03))
    (stroke (width 0) (type default) (color 0 0 0 0))
    (uuid 4cbea216-5ea2-49bc-accd-0245c10b84e0)
  )
  (wire (pts (xy 226.06 78.74) (xy 226.06 83.82))
    (stroke (width 0) (type default) (color 0 0 0 0))
    (uuid 51355262-3c0e-4038-9409-18e48eeccf2a)
  )
  (wire (pts (xy 16.51 50.8) (xy 34.29 50.8))
    (stroke (width 0) (type default) (color 0 0 0 0))
    (uuid 51aa13dc-6c9f-4ad9-adf3-2be459fb4771)
  )
  (wire (pts (xy 130.81 55.88) (xy 189.23 55.88))
    (stroke (width 0) (type default) (color 0 0 0 0))
    (uuid 5206abf2-5795-43de-881e-477674eb5664)
  )
  (bus (pts (xy 186.69 100.33) (xy 186.69 102.87))
    (stroke (width 0) (type default) (color 0 0 0 0))
    (uuid 530768c7-ac32-45dd-8dfd-ec12349a8a28)
  )

  (wire (pts (xy 154.94 81.28) (xy 154.94 82.55))
    (stroke (width 0) (type default) (color 0 0 0 0))
    (uuid 5430ab11-d688-4c25-ac5f-9a083431a45a)
  )
  (wire (pts (xy 250.19 49.53) (xy 264.16 49.53))
    (stroke (width 0) (type default) (color 0 0 0 0))
    (uuid 55f7910d-5251-440b-96f2-de626a9904df)
  )
  (wire (pts (xy 189.23 102.87) (xy 205.74 102.87))
    (stroke (width 0) (type default) (color 0 0 0 0))
    (uuid 56459b18-45d7-4c0f-a105-5ccf602efeea)
  )
  (wire (pts (xy 19.05 76.2) (xy 34.29 76.2))
    (stroke (width 0) (type default) (color 0 0 0 0))
    (uuid 574418b0-4eb3-4e5c-af93-568a8d0b32d5)
  )
  (wire (pts (xy 229.87 113.03) (xy 229.87 104.14))
    (stroke (width 0) (type default) (color 0 0 0 0))
    (uuid 5806d467-a028-457a-b02d-56eab2bb8040)
  )
  (wire (pts (xy 104.14 48.26) (xy 106.68 48.26))
    (stroke (width 0) (type default) (color 0 0 0 0))
    (uuid 580a5929-8839-4640-8897-c9032bfe5b1a)
  )
  (wire (pts (xy 111.76 71.12) (xy 111.76 67.31))
    (stroke (width 0) (type default) (color 0 0 0 0))
    (uuid 5837deb3-688b-4f70-9362-463ff25c3e55)
  )
  (bus (pts (xy 120.65 71.12) (xy 120.65 73.66))
    (stroke (width 0) (type default) (color 0 0 0 0))
    (uuid 586690bd-9cca-4660-ad01-2e5e4d9836b4)
  )
  (bus (pts (xy 247.65 25.4) (xy 247.65 44.45))
    (stroke (width 0) (type default) (color 0 0 0 0))
    (uuid 5eb045d3-0430-43a0-8df5-63c88ef2dddd)
  )

  (wire (pts (xy 105.41 24.13) (xy 105.41 30.48))
    (stroke (width 0) (type default) (color 0 0 0 0))
    (uuid 6124ac0d-0fd7-4a96-b79d-68f058eb7730)
  )
  (wire (pts (xy 271.78 54.61) (xy 280.67 54.61))
    (stroke (width 0) (type default) (color 0 0 0 0))
    (uuid 62acd84f-45e2-4fe5-8183-20174e0602c3)
  )
  (wire (pts (xy 251.46 55.88) (xy 266.7 55.88))
    (stroke (width 0) (type default) (color 0 0 0 0))
    (uuid 64f20f09-7ae2-4e1c-9d3c-5cb49d90ad6b)
  )
  (wire (pts (xy 224.79 95.25) (xy 243.84 95.25))
    (stroke (width 0) (type default) (color 0 0 0 0))
    (uuid 6989f95b-3d62-4ac9-b4e7-5b787bf47783)
  )
  (bus (pts (xy 186.69 69.85) (xy 168.91 69.85))
    (stroke (width 0) (type default) (color 0 0 0 0))
    (uuid 6b93898d-63e5-4298-a63c-f54c30f547cc)
  )

  (wire (pts (xy 238.76 20.32) (xy 238.76 36.83))
    (stroke (width 0) (type default) (color 0 0 0 0))
    (uuid 6bcaf78f-11a3-467d-b2aa-27412394b961)
  )
  (wire (pts (xy 33.02 93.98) (xy 36.83 93.98))
    (stroke (width 0) (type default) (color 0 0 0 0))
    (uuid 6dd89c50-1207-4c35-bac3-68c9b730020a)
  )
  (wire (pts (xy 271.78 44.45) (xy 271.78 54.61))
    (stroke (width 0) (type default) (color 0 0 0 0))
    (uuid 709651ef-e30b-43cf-8786-df78d97e1e0a)
  )
  (wire (pts (xy 152.4 82.55) (xy 152.4 74.93))
    (stroke (width 0) (type default) (color 0 0 0 0))
    (uuid 70e82029-3e95-4316-a117-91e72153f3b6)
  )
  (wire (pts (xy 189.23 100.33) (xy 205.74 100.33))
    (stroke (width 0) (type default) (color 0 0 0 0))
    (uuid 765e88c2-7918-4daa-8f5e-e11a684828f1)
  )
  (wire (pts (xy 266.7 55.88) (xy 266.7 57.15))
    (stroke (width 0) (type default) (color 0 0 0 0))
    (uuid 766cf166-3da0-43b7-858f-a984f5c19ae1)
  )
  (wire (pts (xy 232.41 36.83) (xy 238.76 36.83))
    (stroke (width 0) (type default) (color 0 0 0 0))
    (uuid 794c6e1a-d38c-4fea-820d-70472369ae65)
  )
  (wire (pts (xy 33.02 81.28) (xy 33.02 93.98))
    (stroke (width 0) (type default) (color 0 0 0 0))
    (uuid 7a9791d4-b129-4bd2-880d-10852125600b)
  )
  (bus (pts (xy 247.65 44.45) (xy 247.65 46.99))
    (stroke (width 0) (type default) (color 0 0 0 0))
    (uuid 7b8d13b4-54f6-4640-9aec-4b33488fd378)
  )

  (wire (pts (xy 31.75 30.48) (xy 34.29 30.48))
    (stroke (width 0) (type default) (color 0 0 0 0))
    (uuid 7bd83234-85f4-4cc5-a54a-c039fe04ae2b)
  )
  (wire (pts (xy 234.95 78.74) (xy 234.95 81.28))
    (stroke (width 0) (type default) (color 0 0 0 0))
    (uuid 7c2c6c76-01a1-4f64-8544-75a5f7948934)
  )
  (wire (pts (xy 189.23 107.95) (xy 205.74 107.95))
    (stroke (width 0) (type default) (color 0 0 0 0))
    (uuid 840ad091-023c-4369-b33c-3d0a4b61211f)
  )
  (wire (pts (xy 105.41 24.13) (xy 113.03 24.13))
    (stroke (width 0) (type default) (color 0 0 0 0))
    (uuid 87f97bdb-cfa8-41e8-b60e-10b54fbcd819)
  )
  (bus (pts (xy 201.93 34.29) (xy 201.93 43.18))
    (stroke (width 0) (type default) (color 0 0 0 0))
    (uuid 881abf44-14f0-4aff-9acc-37faaf908ff2)
  )
  (bus (pts (xy 119.38 19.05) (xy 119.38 30.48))
    (stroke (width 0) (type default) (color 0 0 0 0))
    (uuid 88314bcb-4736-4395-bfd1-b7713d9460c3)
  )

  (wire (pts (xy 29.21 58.42) (xy 34.29 58.42))
    (stroke (width 0) (type default) (color 0 0 0 0))
    (uuid 88d0c77c-c619-4585-9a7f-b866ed0169a5)
  )
  (wire (pts (xy 234.95 66.04) (xy 234.95 68.58))
    (stroke (width 0) (type default) (color 0 0 0 0))
    (uuid 8c9d9a6b-fb87-4f98-aa59-ef6f6451b47a)
  )
  (bus (pts (xy 119.38 19.05) (xy 13.97 19.05))
    (stroke (width 0) (type default) (color 0 0 0 0))
    (uuid 8d2470c0-993d-4bc0-bd9c-02988d977766)
  )
  (bus (pts (xy 120.65 16.51) (xy 120.65 71.12))
    (stroke (width 0) (type default) (color 0 0 0 0))
    (uuid 8def90b4-65ee-47e5-b349-924353c98524)
  )

  (wire (pts (xy 269.24 50.8) (xy 269.24 57.15))
    (stroke (width 0) (type default) (color 0 0 0 0))
    (uuid 8dff18f9-cd16-454a-bfa0-f38b0a9885c2)
  )
  (wire (pts (xy 264.16 44.45) (xy 264.16 49.53))
    (stroke (width 0) (type default) (color 0 0 0 0))
    (uuid 904c25cd-1497-44dc-89b5-8b3f42850328)
  )
  (wire (pts (xy 238.76 36.83) (xy 238.76 66.04))
    (stroke (width 0) (type default) (color 0 0 0 0))
    (uuid 908a1831-b027-4b30-ae54-ded782e1d851)
  )
  (wire (pts (xy 189.23 95.25) (xy 205.74 95.25))
    (stroke (width 0) (type default) (color 0 0 0 0))
    (uuid 93915dab-1c1b-47e1-b561-978ee5d4fe83)
  )
  (bus (pts (xy 186.69 87.63) (xy 186.69 90.17))
    (stroke (width 0) (type default) (color 0 0 0 0))
    (uuid 94c0d5e2-1db0-4639-8fdc-be7c8290075c)
  )

  (wire (pts (xy 36.83 99.06) (xy 27.94 99.06))
    (stroke (width 0) (type default) (color 0 0 0 0))
    (uuid 95b478b8-2918-470e-a425-de169a8034ec)
  )
  (wire (pts (xy 107.95 82.55) (xy 34.29 82.55))
    (stroke (width 0) (type default) (color 0 0 0 0))
    (uuid 96a6a840-8c1f-4c8d-ac60-90bcc054fa83)
  )
  (wire (pts (xy 269.24 50.8) (xy 275.59 50.8))
    (stroke (width 0) (type default) (color 0 0 0 0))
    (uuid 975c7917-0aa9-4a73-b8b0-6aa632b5334d)
  )
  (wire (pts (xy 266.7 44.45) (xy 266.7 55.88))
    (stroke (width 0) (type default) (color 0 0 0 0))
    (uuid 983131e0-5eea-4aaf-a556-75427c851b4c)
  )
  (wire (pts (xy 271.78 54.61) (xy 271.78 57.15))
    (stroke (width 0) (type default) (color 0 0 0 0))
    (uuid 989970ab-83d1-4b21-a5d3-5445e4f5dd32)
  )
  (wire (pts (xy 16.51 35.56) (xy 34.29 35.56))
    (stroke (width 0) (type default) (color 0 0 0 0))
    (uuid 9d07702f-9b61-4c52-8cec-994ed5615f6c)
  )
  (wire (pts (xy 261.62 44.45) (xy 261.62 46.99))
    (stroke (width 0) (type default) (color 0 0 0 0))
    (uuid 9e25c72b-9316-4222-99a2-12c518092d2b)
  )
  (bus (pts (xy 13.97 45.72) (xy 13.97 48.26))
    (stroke (width 0) (type default) (color 0 0 0 0))
    (uuid 9f2913ee-f300-41d4-9b7a-339ae5970c4d)
  )
  (bus (pts (xy 201.93 43.18) (xy 179.07 43.18))
    (stroke (width 0) (type default) (color 0 0 0 0))
    (uuid 9f525753-8201-438d-9e60-bfe72ca01cba)
  )

  (wire (pts (xy 204.47 36.83) (xy 213.36 36.83))
    (stroke (width 0) (type default) (color 0 0 0 0))
    (uuid a39e75e9-2846-4a14-9245-5ac6fc5aaf3e)
  )
  (wire (pts (xy 250.19 46.99) (xy 261.62 46.99))
    (stroke (width 0) (type default) (color 0 0 0 0))
    (uuid a4101076-bebe-4d1f-ae3a-006dddf9825a)
  )
  (wire (pts (xy 34.29 96.52) (xy 36.83 96.52))
    (stroke (width 0) (type default) (color 0 0 0 0))
    (uuid a5e9e330-7f77-4916-87de-782b6e93a1b3)
  )
  (wire (pts (xy 16.51 48.26) (xy 34.29 48.26))
    (stroke (width 0) (type default) (color 0 0 0 0))
    (uuid a9760ae2-f443-444b-ae2c-b9eb5812916c)
  )
  (wire (pts (xy 147.32 74.93) (xy 152.4 74.93))
    (stroke (width 0) (type default) (color 0 0 0 0))
    (uuid a9e26eb7-ef36-42e7-a8bb-69e76beb5aee)
  )
  (bus (pts (xy 13.97 48.26) (xy 13.97 50.8))
    (stroke (width 0) (type default) (color 0 0 0 0))
    (uuid af85d2f1-0a95-4326-a8f5-d4abec33b0ff)
  )

  (wire (pts (xy 104.14 76.2) (xy 118.11 76.2))
    (stroke (width 0) (type default) (color 0 0 0 0))
    (uuid b067e841-e740-49be-9756-e26773183d7c)
  )
  (wire (pts (xy 104.14 73.66) (xy 118.11 73.66))
    (stroke (width 0) (type default) (color 0 0 0 0))
    (uuid b3364d00-25fc-4427-a363-6d752f81c7c1)
  )
  (wire (pts (xy 229.87 104.14) (xy 224.79 104.14))
    (stroke (width 0) (type default) (color 0 0 0 0))
    (uuid b63665a6-0b2d-40ee-86b0-8e2c980fc6cc)
  )
  (bus (pts (xy 120.65 16.51) (xy 201.93 16.51))
    (stroke (width 0) (type default) (color 0 0 0 0))
    (uuid b6c25c93-e4b1-491d-a2a5-9293f0ae976d)
  )

  (wire (pts (xy 181.61 49.53) (xy 189.23 49.53))
    (stroke (width 0) (type default) (color 0 0 0 0))
    (uuid bb10a9c3-3c06-4980-aa44-0ee5432034d7)
  )
  (bus (pts (xy 13.97 19.05) (xy 13.97 33.02))
    (stroke (width 0) (type default) (color 0 0 0 0))
    (uuid bb456900-7812-498b-bf90-872c89cf6112)
  )

  (wire (pts (xy 106.68 48.26) (xy 106.68 81.28))
    (stroke (width 0) (type default) (color 0 0 0 0))
    (uuid be02c95d-2968-40ec-875d-106e3ff13333)
  )
  (wire (pts (xy 27.94 99.06) (xy 27.94 55.88))
    (stroke (width 0) (type default) (color 0 0 0 0))
    (uuid be7276e1-0e72-4afc-a857-461bea645572)
  )
  (wire (pts (xy 226.06 83.82) (xy 236.22 83.82))
    (stroke (width 0) (type default) (color 0 0 0 0))
    (uuid c02a8140-d563-4701-a1fb-52de09e7cad5)
  )
  (wire (pts (xy 189.23 105.41) (xy 205.74 105.41))
    (stroke (width 0) (type default) (color 0 0 0 0))
    (uuid c1b88f66-c809-46f2-b417-fd2dcc47fb09)
  )
  (wire (pts (xy 29.21 91.44) (xy 29.21 58.42))
    (stroke (width 0) (type default) (color 0 0 0 0))
    (uuid c2320249-c0c2-4876-bfe5-632059858c4d)
  )
  (wire (pts (xy 226.06 63.5) (xy 226.06 68.58))
    (stroke (width 0) (type default) (color 0 0 0 0))
    (uuid c89e431b-49c8-4177-9774-e99f690dd6f6)
  )
  (wire (pts (xy 232.41 106.68) (xy 224.79 106.68))
    (stroke (width 0) (type default) (color 0 0 0 0))
    (uuid c91eaaeb-79ef-4090-9434-b8f69d8c586f)
  )
  (wire (pts (xy 238.76 66.04) (xy 234.95 66.04))
    (stroke (width 0) (type default) (color 0 0 0 0))
    (uuid c93bcfcd-d267-42c2-b05a-7a2dee2bceba)
  )
  (wire (pts (xy 234.95 81.28) (xy 238.76 81.28))
    (stroke (width 0) (type default) (color 0 0 0 0))
    (uuid ca005791-d5b9-4289-baa1-93adaf2a4877)
  )
  (wire (pts (xy 232.41 34.29) (xy 236.22 34.29))
    (stroke (width 0) (type default) (color 0 0 0 0))
    (uuid cdcc797b-d3f6-4881-8b92-9b10df02cdc1)
  )
  (bus (pts (xy 186.69 85.09) (xy 186.69 87.63))
    (stroke (width 0) (type default) (color 0 0 0 0))
    (uuid cfefd951-ba90-4758-8d02-043b83b64171)
  )

  (wire (pts (xy 140.97 86.36) (xy 149.86 86.36))
    (stroke (width 0) (type default) (color 0 0 0 0))
    (uuid d39b30a7-90a2-4e89-8201-6645b6271b8e)
  )
  (wire (pts (xy 104.14 33.02) (xy 116.84 33.02))
    (stroke (width 0) (type default) (color 0 0 0 0))
    (uuid d45a9c37-c2e4-45bd-8c80-f967624eb2e7)
  )
  (wire (pts (xy 16.51 45.72) (xy 34.29 45.72))
    (stroke (width 0) (type default) (color 0 0 0 0))
    (uuid d6d50d33-e91e-4d4e-94b7-a67cb83f8183)
  )
  (bus (pts (xy 201.93 25.4) (xy 201.93 31.75))
    (stroke (width 0) (type default) (color 0 0 0 0))
    (uuid d7e6deb2-e1a2-4a42-9a48-4af71c9abcd6)
  )
  (bus (pts (xy 186.69 90.17) (xy 186.69 92.71))
    (stroke (width 0) (type default) (color 0 0 0 0))
    (uuid d821840a-7bfd-49d4-bbea-40b66cc9fd5e)
  )

  (wire (pts (xy 149.86 78.74) (xy 149.86 86.36))
    (stroke (width 0) (type default) (color 0 0 0 0))
    (uuid dc03ab07-66c3-4f8a-a2f0-89f718c45bf0)
  )
  (bus (pts (xy 201.93 16.51) (xy 201.93 25.4))
    (stroke (width 0) (type default) (color 0 0 0 0))
    (uuid dd25cf3b-b019-4d3e-ae7a-1100f65bc401)
  )

  (wire (pts (xy 224.79 91.44) (xy 236.22 91.44))
    (stroke (width 0) (type default) (color 0 0 0 0))
    (uuid de39eb1d-b171-46ee-9b27-cbbd229e8caa)
  )
  (wire (pts (xy 123.19 86.36) (xy 133.35 86.36))
    (stroke (width 0) (type default) (color 0 0 0 0))
    (uuid de4fa364-8018-407f-9894-099f128e6911)
  )
  (wire (pts (xy 36.83 88.9) (xy 30.48 88.9))
    (stroke (width 0) (type default) (color 0 0 0 0))
    (uuid de76c690-68f8-432e-be5c-fda5ec56e8c0)
  )
  (wire (pts (xy 241.3 97.79) (xy 241.3 113.03))
    (stroke (width 0) (type default) (color 0 0 0 0))
    (uuid df92acf3-dcc3-4468-a741-ba1e59d9008f)
  )
  (bus (pts (xy 186.69 92.71) (xy 186.69 97.79))
    (stroke (width 0) (type default) (color 0 0 0 0))
    (uuid e3c1c3a4-e390-4b61-b2c1-3df48b32849d)
  )

  (wire (pts (xy 16.51 38.1) (xy 34.29 38.1))
    (stroke (width 0) (type default) (color 0 0 0 0))
    (uuid e3fb53eb-fae6-48d7-b503-e19ed1c95937)
  )
  (wire (pts (xy 160.02 85.09) (xy 160.02 86.36))
    (stroke (width 0) (type default) (color 0 0 0 0))
    (uuid e711afff-8f03-4ede-9be2-c049e6de12af)
  )
  (wire (pts (xy 22.86 63.5) (xy 34.29 63.5))
    (stroke (width 0) (type default) (color 0 0 0 0))
    (uuid e7852bf0-0727-47c5-8785-9e89418159b8)
  )
  (wire (pts (xy 189.23 87.63) (xy 205.74 87.63))
    (stroke (width 0) (type default) (color 0 0 0 0))
    (uuid eb0915de-c86a-4d8e-a0f1-84dcf28d1327)
  )
  (wire (pts (xy 140.97 78.74) (xy 149.86 78.74))
    (stroke (width 0) (type default) (color 0 0 0 0))
    (uuid ec620162-a5c3-4ef9-9d3d-ef5e8e081f6b)
  )
  (bus (pts (xy 186.69 69.85) (xy 186.69 85.09))
    (stroke (width 0) (type default) (color 0 0 0 0))
    (uuid ee86f6d6-383e-413d-9d54-fe93f39abdf2)
  )

  (wire (pts (xy 243.84 95.25) (xy 243.84 113.03))
    (stroke (width 0) (type default) (color 0 0 0 0))
    (uuid ef12ed21-7635-45c3-860f-aad6b9c29c84)
  )
  (wire (pts (xy 107.95 60.96) (xy 107.95 82.55))
    (stroke (width 0) (type default) (color 0 0 0 0))
    (uuid f1e26b3c-4439-4afe-ab48-e02a9cb01c06)
  )
  (wire (pts (xy 236.22 34.29) (xy 236.22 63.5))
    (stroke (width 0) (type default) (color 0 0 0 0))
    (uuid f61bdd7a-f000-430b-8bc2-8ee8700a206e)
  )
  (wire (pts (xy 106.68 81.28) (xy 33.02 81.28))
    (stroke (width 0) (type default) (color 0 0 0 0))
    (uuid f89ac9ea-e5a5-4cfa-9f61-269066068a5f)
  )
  (wire (pts (xy 147.32 82.55) (xy 152.4 82.55))
    (stroke (width 0) (type default) (color 0 0 0 0))
    (uuid fa784567-54e2-4d51-90ef-b143549adefe)
  )
  (wire (pts (xy 204.47 34.29) (xy 213.36 34.29))
    (stroke (width 0) (type default) (color 0 0 0 0))
    (uuid fa8c49d8-a95e-431f-bfdb-4eb315b5d114)
  )
  (wire (pts (xy 236.22 63.5) (xy 226.06 63.5))
    (stroke (width 0) (type default) (color 0 0 0 0))
    (uuid fbad24f8-5b50-46fa-8806-5587cd33cfd4)
  )
  (bus (pts (xy 201.93 34.29) (xy 201.93 31.75))
    (stroke (width 0) (type default) (color 0 0 0 0))
    (uuid fbecacd9-6f77-41a8-820d-7d8465d5f09c)
  )

  (text "5V bis 46V" (at 217.17 119.38 0)
    (effects (font (size 1.27 1.27)) (justify left bottom))
    (uuid 26d8fe21-6d39-496d-bd9f-32522949397c)
  )

  (label "2A" (at 19.05 48.26 0)
    (effects (font (size 1.27 1.27)) (justify left bottom))
    (uuid 10189873-3565-485c-91c1-3ae868c18dbc)
  )
  (label "1A" (at 19.05 53.34 0)
    (effects (font (size 1.27 1.27)) (justify left bottom))
    (uuid 12609e05-fc66-4b59-af70-0d223db4dbce)
  )
  (label "SDA" (at 111.76 73.66 0)
    (effects (font (size 1.27 1.27)) (justify left bottom))
    (uuid 1450af9a-c841-4004-8ca5-161ad6013deb)
  )
  (label "SDA" (at 207.01 36.83 0)
    (effects (font (size 1.27 1.27)) (justify left bottom))
    (uuid 1694cd36-62cb-4121-9335-4054ed4c3b9a)
  )
  (label "2Mess" (at 19.05 38.1 0)
    (effects (font (size 1.27 1.27)) (justify left bottom))
    (uuid 2ba3ed47-5d95-4832-a26e-158e0a930596)
  )
  (label "SCL" (at 184.15 52.07 0)
    (effects (font (size 1.27 1.27)) (justify left bottom))
    (uuid 2c727e96-a3d0-4d6c-8dcc-31935031b680)
  )
  (label "1B" (at 19.05 50.8 0)
    (effects (font (size 1.27 1.27)) (justify left bottom))
    (uuid 32967f2e-da83-485e-a3ee-27375781c35d)
  )
  (label "SDA" (at 184.15 49.53 0)
    (effects (font (size 1.27 1.27)) (justify left bottom))
    (uuid 38286fd8-d533-4cf3-95b4-2c552b87da45)
  )
  (label "2A" (at 191.77 100.33 0)
    (effects (font (size 1.27 1.27)) (justify left bottom))
    (uuid 38e07639-5ff2-44db-a21b-d4d188f7a3cd)
  )
  (label "1En" (at 107.95 35.56 0)
    (effects (font (size 1.27 1.27)) (justify left bottom))
    (uuid 53fdcddc-007e-4bc1-b5f6-f93ab412ff44)
  )
  (label "SCL" (at 124.46 86.36 0)
    (effects (font (size 1.27 1.27)) (justify left bottom))
    (uuid 67d5fe9c-c557-4a74-9d72-fa7154d0aa49)
  )
  (label "2Mess" (at 191.77 107.95 0)
    (effects (font (size 1.27 1.27)) (justify left bottom))
    (uuid 6d6ca034-94ff-4442-8ea7-be0903f7babb)
  )
  (label "2B" (at 191.77 102.87 0)
    (effects (font (size 1.27 1.27)) (justify left bottom))
    (uuid 7a5ac266-f448-470f-a33f-70cf47e41242)
  )
  (label "1Mess" (at 19.05 35.56 0)
    (effects (font (size 1.27 1.27)) (justify left bottom))
    (uuid 85c239a9-d0e8-48c4-b015-c124229fdc0c)
  )
  (label "2B" (at 19.05 45.72 0)
    (effects (font (size 1.27 1.27)) (justify left bottom))
    (uuid a6e78f67-9fa9-48a0-9b56-767d0ad6f024)
  )
  (label "2En" (at 107.95 33.02 0)
    (effects (font (size 1.27 1.27)) (justify left bottom))
    (uuid aa23226f-b304-4a3e-b386-64458d34a72c)
  )
  (label "2En" (at 191.77 105.41 0)
    (effects (font (size 1.27 1.27)) (justify left bottom))
    (uuid abe91de5-a88a-453d-86ae-12bb195aa22b)
  )
  (label "SDA" (at 124.46 78.74 0)
    (effects (font (size 1.27 1.27)) (justify left bottom))
    (uuid bc1284f8-3012-48ed-9862-b524af35b176)
  )
  (label "1Mess" (at 191.77 95.25 0)
    (effects (font (size 1.27 1.27)) (justify left bottom))
    (uuid be957946-3830-4060-abd8-5d63e0456e40)
  )
  (label "1En" (at 191.77 92.71 0)
    (effects (font (size 1.27 1.27)) (justify left bottom))
    (uuid bf3951b3-b9d1-4524-b711-03b1074e3b68)
  )
  (label "SCL" (at 111.76 76.2 0)
    (effects (font (size 1.27 1.27)) (justify left bottom))
    (uuid c3fa7f97-95ac-427b-8a66-6966f593762e)
  )
  (label "SDA" (at 250.19 46.99 0)
    (effects (font (size 1.27 1.27)) (justify left bottom))
    (uuid c659e911-5621-4977-a5ff-25a0bc39cffe)
  )
  (label "1A" (at 191.77 87.63 0)
    (effects (font (size 1.27 1.27)) (justify left bottom))
    (uuid d77a1475-670e-4996-82de-b92a9e0b9b9d)
  )
  (label "SCL" (at 252.73 49.53 0)
    (effects (font (size 1.27 1.27)) (justify left bottom))
    (uuid e02a94cd-a257-4005-829d-50e5352cc0fc)
  )
  (label "1B" (at 191.77 90.17 0)
    (effects (font (size 1.27 1.27)) (justify left bottom))
    (uuid e681d2c1-d9cd-4a63-9864-fffb7238a265)
  )
  (label "SCL" (at 207.01 34.29 0)
    (effects (font (size 1.27 1.27)) (justify left bottom))
    (uuid ee671e9a-9a82-4317-b73e-0474801aa486)
  )

  (symbol (lib_id "Device:R") (at 137.16 78.74 90) (unit 1)
    (in_bom yes) (on_board yes)
    (uuid 03427310-19fc-484f-b757-2939319bf146)
    (property "Reference" "R302" (id 0) (at 137.16 76.2 90))
    (property "Value" "4k7" (id 1) (at 137.16 81.28 90))
    (property "Footprint" "Resistor_THT:R_Axial_DIN0207_L6.3mm_D2.5mm_P2.54mm_Vertical" (id 2) (at 137.16 80.518 90)
      (effects (font (size 1.27 1.27)) hide)
    )
    (property "Datasheet" "~" (id 3) (at 137.16 78.74 0)
      (effects (font (size 1.27 1.27)) hide)
    )
    (pin "1" (uuid 864e6b35-210d-4a96-aedc-39b4e8505783))
    (pin "2" (uuid 6c9ae9ef-c68c-4d59-a4f3-7036aea286a8))
  )

  (symbol (lib_id "power:GND") (at 113.03 25.4 0) (unit 1)
    (in_bom yes) (on_board yes) (fields_autoplaced)
    (uuid 0c2f3eaf-b3e7-4140-8945-a10b3c90c28a)
    (property "Reference" "#PWR0107" (id 0) (at 113.03 31.75 0)
      (effects (font (size 1.27 1.27)) hide)
    )
    (property "Value" "GND" (id 1) (at 113.03 30.48 0))
    (property "Footprint" "" (id 2) (at 113.03 25.4 0)
      (effects (font (size 1.27 1.27)) hide)
    )
    (property "Datasheet" "" (id 3) (at 113.03 25.4 0)
      (effects (font (size 1.27 1.27)) hide)
    )
    (pin "1" (uuid 9c95ee33-d1f9-4e39-a76a-bd55674310d7))
  )

  (symbol (lib_id "Connector:Screw_Terminal_01x04") (at 241.3 118.11 270) (unit 1)
    (in_bom yes) (on_board yes) (fields_autoplaced)
    (uuid 27592db0-f92f-41ae-9524-55659b9c66d6)
    (property "Reference" "J304" (id 0) (at 240.03 121.92 90))
    (property "Value" "Screw_Terminal_01x04" (id 1) (at 240.03 124.46 90)
      (effects (font (size 1.27 1.27)) hide)
    )
    (property "Footprint" "TerminalBlock_Phoenix:TerminalBlock_Phoenix_MKDS-1,5-4-5.08_1x04_P5.08mm_Horizontal" (id 2) (at 241.3 118.11 0)
      (effects (font (size 1.27 1.27)) hide)
    )
    (property "Datasheet" "~" (id 3) (at 241.3 118.11 0)
      (effects (font (size 1.27 1.27)) hide)
    )
    (pin "1" (uuid 73dc3b44-4973-4cf7-aef0-d9cdfed356c0))
    (pin "2" (uuid b585f438-7309-4cd4-8872-7ca21d33e367))
    (pin "3" (uuid 2286d629-0015-4466-bad8-3ca9c2308911))
    (pin "4" (uuid 0e3092bc-cefa-40d0-8d7c-8c5efb053ee6))
  )

  (symbol (lib_id "Device:R") (at 143.51 82.55 90) (unit 1)
    (in_bom yes) (on_board yes)
    (uuid 382a169c-28ff-4d71-b6cf-c80059aab7d8)
    (property "Reference" "R303" (id 0) (at 143.51 80.01 90))
    (property "Value" "4k7" (id 1) (at 143.51 85.09 90))
    (property "Footprint" "Resistor_THT:R_Axial_DIN0207_L6.3mm_D2.5mm_P2.54mm_Vertical" (id 2) (at 143.51 84.328 90)
      (effects (font (size 1.27 1.27)) hide)
    )
    (property "Datasheet" "~" (id 3) (at 143.51 82.55 0)
      (effects (font (size 1.27 1.27)) hide)
    )
    (pin "1" (uuid 0d52e1c1-1cdc-4a89-9e05-18934cdaa2ad))
    (pin "2" (uuid 39a07b1a-8dc8-412c-9dd3-ae16efd29c10))
  )

  (symbol (lib_id "Device:R") (at 137.16 86.36 90) (unit 1)
    (in_bom yes) (on_board yes)
    (uuid 63a980a7-c150-437e-896f-7132332ee8df)
    (property "Reference" "R304" (id 0) (at 137.16 83.82 90))
    (property "Value" "4k7" (id 1) (at 137.16 88.9 90))
    (property "Footprint" "Resistor_THT:R_Axial_DIN0207_L6.3mm_D2.5mm_P2.54mm_Vertical" (id 2) (at 137.16 88.138 90)
      (effects (font (size 1.27 1.27)) hide)
    )
    (property "Datasheet" "~" (id 3) (at 137.16 86.36 0)
      (effects (font (size 1.27 1.27)) hide)
    )
    (pin "1" (uuid bb74453b-793d-42ed-aa5f-ef411d7ca60f))
    (pin "2" (uuid eb701bfc-c359-4ab2-af52-326e1ee9caa8))
  )

  (symbol (lib_id "power:GND") (at 251.46 55.88 0) (unit 1)
    (in_bom yes) (on_board yes) (fields_autoplaced)
    (uuid 6501dcae-5150-44fb-9ca5-01e8dcf41bca)
    (property "Reference" "#PWR0302" (id 0) (at 251.46 62.23 0)
      (effects (font (size 1.27 1.27)) hide)
    )
    (property "Value" "GND" (id 1) (at 251.46 60.96 0))
    (property "Footprint" "" (id 2) (at 251.46 55.88 0)
      (effects (font (size 1.27 1.27)) hide)
    )
    (property "Datasheet" "" (id 3) (at 251.46 55.88 0)
      (effects (font (size 1.27 1.27)) hide)
    )
    (pin "1" (uuid dad7b78c-b708-4fd2-98b1-d618727d9c4e))
  )

  (symbol (lib_id "Connector:Screw_Terminal_01x02") (at 232.41 118.11 270) (unit 1)
    (in_bom yes) (on_board yes)
    (uuid 7503c719-edab-4881-9291-70a08d849578)
    (property "Reference" "J303" (id 0) (at 229.87 120.65 90)
      (effects (font (size 1.27 1.27)) (justify left))
    )
    (property "Value" "Screw_Terminal_01x02" (id 1) (at 227.33 116.8401 90)
      (effects (font (size 1.27 1.27)) (justify right) hide)
    )
    (property "Footprint" "TerminalBlock_Phoenix:TerminalBlock_Phoenix_MKDS-1,5-2-5.08_1x02_P5.08mm_Horizontal" (id 2) (at 232.41 118.11 0)
      (effects (font (size 1.27 1.27)) hide)
    )
    (property "Datasheet" "~" (id 3) (at 232.41 118.11 0)
      (effects (font (size 1.27 1.27)) hide)
    )
    (pin "1" (uuid 7a2e8b83-67ca-4e21-80e2-583e820fb2b6))
    (pin "2" (uuid 2bb6f61e-db6a-4234-a650-29e6fc7e8a7e))
  )

  (symbol (lib_id "power:+3.3V") (at 160.02 85.09 0) (unit 1)
    (in_bom yes) (on_board yes) (fields_autoplaced)
    (uuid 93d3fa14-716e-4df6-8801-59625359d5d2)
    (property "Reference" "#PWR0306" (id 0) (at 160.02 88.9 0)
      (effects (font (size 1.27 1.27)) hide)
    )
    (property "Value" "+3.3V" (id 1) (at 160.02 80.01 0))
    (property "Footprint" "" (id 2) (at 160.02 85.09 0)
      (effects (font (size 1.27 1.27)) hide)
    )
    (property "Datasheet" "" (id 3) (at 160.02 85.09 0)
      (effects (font (size 1.27 1.27)) hide)
    )
    (pin "1" (uuid f2ac499e-2fba-4f53-80f5-0b26eb65a6f0))
  )

  (symbol (lib_id "Espressif:ESP32-DevKitC") (at 67.31 52.07 0) (unit 1)
    (in_bom yes) (on_board yes) (fields_autoplaced)
    (uuid 9a858925-c1aa-46d6-867f-d7436dda6c5c)
    (property "Reference" "U301" (id 0) (at 69.215 21.59 0))
    (property "Value" "ESP32-DevKitC" (id 1) (at 69.215 24.13 0))
    (property "Footprint" "Espressif:ESP32-DevKitC" (id 2) (at 67.31 83.82 0)
      (effects (font (size 1.27 1.27)) hide)
    )
    (property "Datasheet" "https://docs.espressif.com/projects/esp-idf/zh_CN/latest/esp32/hw-reference/esp32/get-started-devkitc.html" (id 3) (at 71.12 83.82 0)
      (effects (font (size 1.27 1.27)) hide)
    )
    (pin "14" (uuid 1a822374-eb30-4023-95e9-192eada62fdf))
    (pin "19" (uuid 8966fed6-e5d0-4b26-ae21-84780a0f28f8))
    (pin "1" (uuid 16239bad-3028-49dd-b5ed-9f15fc8ade4c))
    (pin "10" (uuid 2665107c-f56b-4cf5-94ef-47bad4836712))
    (pin "11" (uuid 6c6adff8-8c4d-484f-bae2-1afe54b2f915))
    (pin "12" (uuid b2453ad4-8031-402f-bacf-1db72c54d17e))
    (pin "13" (uuid e51e2700-9512-487d-a3ee-d8264b3d3f47))
    (pin "15" (uuid 99a79a2d-f412-4960-9725-d7d104cb3f30))
    (pin "16" (uuid 2912bbe5-b479-4ff2-9ed7-ee0fdd203236))
    (pin "17" (uuid b9339545-34dd-4d8d-a7e0-d8c064c52b6b))
    (pin "18" (uuid 2532d44b-1c29-4cdf-9485-0224022b0ae3))
    (pin "2" (uuid 3d33d1b4-a4d0-4729-98ed-b183cc441460))
    (pin "20" (uuid 49e5d94c-493f-443a-a538-83b2c75f16ed))
    (pin "21" (uuid f2559531-0def-4cf5-b3d2-23aebde00d75))
    (pin "22" (uuid 65b15415-509d-4e10-8f10-37a2073a68c3))
    (pin "23" (uuid da3a2ed1-dfc6-400e-b341-492bff35bd89))
    (pin "24" (uuid 94788c68-ce2b-4203-a739-a7c30a73e0b8))
    (pin "25" (uuid aa6df238-3d87-41ae-9d48-2320520d3baf))
    (pin "26" (uuid edb8d953-be3e-42d3-b226-08913e8c9e4c))
    (pin "27" (uuid 009f70fb-0d50-4116-bb2f-495de543c74f))
    (pin "28" (uuid 1d0fb4e1-bbc7-46b3-aabf-57da413e43e6))
    (pin "29" (uuid bb7f7916-0783-44b0-9601-d12a6a8d0c99))
    (pin "3" (uuid e98dd393-20e3-4cb2-b9e2-6bea52079554))
    (pin "30" (uuid bc29f39c-4c64-40ae-ab2e-de96b2a7e9f0))
    (pin "31" (uuid 551a75c9-269e-4a6e-9c10-110296e48d9f))
    (pin "32" (uuid 5b85f5bf-adb7-4b3d-bb57-cfea2ea81e11))
    (pin "33" (uuid df81f999-9a9f-462d-bd9b-2d74b24b7091))
    (pin "34" (uuid 4e90f4ae-2ab4-4915-8822-513fa290b72e))
    (pin "35" (uuid 3d1141e9-5058-4fb8-8eed-71a91040023c))
    (pin "36" (uuid a4074505-1d84-4e6a-8457-67efae66f47b))
    (pin "37" (uuid 195cde20-4f53-4956-a317-beb011ed94b9))
    (pin "38" (uuid f789ccdf-2cbe-4521-b6d4-12eddeabacc3))
    (pin "4" (uuid 2ec3216b-5412-4387-b25c-6738fbb13ed9))
    (pin "5" (uuid 060e5e85-6fe6-4c52-abc3-a21bcb4d0a66))
    (pin "6" (uuid 9d3d18fb-95fa-4c82-a0f9-a236bbe3c5d7))
    (pin "7" (uuid 8af8d86c-5a00-428e-a408-90ba240ead93))
    (pin "8" (uuid a5316611-9f79-44ca-ba86-8e94cab23688))
    (pin "9" (uuid 16d667ca-c5a4-40da-a3d1-9fbc8a5bc035))
  )

  (symbol (lib_id "Jumper:Jumper_2_Open") (at 234.95 73.66 90) (unit 1)
    (in_bom yes) (on_board yes) (fields_autoplaced)
    (uuid bce9ec12-2a1c-43bc-bba2-b02b2cd8f7e4)
    (property "Reference" "JP302" (id 0) (at 236.22 73.6599 90)
      (effects (font (size 1.27 1.27)) (justify right))
    )
    (property "Value" "Jumper_2_Open" (id 1) (at 236.22 74.9299 90)
      (effects (font (size 1.27 1.27)) (justify right) hide)
    )
    (property "Footprint" "Resistor_THT:R_Axial_DIN0207_L6.3mm_D2.5mm_P10.16mm_Horizontal" (id 2) (at 234.95 73.66 0)
      (effects (font (size 1.27 1.27)) hide)
    )
    (property "Datasheet" "~" (id 3) (at 234.95 73.66 0)
      (effects (font (size 1.27 1.27)) hide)
    )
    (pin "1" (uuid 0ecfe18c-11f3-483c-a01b-6caea0adc527))
    (pin "2" (uuid 8975659b-c8fa-4d56-bf60-f4d10bd87ce1))
  )

  (symbol (lib_id "Jumper:Jumper_2_Open") (at 226.06 73.66 90) (unit 1)
    (in_bom yes) (on_board yes) (fields_autoplaced)
    (uuid bec93bbc-65c6-42d8-af16-22ebca6bd642)
    (property "Reference" "JP301" (id 0) (at 227.33 73.6599 90)
      (effects (font (size 1.27 1.27)) (justify right))
    )
    (property "Value" "Jumper_2_Open" (id 1) (at 227.33 74.9299 90)
      (effects (font (size 1.27 1.27)) (justify right) hide)
    )
    (property "Footprint" "Resistor_THT:R_Axial_DIN0207_L6.3mm_D2.5mm_P10.16mm_Horizontal" (id 2) (at 226.06 73.66 0)
      (effects (font (size 1.27 1.27)) hide)
    )
    (property "Datasheet" "~" (id 3) (at 226.06 73.66 0)
      (effects (font (size 1.27 1.27)) hide)
    )
    (pin "1" (uuid f8b65fcf-e734-41b9-8adf-e7d3508e37d5))
    (pin "2" (uuid e90f88a1-8861-43b5-8a73-0b86267bcbfc))
  )

  (symbol (lib_id "power:+12V") (at 280.67 54.61 0) (unit 1)
    (in_bom yes) (on_board yes) (fields_autoplaced)
    (uuid c6cf4306-3f8d-4ab5-a905-3a8d4af5ed31)
    (property "Reference" "#PWR0304" (id 0) (at 280.67 58.42 0)
      (effects (font (size 1.27 1.27)) hide)
    )
    (property "Value" "+12V" (id 1) (at 280.67 49.53 0))
    (property "Footprint" "" (id 2) (at 280.67 54.61 0)
      (effects (font (size 1.27 1.27)) hide)
    )
    (property "Datasheet" "" (id 3) (at 280.67 54.61 0)
      (effects (font (size 1.27 1.27)) hide)
    )
    (pin "1" (uuid b5b9de33-137c-46db-ba14-0850bfab8ff3))
  )

  (symbol (lib_id "power:GND") (at 113.03 45.72 0) (unit 1)
    (in_bom yes) (on_board yes) (fields_autoplaced)
    (uuid cb8fbf67-88be-4874-81f5-8855f59c2d99)
    (property "Reference" "#PWR0106" (id 0) (at 113.03 52.07 0)
      (effects (font (size 1.27 1.27)) hide)
    )
    (property "Value" "GND" (id 1) (at 113.03 50.8 0))
    (property "Footprint" "" (id 2) (at 113.03 45.72 0)
      (effects (font (size 1.27 1.27)) hide)
    )
    (property "Datasheet" "" (id 3) (at 113.03 45.72 0)
      (effects (font (size 1.27 1.27)) hide)
    )
    (pin "1" (uuid 38a3d3cc-ae10-4351-b50e-58d0da280896))
  )

  (symbol (lib_id "power:+5V") (at 19.05 76.2 0) (unit 1)
    (in_bom yes) (on_board yes) (fields_autoplaced)
    (uuid cbd4cb99-1606-4c27-8182-24d77f72dfc3)
    (property "Reference" "#PWR0103" (id 0) (at 19.05 80.01 0)
      (effects (font (size 1.27 1.27)) hide)
    )
    (property "Value" "+5V" (id 1) (at 19.05 71.12 0))
    (property "Footprint" "" (id 2) (at 19.05 76.2 0)
      (effects (font (size 1.27 1.27)) hide)
    )
    (property "Datasheet" "" (id 3) (at 19.05 76.2 0)
      (effects (font (size 1.27 1.27)) hide)
    )
    (pin "1" (uuid 5dd78f49-0946-4f15-b28d-781a2bef465f))
  )

  (symbol (lib_id "Connector:Screw_Terminal_01x02") (at 238.76 15.24 270) (mirror x) (unit 1)
    (in_bom yes) (on_board yes) (fields_autoplaced)
    (uuid ce52328c-2457-4b51-985c-18d9656ba352)
    (property "Reference" "J301" (id 0) (at 233.68 15.2399 90)
      (effects (font (size 1.27 1.27)) (justify right))
    )
    (property "Value" "Screw_Terminal_01x02" (id 1) (at 233.68 16.5099 90)
      (effects (font (size 1.27 1.27)) (justify right) hide)
    )
    (property "Footprint" "TerminalBlock_Phoenix:TerminalBlock_Phoenix_MKDS-1,5-2-5.08_1x02_P5.08mm_Horizontal" (id 2) (at 238.76 15.24 0)
      (effects (font (size 1.27 1.27)) hide)
    )
    (property "Datasheet" "~" (id 3) (at 238.76 15.24 0)
      (effects (font (size 1.27 1.27)) hide)
    )
    (pin "1" (uuid d7130990-fb3d-4318-b764-13e22091be99))
    (pin "2" (uuid f893fa5e-7c4a-4052-85f6-f7a0032174e4))
  )

  (symbol (lib_id "Connector:Conn_01x05_Male") (at 266.7 62.23 270) (mirror x) (unit 1)
    (in_bom yes) (on_board yes) (fields_autoplaced)
    (uuid cf1ca02b-10a9-46b9-9b59-d3fc60b5f21f)
    (property "Reference" "J305" (id 0) (at 266.7 64.77 90))
    (property "Value" "Conn_01x05_Male" (id 1) (at 266.7 67.31 90))
    (property "Footprint" "Connector_PinHeader_2.54mm:PinHeader_1x05_P2.54mm_Horizontal" (id 2) (at 266.7 62.23 0)
      (effects (font (size 1.27 1.27)) hide)
    )
    (property "Datasheet" "~" (id 3) (at 266.7 62.23 0)
      (effects (font (size 1.27 1.27)) hide)
    )
    (pin "1" (uuid 7977003d-6fe1-43d5-a264-1fafb9381822))
    (pin "2" (uuid 23785a1b-e911-4871-84d9-49f124841673))
    (pin "3" (uuid fe241bd4-d3ed-4360-8f67-e6d08fca370f))
    (pin "4" (uuid f0591761-de37-4e8e-8a71-c6b034b87f34))
    (pin "5" (uuid 7563c319-3a8a-4ccb-839b-f8f1048cc20e))
  )

  (symbol (lib_id "power:GND") (at 22.86 63.5 0) (unit 1)
    (in_bom yes) (on_board yes) (fields_autoplaced)
    (uuid d430f6e9-af6a-470f-892e-869fed275cec)
    (property "Reference" "#PWR0105" (id 0) (at 22.86 69.85 0)
      (effects (font (size 1.27 1.27)) hide)
    )
    (property "Value" "GND" (id 1) (at 22.86 68.58 0))
    (property "Footprint" "" (id 2) (at 22.86 63.5 0)
      (effects (font (size 1.27 1.27)) hide)
    )
    (property "Datasheet" "" (id 3) (at 22.86 63.5 0)
      (effects (font (size 1.27 1.27)) hide)
    )
    (pin "1" (uuid baa9448b-e380-4d19-9e1b-8948e979ffe3))
  )

  (symbol (lib_id "power:+5V") (at 154.94 81.28 0) (unit 1)
    (in_bom yes) (on_board yes) (fields_autoplaced)
    (uuid d817ce74-a4fd-45af-82a0-ce579e316a8e)
    (property "Reference" "#PWR0305" (id 0) (at 154.94 85.09 0)
      (effects (font (size 1.27 1.27)) hide)
    )
    (property "Value" "+5V" (id 1) (at 154.94 76.2 0))
    (property "Footprint" "" (id 2) (at 154.94 81.28 0)
      (effects (font (size 1.27 1.27)) hide)
    )
    (property "Datasheet" "" (id 3) (at 154.94 81.28 0)
      (effects (font (size 1.27 1.27)) hide)
    )
    (pin "1" (uuid 99230107-519f-4ffd-baea-879405477bbb))
  )

  (symbol (lib_id "power:+5V") (at 275.59 50.8 0) (unit 1)
    (in_bom yes) (on_board yes) (fields_autoplaced)
    (uuid e31a83dd-64d1-4e6c-beb2-757b9ecaa4cb)
    (property "Reference" "#PWR0303" (id 0) (at 275.59 54.61 0)
      (effects (font (size 1.27 1.27)) hide)
    )
    (property "Value" "+5V" (id 1) (at 275.59 45.72 0))
    (property "Footprint" "" (id 2) (at 275.59 50.8 0)
      (effects (font (size 1.27 1.27)) hide)
    )
    (property "Datasheet" "" (id 3) (at 275.59 50.8 0)
      (effects (font (size 1.27 1.27)) hide)
    )
    (pin "1" (uuid 7b2bd544-5fe1-4aa3-bb1a-bc78194a3769))
  )

  (symbol (lib_id "Connector:Conn_01x05_Female") (at 266.7 39.37 270) (mirror x) (unit 1)
    (in_bom yes) (on_board yes) (fields_autoplaced)
    (uuid efb0fb8f-6595-423b-92ab-9c5c0dcf66a1)
    (property "Reference" "J302" (id 0) (at 266.7 34.29 90))
    (property "Value" "Conn_01x05_Female" (id 1) (at 266.7 36.83 90))
    (property "Footprint" "Connector_PinSocket_2.54mm:PinSocket_1x05_P2.54mm_Horizontal" (id 2) (at 266.7 39.37 0)
      (effects (font (size 1.27 1.27)) hide)
    )
    (property "Datasheet" "~" (id 3) (at 266.7 39.37 0)
      (effects (font (size 1.27 1.27)) hide)
    )
    (pin "1" (uuid 2067ab72-bb0b-4a0d-8f00-02ed8ffc4a8d))
    (pin "2" (uuid 349649fb-e7da-4f93-8342-0d3d1561f81c))
    (pin "3" (uuid 76ebce58-658e-4b6f-bd2a-ecb18470bf88))
    (pin "4" (uuid adfd25e4-2edc-4ba2-b915-c9ffb7b02be3))
    (pin "5" (uuid ab899a0d-6abd-47e6-b563-39712bd307e2))
  )

  (symbol (lib_id "power:+3.3V") (at 31.75 29.21 0) (unit 1)
    (in_bom yes) (on_board yes) (fields_autoplaced)
    (uuid f2572be6-a1d8-41ce-b35a-69a9830c8cd9)
    (property "Reference" "#PWR0301" (id 0) (at 31.75 33.02 0)
      (effects (font (size 1.27 1.27)) hide)
    )
    (property "Value" "+3.3V" (id 1) (at 31.75 24.13 0))
    (property "Footprint" "" (id 2) (at 31.75 29.21 0)
      (effects (font (size 1.27 1.27)) hide)
    )
    (property "Datasheet" "" (id 3) (at 31.75 29.21 0)
      (effects (font (size 1.27 1.27)) hide)
    )
    (pin "1" (uuid 8f25923f-97c7-42f5-8ee0-8a87be38d5dc))
  )

  (symbol (lib_id "Device:R") (at 143.51 74.93 90) (unit 1)
    (in_bom yes) (on_board yes)
    (uuid fc4f2d85-95e6-494e-ad8e-549d8dc8a347)
    (property "Reference" "R301" (id 0) (at 143.51 72.39 90))
    (property "Value" "4k7" (id 1) (at 143.51 77.47 90))
    (property "Footprint" "Resistor_THT:R_Axial_DIN0207_L6.3mm_D2.5mm_P2.54mm_Vertical" (id 2) (at 143.51 76.708 90)
      (effects (font (size 1.27 1.27)) hide)
    )
    (property "Datasheet" "~" (id 3) (at 143.51 74.93 0)
      (effects (font (size 1.27 1.27)) hide)
    )
    (pin "1" (uuid 87fd79c2-c986-4ca0-8e74-ddf57409b14d))
    (pin "2" (uuid 453fc808-4126-453d-85ae-1cdb419088b5))
  )

  (sheet (at 205.74 86.36) (size 19.05 22.86) (fields_autoplaced)
    (stroke (width 0.1524) (type solid) (color 0 0 0 0))
    (fill (color 0 0 0 0.0000))
    (uuid 013c6789-c805-49ac-abe0-7cbc8eaecb8a)
    (property "Sheet name" "Motortreiber" (id 0) (at 205.74 85.6484 0)
      (effects (font (size 1.27 1.27)) (justify left bottom))
    )
    (property "Sheet file" "motortreiber.kicad_sch" (id 1) (at 205.74 109.8046 0)
      (effects (font (size 1.27 1.27)) (justify left top) hide)
    )
    (pin "M1B" output (at 224.79 91.44 0)
      (effects (font (size 1.27 1.27)) (justify right))
      (uuid 91ac4179-fb21-41be-8757-0d37c12469c5)
    )
    (pin "M1A" output (at 224.79 88.9 0)
      (effects (font (size 1.27 1.27)) (justify right))
      (uuid 8d8e4780-9899-44de-8edd-7ade9e9cf1c7)
    )
    (pin "M2B" output (at 224.79 97.79 0)
      (effects (font (size 1.27 1.27)) (justify right))
      (uuid 08c11219-290a-4dc3-b03d-7824aa3d5af9)
    )
    (pin "M2A" output (at 224.79 95.25 0)
      (effects (font (size 1.27 1.27)) (justify right))
      (uuid 5e5de063-1dcb-4f64-a7af-19a5fd723059)
    )
    (pin "1Enable" input (at 205.74 92.71 180)
      (effects (font (size 1.27 1.27)) (justify left))
      (uuid d905af8a-eb25-4f99-84f4-be20c1aa4a78)
    )
    (pin "1B" input (at 205.74 90.17 180)
      (effects (font (size 1.27 1.27)) (justify left))
      (uuid 62393b79-cd17-4782-b7a1-91df05a1c59d)
    )
    (pin "1A" input (at 205.74 87.63 180)
      (effects (font (size 1.27 1.27)) (justify left))
      (uuid b4dfca58-5d51-487f-8a2c-13f909f8726e)
    )
    (pin "2Enable" input (at 205.74 105.41 180)
      (effects (font (size 1.27 1.27)) (justify left))
      (uuid b194a82b-9d0e-4f78-b601-9ac64b2e8886)
    )
    (pin "2A" input (at 205.74 100.33 180)
      (effects (font (size 1.27 1.27)) (justify left))
      (uuid c37f77c1-31b6-41dd-af98-0b1c187127aa)
    )
    (pin "2B" input (at 205.74 102.87 180)
      (effects (font (size 1.27 1.27)) (justify left))
      (uuid 9fa21e4c-ed0f-42c6-8437-e7a91a901df1)
    )
    (pin "2Mess" output (at 205.74 107.95 180)
      (effects (font (size 1.27 1.27)) (justify left))
      (uuid 6088fbe5-2ada-49e8-8407-6fd6c2581c30)
    )
    (pin "1Mess" output (at 205.74 95.25 180)
      (effects (font (size 1.27 1.27)) (justify left))
      (uuid 5ac9d12a-1c1a-4e94-aabc-63284dfa9c0a)
    )
    (pin "VS" input (at 224.79 104.14 0)
      (effects (font (size 1.27 1.27)) (justify right))
      (uuid 630a2ff4-4f30-4a0d-b78b-2c9df3905ea1)
    )
    (pin "GNDPWR" input (at 224.79 106.68 0)
      (effects (font (size 1.27 1.27)) (justify right))
      (uuid 04079c7e-0d6d-47e3-abd4-edd33a32ac9f)
    )
  )

  (sheet (at 189.23 48.26) (size 12.7 8.89) (fields_autoplaced)
    (stroke (width 0.1524) (type solid) (color 0 0 0 0))
    (fill (color 0 0 0 0.0000))
    (uuid c079aac2-0176-4b29-96e0-2718f74a2581)
    (property "Sheet name" "PCA9635 Servo" (id 0) (at 189.23 47.5484 0)
      (effects (font (size 1.27 1.27)) (justify left bottom))
    )
    (property "Sheet file" "Servo.kicad_sch" (id 1) (at 189.23 57.7346 0)
      (effects (font (size 1.27 1.27)) (justify left top))
    )
    (pin "OE" input (at 189.23 55.88 180)
      (effects (font (size 1.27 1.27)) (justify left))
      (uuid 528b9938-30f8-43ac-aee5-6ee6f0272a05)
    )
    (pin "SDA" bidirectional (at 189.23 49.53 180)
      (effects (font (size 1.27 1.27)) (justify left))
      (uuid ae552103-3755-4d9c-8f8c-22704d4af04c)
    )
    (pin "SCL" bidirectional (at 189.23 52.07 180)
      (effects (font (size 1.27 1.27)) (justify left))
      (uuid 602cf043-73ac-46c3-849c-f3c49cdc3332)
    )
  )

  (sheet (at 36.83 85.09) (size 12.7 15.24) (fields_autoplaced)
    (stroke (width 0.1524) (type solid) (color 0 0 0 0))
    (fill (color 0 0 0 0.0000))
    (uuid c3ae173e-fd64-439b-98c6-e5ca41528bd9)
    (property "Sheet name" "Lan" (id 0) (at 36.83 84.3784 0)
      (effects (font (size 1.27 1.27)) (justify left bottom))
    )
    (property "Sheet file" "lan.kicad_sch" (id 1) (at 36.83 100.9146 0)
      (effects (font (size 1.27 1.27)) (justify left top))
    )
    (pin "Si" input (at 36.83 86.36 180)
      (effects (font (size 1.27 1.27)) (justify left))
      (uuid 581feb56-c7f9-448a-8973-e080dca47411)
    )
    (pin "So" output (at 36.83 88.9 180)
      (effects (font (size 1.27 1.27)) (justify left))
      (uuid 6d74511a-1e37-47a3-be9a-9698720adb90)
    )
    (pin "Sck" input (at 36.83 91.44 180)
      (effects (font (size 1.27 1.27)) (justify left))
      (uuid 10731a38-902e-476b-ae21-755798fcd310)
    )
    (pin "Cs" input (at 36.83 93.98 180)
      (effects (font (size 1.27 1.27)) (justify left))
      (uuid 8ad7f357-806f-4d19-b310-647fd3c2f925)
    )
    (pin "Int" output (at 36.83 96.52 180)
      (effects (font (size 1.27 1.27)) (justify left))
      (uuid 80d63f35-4709-49f7-ba70-49949e63e072)
    )
    (pin "Reset" input (at 36.83 99.06 180)
      (effects (font (size 1.27 1.27)) (justify left))
      (uuid 46bf2ce1-315b-4eab-888d-0c57051708e5)
    )
  )

  (sheet (at 213.36 30.48) (size 19.05 30.48) (fields_autoplaced)
    (stroke (width 0.1524) (type solid) (color 0 0 0 0))
    (fill (color 0 0 0 0.0000))
    (uuid e5b83e64-c70c-4e3c-91cb-1e480aa92410)
    (property "Sheet name" "Relais Ansteuerung" (id 0) (at 213.36 29.7684 0)
      (effects (font (size 1.27 1.27)) (justify left bottom))
    )
    (property "Sheet file" "RelaisAnsteuerung.kicad_sch" (id 1) (at 213.36 61.5446 0)
      (effects (font (size 1.27 1.27)) (justify left top) hide)
    )
    (pin "SDA" bidirectional (at 213.36 36.83 180)
      (effects (font (size 1.27 1.27)) (justify left))
      (uuid 30c31e7f-28ff-4f3a-91fa-1f649c1a0784)
    )
    (pin "A" input (at 232.41 34.29 0)
      (effects (font (size 1.27 1.27)) (justify right))
      (uuid da409276-fbb4-4271-a35a-00143e5c78c8)
    )
    (pin "B" input (at 232.41 36.83 0)
      (effects (font (size 1.27 1.27)) (justify right))
      (uuid 8ce0f130-5e39-4bc1-acbc-a6c2a06d613f)
    )
    (pin "SCL" bidirectional (at 213.36 34.29 180)
      (effects (font (size 1.27 1.27)) (justify left))
      (uuid 0ce3e2d8-2ac7-4132-b218-9021217cb38f)
    )
  )
)
