(kicad_wks (version 20210606) (generator pl_editor)
  (setup (textsize 1.5 1.5)(linewidth 0.15)(textlinewidth 0.15)
  (left_margin 10)(right_margin 10)(top_margin 10)(bottom_margin 10))
  (rect (name "") (start 110 34) (end 2 2) (comment "rect around the title block")
)
  (rect (name "") (start 0 0 ltcorner) (end 0 0) (repeat 2) (incrx 2) (incry 2))
  (line (name "") (start 50 2 ltcorner) (end 50 0 ltcorner) (repeat 30) (incrx 50))
  (tbtext "1" (name "") (pos 25 1 ltcorner) (font (size 1.3 1.3)) (repeat 100) (incrx 50))
  (line (name "") (start 50 2 lbcorner) (end 50 0 lbcorner) (repeat 30) (incrx 50))
  (tbtext "1" (name "") (pos 25 1 lbcorner) (font (size 1.3 1.3)) (repeat 100) (incrx 50))
  (line (name "") (start 0 50 ltcorner) (end 2 50 ltcorner) (repeat 30) (incry 50))
  (tbtext "A" (name "") (pos 1 25 ltcorner) (font (size 1.3 1.3)) (justify center) (repeat 100) (incry 50))
  (line (name "") (start 0 50 rtcorner) (end 2 50 rtcorner) (repeat 30) (incry 50))
  (tbtext "A" (name "") (pos 1 25 rtcorner) (font (size 1.3 1.3)) (justify center) (repeat 100) (incry 50))
  (tbtext "Date: ${ISSUE_DATE}" (name "") (pos 87 6.9))
  (line (name "") (start 110 5.5) (end 2 5.5))
  (tbtext "${KICAD_VERSION}" (name "") (pos 109 4.1) (comment "Kicad version")
)
  (line (name "") (start 110 8.5) (end 2 8.5))
  (tbtext "Rev: ${REVISION}" (name "") (pos 24 6.9) (font bold))
  (tbtext "Size: ${PAPER}" (name "") (pos 109 6.9) (comment "Paper format name")
)
  (tbtext "Id: ${#}/${##}" (name "") (pos 24 4.1) (comment "Sheet id")
)
  (line (name "") (start 110 12.5) (end 2 12.5))
  (tbtext "Title: ${TITLE}" (name "") (pos 109 10.7) (font (size 2 2) bold italic))
  (tbtext "File: ${FILENAME}" (name "") (pos 109 14.3))
  (line (name "") (start 110 18.5) (end 2 18.5))
  (tbtext "Sheet: ${SHEETNAME}" (name "") (pos 109 17))
  (tbtext "${COMPANY}" (name "") (pos 109 20) (font bold) (comment "Company name")
)
  (tbtext "${COMMENT1}" (name "") (pos 109 23) (comment "Comment 0")
)
  (tbtext "${COMMENT2}" (name "") (pos 109 26) (comment "Comment 1")
)
  (tbtext "${COMMENT3}" (name "") (pos 109 29) (comment "Comment 2")
)
  (tbtext "${COMMENT4}" (name "") (pos 109 32) (comment "Comment 3")
)
  (line (name "") (start 90 8.5) (end 90 5.5))
  (line (name "") (start 26 8.5) (end 26 2))
  (bitmap (name "") (pos 27.714 40.7502) (scale 1)
  (pngdata
    (data "89 50 4E 47 0D 0A 1A 0A 00 00 00 0D 49 48 44 52 00 00 02 55 00 00 00 91 08 06 00 00 00 EA E0 4D ")
    (data "39 00 00 00 04 73 42 49 54 08 08 08 08 7C 08 64 88 00 00 00 09 70 48 59 73 00 00 1E 78 00 00 1E ")
    (data "78 01 CB AB 03 1F 00 00 20 00 49 44 41 54 78 9C ED 9D 79 FC 1D E3 F5 C7 DF 89 2D B6 DA 5A 8A 86 ")
    (data "30 F6 AD 0C 45 ED 6A D7 52 B4 A5 96 5A 46 2D 3F 5A 6A E9 94 61 4A 3B 3A 65 5A 2A 5A B5 8F 5A DB ")
    (data "B4 4A ED 84 5A 6A D7 9A 92 8A A2 86 50 5B ED 21 04 91 F8 FD 71 E6 9B DC DC CC DC 3B DB 5D BE DF ")
    (data "9C F7 EB F5 7D 71 67 9E 79 9E E7 DE DC 3B 73 9E F3 9C F3 39 30 1B 10 78 CE 02 81 E7 8C E8 F5 3C ")
    (data "14 45 51 14 45 19 BA 0C EF F5 04 3A 4D E0 39 E7 00 EF 01 6F 05 9E 73 5C AF E7 A3 28 8A A2 28 CA ")
    (data "D0 64 58 AF 27 D0 49 02 CF D9 1D 18 D3 74 78 55 DB F5 9F EC C5 7C 14 45 51 14 45 19 BA 0C 59 4F ")
    (data "55 E0 39 F3 02 BF 48 39 35 77 B7 E7 A2 28 8A A2 28 CA D0 67 C8 1A 55 C0 F7 80 65 9A 8E 8D B5 5D ")
    (data "7F 5C 2F 26 A3 28 8A A2 28 CA D0 66 48 1A 55 81 E7 CC 0D FC A0 E9 F0 27 29 C7 14 45 51 14 45 51 ")
    (data "6A 61 48 1A 55 C0 1E C0 52 4D C7 42 DB F5 FF DD 8B C9 28 8A A2 28 8A 32 F4 19 AA 46 D5 DE 4D AF ")
    (data "3F 05 4E EF C5 44 14 45 51 14 45 99 3D 18 72 D9 7F 81 E7 2C 0A FC 0F 98 B3 E1 F0 4D B6 EB 7F B5 ")
    (data "47 53 52 14 45 51 14 65 36 60 28 7A AA B6 63 66 83 0A E0 0F BD 98 88 A2 28 8A A2 28 B3 0F 43 D1 ")
    (data "A8 DA A8 E9 F5 54 E0 BA 5E 4C 44 51 14 45 51 94 D9 87 A1 68 54 6D D8 F4 7A 9C ED FA 13 7B 32 13 ")
    (data "45 51 14 45 51 66 1B 86 A2 51 35 57 D3 EB 07 7B 32 0B 45 51 14 45 51 66 2B 86 A2 51 F5 4B 60 5A ")
    (data "C3 EB AB 7A 35 11 45 51 14 45 51 66 1F 06 7D F6 5F 22 F4 39 1F 62 20 4E 43 8A 27 AF 0A 6C 0E FC ")
    (data "D3 76 FD FB 7B 38 3D 45 51 14 45 51 66 13 06 85 51 15 78 CE 67 01 33 F9 5B 13 18 85 94 A0 59 12 ")
    (data "98 23 E5 92 C9 C0 7F 81 97 81 27 81 7F 01 8F 02 FF B0 5D FF E3 2E 4C 59 51 14 45 51 94 D9 8C BE ")
    (data "34 AA 02 CF 19 86 64 F1 ED 04 6C 0B AC 4D 3D 73 9D 0C DC 0F DC 04 5C 65 BB FE 0B 35 F4 A9 28 8A ")
    (data "A2 28 8A D2 5F 46 55 E0 39 CB 02 07 21 8A E8 A3 BA 30 E4 03 C0 79 C0 18 DB F5 3F EC C2 78 8A A2 ")
    (data "28 8A A2 0C 51 FA C2 A8 0A 3C 67 1D E0 87 C0 EE A4 6F E7 75 9A 37 81 DF 00 67 DA AE FF 4E 0F C6 ")
    (data "57 14 45 51 14 65 90 D3 53 A3 2A F0 9C 51 C0 A9 48 01 E4 7E E0 6D 64 3E 67 6A EC 95 A2 28 8A A2 ")
    (data "28 45 E8 89 51 15 78 CE 5C C0 09 C0 71 C0 3C BD 98 43 1B 9E 04 0E B3 5D FF CE 5E 4F 44 51 14 45 ")
    (data "51 94 C1 41 D7 8D AA C0 73 D6 04 2E 03 BE 58 E2 F2 8F 81 C7 81 C7 80 E7 81 17 91 AD BB 0F 92 73 ")
    (data "F3 22 F2 0A 4B 00 23 81 95 90 6C C1 15 28 F7 5E 47 03 3F B2 5D FF A3 AC 06 49 50 FD DA 48 36 E2 ")
    (data "A2 C0 22 C0 C2 C9 7F 17 6C 6A 3E 2F 22 4E FA 04 10 D8 AE FF 6E 89 39 29 8A A2 28 8A D2 87 34 17 ")
    (data "1E EE 28 81 E7 EC 0F 9C 4B 31 EF D4 23 C0 8D C0 58 E0 61 DB F5 A7 94 18 77 51 60 33 60 7B 60 37 ")
    (data "E0 73 39 2F 3D 12 D8 3C F0 9C 5D 6C D7 7F 3E A3 CD D5 C0 2E 05 A7 B4 2B 62 F4 ED 57 F0 3A 45 51 ")
    (data "14 45 51 FA 94 AE 78 AA 12 6F CE 19 C0 0F 72 5E F2 26 70 01 70 89 ED FA 4F D6 3C 97 39 80 AD 80 ")
    (data "43 81 9D C9 17 18 FF 1A B0 6B B3 90 68 E0 39 9B 00 F7 94 9C CA 8B B6 EB 8F 2C 79 AD A2 28 8A A2 ")
    (data "28 7D 46 C7 3D 55 89 E2 F9 65 48 66 5F 3B 5E 05 4E 01 2E B6 5D FF 83 4E CC C7 76 FD A9 88 D7 6B ")
    (data "6C E0 39 CB 00 3F 05 F6 A1 B5 71 B5 38 70 7B E2 B1 1A DB 70 7C B1 0A 53 F9 77 85 6B 15 45 51 14 ")
    (data "45 E9 33 3A EA A9 4A BC 42 D7 20 22 9E AD F8 08 38 0D F8 85 ED FA 93 3A 39 A7 34 02 CF 59 15 F8 ")
    (data "2D B0 45 9B A6 53 10 8F D5 8D C9 75 0B 21 4A ED A3 9A DA 4D 43 32 09 1B DF CB 64 E4 7D 82 C4 82 ")
    (data "1D 69 BB 7E 5C 69 E2 8A A2 28 8A A2 F4 0D 1D 33 AA 92 2D BF 4B 80 EF B4 69 FA 08 B0 9F ED FA E3 ")
    (data "3B 35 97 3C 24 F3 3D 10 38 13 98 BF 45 D3 C9 C0 76 B6 EB DF 93 5C 37 3F B0 0E 52 73 F0 6D E0 6D ")
    (data "DB F5 DF EB F0 74 15 45 51 14 45 E9 33 3A 69 54 FD 0C 70 DA 34 1B 0D 1C 6B BB FE 27 9D 9A 47 51 ")
    (data "02 CF 59 05 F8 0B B0 72 8B 66 EF 00 1B D8 AE FF 74 77 66 A5 28 8A A2 28 4A BF D3 11 A3 2A F0 9C ")
    (data "6F 01 7F 6C D1 64 1A 70 B0 ED FA 17 75 62 FC AA 04 9E B3 30 B2 6D B9 45 8B 66 4F 01 EB AB 2C 82 ")
    (data "A2 28 8A A2 28 00 C3 EB EE 30 F0 9C 15 81 B0 45 93 81 B8 A4 BE 34 A8 00 92 52 35 DB 01 D7 B7 68 ")
    (data "B6 32 22 0F A1 28 8A A2 28 8A 52 AF 51 95 04 A6 5F 06 2C 90 D1 64 1A B0 BB ED FA D7 D5 39 6E 27 ")
    (data "48 CA D4 7C 13 B8 BD 45 B3 3D 03 CF D9 B7 4B 53 52 14 45 51 14 A5 8F A9 DB 53 75 14 B0 41 8B F3 ")
    (data "47 DA AE FF 97 9A C7 EC 18 89 61 B5 0B 30 AE 45 B3 5F 05 9E B3 78 97 A6 A4 28 8A A2 28 4A 9F 32 ")
    (data "0C 20 F0 9C 83 10 95 EF 67 81 F3 6C D7 FF 57 D1 8E 02 CF 59 1A 78 1A 29 13 93 C6 45 B6 EB 7F B7 ")
    (data "EC 44 7B 49 52 F8 F9 1F 64 EB 52 5D 61 BB FE 3E DD 9B 91 A2 28 8A A2 28 FD C6 B0 C0 73 0E 60 D6 ")
    (data "18 A8 BB 81 5F 03 D7 E6 CD CC 0B 3C E7 0A 60 AF 8C D3 E3 81 2F D9 AE 3F B9 F4 4C 7B 4C E0 39 5F ")
    (data "47 B2 02 B3 58 DF 76 FD BF 77 6B 3E 8A A2 28 8A A2 F4 17 C3 49 17 E6 DC 1C B8 0A 98 10 78 CE E9 ")
    (data "81 E7 B4 DA D2 23 F0 9C 35 80 3D 33 4E 4F 05 F6 1F CC 06 15 80 ED FA D7 D2 3A 00 FF 17 DD 9A 8B ")
    (data "A2 28 8A A2 28 FD C7 70 C4 8B 94 C5 D2 C0 D1 C0 83 81 E7 C4 81 E7 9C 92 C8 0D 34 73 32 D9 F2 0C ")
    (data "67 D9 AE FF 8F 6A D3 EC 1B 7E 88 D4 01 4C 63 F3 C0 73 36 EB E6 64 14 45 51 14 45 E9 1F 86 23 06 ")
    (data "D1 21 40 BB C2 C5 CB 03 27 00 57 36 1E 0C 3C 67 79 24 1E 2B 8D 37 92 FE 87 04 B6 EB BF 05 9C D4 ")
    (data "A2 C9 71 DD 9A 8B A2 28 8A A2 28 FD C5 70 DB F5 A7 DA AE 7F 3E B0 1A A2 CD 74 03 F0 69 8B 6B BE ")
    (data "D2 F4 FA 7B 64 67 11 FE 6C 08 8A 63 5E 88 04 E4 A7 B1 7D E0 39 46 37 27 A3 28 8A A2 28 4A 7F 30 ")
    (data "DD 18 B2 5D FF 53 DB F5 C7 DA AE BF 13 B0 22 E0 03 2F A4 5C 33 7D BB 30 F0 9C B9 C9 AE ED F7 06 ")
    (data "70 5E 8D 73 ED 0B 92 C0 FD 9F 67 9C 1E 06 1C DC C5 E9 28 8A A2 28 8A D2 27 A4 7A 98 6C D7 8F 6D ")
    (data "D7 3F 01 58 0E D8 0C 38 03 78 02 F8 3B D0 28 8B B0 1D F0 D9 8C BE CF 1E EC C1 E9 2D B8 02 78 25 ")
    (data "E3 DC 9E 81 E7 D4 AE 54 AF 28 8A A2 28 4A 7F 33 67 AB 93 B6 EB 4F 03 EE 49 FE 8E 49 69 B2 7B C6 ")
    (data "A5 D3 90 6D B2 21 89 ED FA 53 02 CF B9 10 70 53 4E 8F 04 36 46 3E 33 45 51 14 45 51 66 13 4A 7B ")
    (data "54 92 92 34 5F CD 38 7D BB ED FA 2F 96 ED 7B 90 70 49 8B 73 59 9F 8B A2 28 8A A2 28 43 94 2A DB ")
    (data "54 EB 00 8B 64 9C BB AA 42 BF 83 02 DB F5 63 E0 91 8C D3 DB 75 73 2E 8A A2 28 8A A2 F4 9E 2A 46 ")
    (data "D5 56 2D CE DD 50 A1 DF C1 44 D6 FB 5C 3B 43 CF 4B 51 14 45 51 94 21 4A CB 98 AA 36 AC 97 71 7C ")
    (data "BC ED FA 59 41 DC 43 8D 5B C9 D6 AD 5A 1F 18 DB C5 B9 28 B3 21 81 E7 B4 92 3F 69 E4 00 DB F5 7F ")
    (data "D7 C9 B9 28 8A A2 CC EE 54 F1 54 99 19 C7 EF AF D0 67 D7 08 4D 63 44 68 1A 59 2A F0 79 89 80 8F ")
    (data "33 CE 65 7D 3E 8A A2 28 8A A2 0C 41 4A 79 AA 12 7D AA 51 19 A7 4B 95 A4 09 4D 63 6E A4 0E E1 FA ")
    (data "48 AC D6 AB C0 25 56 14 C7 65 FA 6B 31 CE FC C0 B9 C0 DE C0 6B A1 69 7C C7 8A E2 DB CA F4 65 BB ")
    (data "FE 47 81 E7 3C 06 7C 29 E5 F4 2A 15 A6 A9 28 8A A2 28 CA 20 A3 AC A7 6A F9 16 D7 FE BB 68 67 A1 ")
    (data "69 6C 05 3C 85 04 B8 DB C0 41 88 5C C1 FD A1 69 D4 16 9B 14 9A C6 70 E0 1A 60 1F 44 A8 73 09 E0 ")
    (data "A6 D0 34 F6 AE D0 6D D6 FB 5D B1 42 9F 8A A2 28 8A A2 0C 32 CA 1A 55 5F 68 71 EE 99 22 1D 85 A6 ")
    (data "B1 3B 12 9B 34 2A E5 F4 E2 C0 F6 45 FA 6B C3 77 81 6D 9A 8E CD 09 5C 1C 9A 46 D9 71 B2 DE EF 52 ")
    (data "25 FB 53 14 45 51 14 65 10 52 D6 A8 FA 5C 8B 73 AF E7 ED 24 34 8D 75 80 CB 81 39 5A 34 5B 37 6F ")
    (data "7F 39 38 24 E3 F8 5C C0 1F 42 D3 58 A1 44 9F FF CB 38 FE F9 12 7D 29 8A A2 28 8A 32 48 29 6B 54 ")
    (data "CD 9F 71 7C 62 52 1B AF 2D C9 56 DC 25 88 41 D3 8A 5A B6 D1 42 D3 18 49 EB E0 F1 85 80 CB 43 D3 ")
    (data "28 1A 67 96 65 44 8E 28 D8 8F A2 28 8A A2 28 83 98 B2 46 D5 02 19 C7 3F 2C D0 C7 DE C0 9A 39 DA ")
    (data "2D 53 A0 CF 56 7C 39 47 9B 0D 80 43 0B F6 9B 69 44 06 9E F3 99 82 7D 29 8A A2 28 8A 32 48 E9 65 ")
    (data "E1 DF A3 73 B6 5B A2 A6 F1 D6 C8 D9 EE A7 A1 69 14 31 86 5A E9 04 69 61 65 45 51 14 45 99 4D 28 ")
    (data "FB D0 7F 2F E3 78 AE 2D AF D0 34 D6 02 D6 6E 3A 3C 01 09 22 7F B0 E9 F8 67 0B CD 2C 9B 95 53 8E ")
    (data "3D 8A 14 7F 6E 64 11 E0 B0 02 FD B6 DA 2E 9C 58 A0 1F 45 51 14 45 51 06 31 65 8D AA 8F 32 8E 2F ")
    (data "98 14 5A 6E C7 6E 29 C7 8E B1 A2 F8 76 60 4C D3 F1 B9 43 D3 A8 C3 B0 4A 0B 42 3F 07 B8 2C E5 F8 ")
    (data "E1 A1 69 E4 79 1F 90 1D B4 FF B1 ED FA 79 D5 AE 15 45 51 14 45 19 E4 94 35 AA B2 32 DE 86 93 2F ")
    (data "EB 6D D3 A6 D7 AF 03 D7 B5 68 BF 5C 9E 49 B5 61 F9 A6 D7 93 81 3F 02 3F 06 A6 34 9D FB 02 B3 4A ")
    (data "2F 64 91 B5 3D F9 5A FE A9 29 8A A2 28 8A 32 D8 29 6B 54 FD B7 C5 B9 66 E3 65 26 12 E5 F4 E6 A0 ")
    (data "F1 B1 56 14 0F 04 7C 2F 98 72 59 A5 92 2F A1 69 7C 0E 68 16 11 BD D6 8A E2 77 AC 28 7E 01 08 53 ")
    (data "2E FB 56 CE EE B3 B2 13 5F CA 3B 3F 45 51 14 45 51 06 3F 65 8D AA E7 C9 0E D0 6E 97 D1 B7 02 30 ")
    (data "6F D3 B1 7B 1A FE 7F F1 94 6B B6 CE 39 AF 2C 36 4E 39 76 7B C3 FF FF 36 E5 FC 76 39 FB 5E 3D E3 ")
    (data "F8 53 39 AF 57 14 45 51 14 65 08 50 CA A8 B2 5D 7F 32 F0 9F 8C D3 ED C4 3A 47 A5 1C 7B B4 E1 FF ")
    (data "D3 B6 D3 BE 56 B1 5C 4D DA 56 DE F4 F2 32 56 14 8F 03 DE 6C 3A BF 74 68 1A A3 5A 75 1A 78 CE BC ")
    (data "C0 17 33 4E 17 2E D7 A3 28 8A A2 28 CA E0 A5 4A CA FF 63 19 C7 BF D2 E6 BA 65 53 8E 35 1A 68 73 ")
    (data "A7 9C 1F 01 7C 3F CF A4 9A 49 8C B1 BD 52 4E BD DA 62 0E 03 AC D5 A6 FB 4D C8 CE FE 7B B8 CD B5 ")
    (data "8A A2 28 8A A2 0C 21 AA 18 55 F7 66 1C 1F 15 78 4E 2B 15 F4 79 9A 5E 7F 60 45 F1 5B 0D AF 5F CC ")
    (data "B8 EE E8 D0 34 CA 94 7E 39 99 59 E3 A9 60 56 29 85 B4 8C 46 A3 4D DF 5F CB 38 3E 0D 35 AA 14 45 ")
    (data "51 14 65 B6 A2 8A 51 75 7B 8B 73 BB B7 38 D7 5C E2 A6 39 F3 EE 86 8C EB 16 06 CE 09 4D 63 58 BB ")
    (data "89 0D 10 9A C6 B6 C0 11 19 A7 3F 6E 7A 9D 56 2E A7 9D 11 B7 73 C6 F1 7B 6D D7 9F D4 E6 5A 45 51 ")
    (data "14 45 51 86 10 A5 8D 2A DB F5 9F 20 3B 0B 70 CF 16 97 36 1B 33 F3 27 75 00 07 18 4B 76 3C D2 2E ")
    (data "C0 89 79 E6 17 9A C6 9A C0 EF 81 34 23 6C 12 F0 4A D3 B1 45 53 DA 35 7B D5 A6 13 78 CE C6 A4 C7 ")
    (data "87 01 5C 9F 63 8A 8A A2 28 8A A2 0C 21 AA 96 51 F9 43 C6 F1 D5 03 CF D9 30 E3 5C 73 2C D3 9C 34 ")
    (data "D4 F7 B3 A2 78 1A 70 7C 8B 31 7F 1A 9A C6 49 AD 3C 56 A1 69 6C 0C DC 41 BA A1 04 70 99 15 C5 9F ")
    (data "36 B4 9F 8B 74 71 D0 56 58 2D CE B5 D2 DC 52 14 45 51 14 65 08 52 D5 A8 FA 7D 8B 73 59 81 E5 69 ")
    (data "01 E1 33 E9 56 59 51 7C 2D F0 BB 16 7D 9F 0C FC 35 34 8D 8D 1A 0F 86 A6 B1 4C 68 1A A3 81 BB C9 ")
    (data "2E 6F F3 30 F0 A3 A6 63 2B 93 1E 70 FE 6E 5A 07 81 E7 2C 44 F6 16 E7 23 B6 EB 3F 9D 71 4E 51 14 ")
    (data "45 51 94 21 4A 25 A3 CA 76 FD 7F 02 E3 32 4E 7F 2B F0 9C 91 29 C7 1F 07 A6 36 1D FB 7A 4A BB 43 ")
    (data "80 BF B6 18 7E 4B E0 BE D0 34 5E 0D 4D E3 E1 D0 34 9E 41 F4 B3 8E 00 B2 4A CC FC 19 D8 DA 8A E2 ")
    (data "E6 DA 85 59 19 8B 2F 64 1C 3F 18 58 20 E3 DC 45 2D E6 AC 28 8A A2 28 CA 10 A5 AA A7 0A E0 EC 8C ")
    (data "E3 73 01 C7 34 1F B4 A2 78 12 F0 F7 A6 C3 BB 85 A6 B1 54 53 BB 8F 91 40 F0 6B DA 8C BF 04 F0 25 ")
    (data "5A 67 EA BD 06 EC 65 45 F1 37 53 0C 2A 80 6D 33 AE 1B DF 7C 20 F0 9C B9 81 23 33 DA 7F 44 0B EF ")
    (data "5D E0 39 DB 04 9E 73 70 E0 39 4B 65 B5 51 14 45 51 14 65 70 92 A5 B1 54 84 2B 80 D3 48 97 2D 38 ")
    (data "38 F0 9C 9F D9 AE FF 7A D3 F1 6B 81 C6 98 AB B9 90 00 F4 C3 1A 1B 59 51 FC 41 68 1A DF 00 8E 05 ")
    (data "3C 5A 04 8E B7 E0 02 E0 47 56 14 BF 9D 76 32 34 8D 45 48 57 6C 9F 0C 3C 92 72 7C 2F 60 E9 8C B1 ")
    (data "2E B7 5D FF 9D B4 13 81 E7 EC 0A 5C 9D BC 9C 1A 78 CE CD C0 85 C0 8D B6 EB 7F 92 76 4D B7 09 3C ")
    (data "67 59 A4 3C CF 06 C0 DA 88 C1 BA 20 E2 59 7C 0B 78 16 51 BF BF 05 B8 D3 76 FD 66 59 8A 22 63 2D ")
    (data "82 14 D6 DE 3A 19 6B 71 66 C4 C0 4D 4C C6 7A 04 B8 09 F9 8C 9A 13 1C BA 4A 62 4C 6F 0E 6C 04 AC ")
    (data "87 94 63 5A 8A 99 BF F7 1F 00 2F 03 13 90 B9 3F 00 8C 4D C4 72 95 0A 04 9E B3 20 E2 51 DE 0A D1 ")
    (data "8F 5B 09 58 04 D1 B0 03 78 1F A9 21 FA 0C F0 2F E0 4E E0 6E DB F5 53 B7 F0 FB 81 C0 73 B6 45 C2 ")
    (data "08 B6 40 EE 29 23 80 37 90 24 9A 7B 80 63 6C D7 FF B0 6C FF 89 46 DF 57 80 F5 91 CF 6C 39 24 A3 ")
    (data "B9 F1 3B FB 11 F2 DB 7E 01 09 CD F8 3B 70 1F 10 35 C6 9D F6 1B 49 1C EC 76 C8 3D 64 E0 F7 38 90 ")
    (data "59 3E 11 79 3F 4F 00 7F 03 AE B7 A2 B8 55 69 B5 8E 13 9A C6 EA C8 FD 63 1D 60 35 A4 BE EC E7 98 ")
    (data "B9 BA C8 44 E4 DF FE 59 44 10 FB 3E E0 4E 2B 8A 7B 7E FF 08 4D 63 7E 24 4C 67 73 60 0D E4 F3 1E ")
    (data "89 EC D8 0C 64 CE 4F 46 44 B4 9F 45 3E FB 7B 91 F9 BF DC F5 09 37 90 88 78 6F 89 54 56 59 09 29 ")
    (data "2D F7 19 60 BE A4 C9 47 48 A8 CF B3 C0 D3 48 88 D0 9D 56 14 CF E2 54 C9 43 6E 79 82 56 04 9E E3 ")
    (data "93 1D 5C 3E DA 76 FD 1F 34 1E 08 4D 63 19 E0 39 66 F6 94 4D 03 36 B6 A2 F8 C1 B4 4E 42 D3 58 09 ")
    (data "31 DE 76 C9 39 AD 07 80 63 AC 28 7E A0 55 A3 D0 34 BE 07 FC 3A E5 D4 35 56 14 EF D6 78 20 F0 9C ")
    (data "39 81 27 C9 F6 8A AD 66 BB 7E 6A E6 62 E0 39 57 90 2E 42 FA 3F 24 7E EC 22 DB F5 B3 54 EA 3B 4A ")
    (data "E0 39 1B 00 3F 43 1E 58 79 F9 37 70 A2 ED FA 57 B7 6D 39 F3 58 4B 00 27 01 07 30 E3 81 D8 8E 57 ")
    (data "80 5F 00 BF EE B6 01 1A 78 8E 09 7C 0F F8 06 F2 43 2C CA 87 88 31 3D DA 76 FD DA B5 CB 02 CF C9 ")
    (data "FB E0 3B C0 76 FD DF D5 3D 7E A7 09 3C 67 6D C4 33 BC 07 B3 96 B7 6A C7 64 64 CB FF 4C DB F5 D3 ")
    (data "16 48 3D 21 F0 9C D5 91 05 55 56 32 0F C0 27 C0 08 DB F5 9B 43 25 5A 12 9A C6 9C 88 A1 71 20 F2 ")
    (data "7B CE 0A 85 68 C7 CB C0 18 E0 B7 56 14 3F 53 B2 8F 8E 10 9A C6 5E C8 22 BB 65 9D D9 26 6E 06 02 ")
    (data "2B 8A EF EA C8 A4 52 08 4D 63 59 E0 BB C0 77 48 17 BD CE C3 64 24 F1 E9 1C 2B 8A EF AE 6B 6E 79 ")
    (data "48 92 C1 B6 03 F6 47 42 74 F2 DE AF 1B 99 06 DC 05 9C 0B FC 39 49 44 EB 38 A1 69 CC 0B EC 8B FC ")
    (data "0E BE 54 B2 9B F1 48 5D E0 F3 93 1D B6 5C D4 65 54 7D 0E 59 19 A4 7D E8 1F 02 CB DB AE 3F 93 84 ")
    (data "41 68 1A 7F 46 7E FC 8D 3C 0B AC 6B 45 71 AA B7 27 B9 6E 2D E0 50 E0 9B 88 A5 DF 3C D6 6D C0 6F ")
    (data "80 DB DA AD B4 12 29 87 C7 81 55 53 4E EF 68 45 F1 CD 8D 07 02 CF 39 14 38 27 A3 BB 9B 6C D7 FF ")
    (data "6A D6 58 81 E7 8C 26 5B 33 6B 80 07 81 CB 80 3F DA AE FF 46 9B B6 03 FD 2E 0C A4 7A E1 9A F0 6D ")
    (data "D7 3F A1 E9 DA F9 11 83 F2 80 3C 63 65 F0 07 E0 40 DB F5 3F 68 D7 30 F0 9C 3D 80 F3 80 85 4A 8E ")
    (data "F5 28 F0 0D DB F5 9F 2D 79 7D 6E 02 CF 59 15 31 E2 77 AA B1 DB EB 10 EF 43 6D 0F A9 6E 19 55 81 ")
    (data "E7 1C 07 FC BC C0 25 77 02 5B D9 AE 5F CA DB 91 6C 91 9F 06 EC 53 E6 FA 14 AE 02 7E 60 BB 7E E5 ")
    (data "42 E7 05 7E 73 A7 DA AE 3F D3 62 33 F0 9C 9D 91 DF 4C 3B 03 31 B6 5D 3F 77 46 72 F2 00 DC 0B F8 ")
    (data "09 ED 45 8B 8B F0 29 70 25 E0 5A 51 FC 5C D9 4E 42 D3 D8 85 F6 A1 1C 69 7C CD 8A E2 1B 93 3E E6 ")
    (data "43 16 A0 79 8B DD A7 31 06 38 D2 8A E2 FF 55 E8 A3 25 A1 69 8C 44 8C BE 7D 28 6F D4 A6 71 2F 70 ")
    (data "AC 15 C5 0F D5 D8 67 2A 89 C6 E3 A9 88 67 AD 2E 9E 04 8E B0 A2 F8 B6 1A FB 9C 89 D0 34 E6 40 0C ")
    (data "D9 93 69 AF 33 99 97 37 11 A7 C3 59 56 14 B7 5D E4 D4 11 53 45 B2 BD 77 5E C6 E9 11 C0 8F 53 8E ")
    (data "7B CC 5A 94 79 79 60 4C E2 DA 4D C5 8A E2 71 56 14 1F 86 6C 4D AD 01 EC 80 78 AF 36 04 16 B3 A2 ")
    (data "78 67 2B 8A C7 E6 74 5D EF 4E BA 41 75 6F 8A 41 35 2F 70 42 4A DB 01 BC 36 63 9D 81 18 8D AD D8 ")
    (data "10 89 51 7B 25 F0 9C EB 02 CF D9 3D F0 9C 32 AB 83 34 66 CA 86 0C 3C 67 05 64 8B AA 8A 41 05 F0 ")
    (data "6D E0 CE 24 23 32 93 C0 73 3C E4 61 52 D6 A0 02 D9 26 FC 47 E0 39 EB 57 E8 A3 25 81 E7 0C 0B 3C ")
    (data "E7 87 88 01 57 A7 41 05 12 23 F8 68 E0 39 07 D5 DC 6F 47 49 16 4D AD 64 4E 9A 99 0C 7C B7 82 41 ")
    (data "B5 0B B2 85 57 97 41 05 B2 08 1B 97 18 35 DD 62 C9 C6 17 81 E7 EC 84 18 77 79 3C 6E 13 F2 0E 12 ")
    (data "9A C6 D2 88 BE DF E5 D4 6B 50 81 2C BC F7 06 C6 87 A6 F1 BD 22 E2 CB 35 31 12 20 34 8D 45 11 43 ")
    (data "BD 8A 41 05 E2 F1 FC 7B 68 1A 66 D5 89 35 13 9A C6 B0 D0 34 0E 47 BC F8 FB 51 AF 41 05 52 16 ED ")
    (data "81 D0 34 7E 11 9A 46 99 50 98 B6 84 A6 B1 70 68 1A 97 01 B7 52 AF 41 05 B0 0A 30 36 34 8D 8B 42 ")
    (data "D3 A8 EB B9 36 9D C4 33 78 07 E2 15 AB CB A0 02 58 0C 79 7E DF 1D 9A C6 72 ED 1A D7 62 54 25 9C ")
    (data "86 78 8A D2 38 30 F0 9C 99 5C B5 56 14 3F 4A BA 6C C2 B6 C0 79 ED 7E BC 56 14 7F 6A 45 F1 78 2B ")
    (data "8A 6F B1 A2 F8 5A 2B 8A 1F B2 A2 B8 AD B7 64 80 E4 4B F9 D3 94 53 93 80 B4 87 DE E1 C8 3E 78 1A ")
    (data "B7 DA AE 9F BA 6D 39 80 ED FA CF 23 06 DC B7 11 35 FA 56 0F 9C 39 91 07 FA 18 E0 85 C0 73 DA 15 ")
    (data "A9 CE C3 74 AF 5E 62 50 DD 8D 48 49 D4 C1 FA C0 98 C0 73 52 6F 22 81 E7 9C 41 4E D1 D6 1C 2C 02 ")
    (data "DC 18 78 4E 5D 73 9F 4E E0 39 F3 21 0F BD 80 F4 1A 94 75 30 3F 70 7E E0 39 A3 03 CF A9 F3 F7 D7 ")
    (data "49 4E A2 D8 D6 E7 89 65 BD 89 81 E7 B8 88 47 23 4B 63 AE 0A 8B 02 D7 04 9E 73 58 DB 96 F5 30 DD ")
    (data "A8 4A 4A 77 5D 49 7A E5 86 34 26 E4 69 94 68 F2 3D 42 7A 5C 68 9D CC 8B 78 B5 7F DF 89 07 62 0B ")
    (data "46 26 F7 EA 6B 91 FB 4C 2D 7D 02 F7 84 A6 B1 41 4D FD 0D 78 D1 FE 88 EC 92 34 57 0D A9 93 61 48 ")
    (data "8C F1 5F 43 D3 C8 92 0D 2A 45 68 1A 2B 03 11 F5 2E 66 D2 B0 90 CC FD E6 9D A6 D2 24 BF 83 7F 02 ")
    (data "9B D5 D5 67 0A 1B 03 0F 86 A6 B1 5E AB 46 B5 DD D4 93 ED BD 56 99 80 69 DE AA 1F 21 C1 A5 CD 1C ")
    (data "00 9C 5E D3 D4 B2 70 91 80 B5 46 A6 00 7B 5A 51 FC 64 E3 C1 C4 DD DF 6A A5 7E 72 9E 01 6D D7 FF ")
    (data "D8 76 FD 31 B6 EB 6F 83 78 E5 3C B2 6B 1D 0E F0 39 E4 A1 56 95 25 60 FA 7B B9 09 09 B2 AE 93 ED ")
    (data "90 1F FB 4C 04 9E F3 7D E0 A8 9A C7 FA 2C 70 75 E0 39 59 B2 16 85 49 0C AA 1B 98 75 4B BA 53 1C ")
    (data "41 7A 2C 5F 5F 91 18 AF 87 16 B8 E4 61 60 74 C9 B1 CE 20 7D A1 53 27 C3 81 B3 BB E4 2D 1C 09 D3 ")
    (data "63 31 C7 90 2D C3 92 C6 84 76 0D 42 D3 F8 0A 12 EE B0 44 99 C9 95 64 0F E0 A6 C4 88 E8 06 CB 00 ")
    (data "67 22 5E 9A 3A 99 0F F1 9A A4 ED 54 14 22 34 8D 85 10 2F DA 37 2B CF 2A 3F 1B 03 7F AB CB 30 09 ")
    (data "4D 63 5D E0 7E 24 99 A1 1B 98 C0 1D 75 CC 3F 34 8D 1D 90 DF C1 22 95 67 D5 9E C5 91 79 67 3A 3A ")
    (data "EA 5E 29 9F 8A 78 7A D2 F8 4E E0 39 AB 35 1E B0 A2 F8 75 24 90 2C 8D A3 42 D3 38 B5 CE C9 0D 10 ")
    (data "9A C6 7E 80 D3 74 78 0A B0 AF 15 C5 69 B5 07 7F 48 F6 CA F9 BA 76 5E AA 34 6C D7 9F 60 BB FE 8F ")
    (data "91 00 C6 ED 91 55 EC FB 19 CD CB 04 48 37 33 F0 E5 BD 84 59 8D C9 BA 38 B9 51 9B 2C F0 9C 35 11 ")
    (data "B7 69 27 58 8D 7A 8C 4D 12 0F DB 35 48 86 48 37 39 2C F0 9C BA 0D CE BA F9 25 F9 B7 31 A6 20 F1 ")
    (data "75 85 82 AB 01 02 CF 71 A8 DF F8 6E C5 6F 03 CF C9 D2 A7 AB 8B 81 2D 88 83 28 BE 95 32 A1 D5 C9 ")
    (data "64 FB EA 7A 8A 07 EF D7 C1 96 C0 1F 93 F8 95 4E B3 3D C5 8C FA 22 7C 06 79 1F A5 3F C3 C4 6B 77 ")
    (data "33 F5 79 D1 8A B0 2A 70 6B 55 CF 61 68 1A 2B 20 EF A1 13 DE E1 56 AC 01 FC 25 34 8D D2 BB 02 89 ")
    (data "D7 28 EF 96 7A 5D 2C 88 2C 2C 46 A5 9D AC D5 A8 4A 82 AB B3 3C 4C C3 49 59 85 5A 51 7C 3D 29 1E ")
    (data "8E 84 1F 85 A6 71 5C 4D D3 23 34 8D CF 84 A6 F1 5B 64 DB B1 71 7B 71 12 12 10 39 4B D9 9D C0 73 ")
    (data "96 04 7E D0 7C 3C 61 1A B3 1A 67 85 B0 5D 7F 9A ED FA B7 DA AE BF 37 72 13 DE 17 89 8F 68 CC 92 ")
    (data "F8 5D 95 31 12 16 0F 3C 67 4F B2 8B 40 D7 C1 08 92 B8 B3 64 75 7E 31 F5 C8 76 64 71 54 E0 39 2B ")
    (data "D5 D0 CF 2F C9 D6 2A EB 34 A7 05 9E F3 C5 1E 8D DD 92 C0 73 B6 04 BE 56 E0 12 DF 76 FD C7 4B 8C ")
    (data "B3 0B 12 08 DA 4D E6 04 2E 4B 3C B7 9D 62 91 C0 73 16 A3 7D BC 65 1A 99 DB A7 89 54 C2 75 CC 48 ")
    (data "09 EF 05 5F A5 A6 45 4D 1B 6A DD E2 4A 61 0D C4 19 50 96 F3 68 AA 08 D2 65 D6 41 3C 79 A5 08 4D ")
    (data "63 01 C4 43 5F DB 56 5C 41 36 42 EE BF 85 09 4D 63 71 64 EE BD F8 1D 2C 0E 5C 99 64 DB CE 44 27 ")
    (data "62 3A CE 40 A2 E5 D3 F8 46 B3 B7 0A C0 8A E2 D3 91 88 FD 29 29 D7 FC 3C 34 8D 76 59 73 6D 49 B2 ")
    (data "19 1E 07 FE AF E9 D4 CB C0 66 56 14 8F CD B8 F4 44 B2 FF D1 2E B5 5D BF 94 96 45 1A B6 EB 4F B2 ")
    (data "5D FF 32 DB F5 B7 43 E2 B7 F6 06 B6 AC 29 15 7E 21 D2 BD 46 2F 23 37 FD 2D 93 31 17 49 FE BB 0B ")
    (data "12 23 50 34 D8 78 FF 44 83 EA BB 40 9A 8B 74 0A 62 24 EE 88 04 D5 0E 8C 37 90 15 55 24 E5 76 0E ")
    (data "A0 92 D1 9D 18 0E 59 46 73 16 7F 45 BE 47 6B 22 3F AE C5 81 D5 91 EC AB 6B 28 F6 99 CD 45 C9 ED ")
    (data "B2 4E 92 C4 7B 15 B9 D9 8D 07 FC 12 E3 2C 83 A4 2D 17 E1 61 A4 AA C1 6A C8 F7 67 31 44 AB E8 87 ")
    (data "A4 97 C1 CA 62 29 3A E7 49 1D C0 41 E6 57 94 09 2D CE 9D 45 B6 56 5E 37 39 B1 5D 7C C9 20 E1 F0 ")
    (data "D0 34 0A 2F 6C 42 D3 F8 16 B2 08 EE 35 87 84 A6 51 76 7B 74 34 F5 C5 D6 96 E5 7B A1 69 6C 5A E4 ")
    (data "82 24 E6 FA 62 BA BB F5 DD CC 97 91 7B CE 4C D4 EE 45 B0 5D FF DD C0 73 4E 45 74 85 D2 F8 31 12 ")
    (data "AC 3D 13 56 14 5F 94 94 9A B9 8A 59 57 27 BF 0A 4D E3 F9 A4 26 60 21 92 0F FF 34 52 DE 3C 10 03 ")
    (data "DB 64 A5 0A 27 C1 F5 59 B1 17 1F D2 C1 95 5A 12 A3 76 65 CD DD 36 66 44 7C 82 78 07 FC 14 61 CD ")
    (data "77 80 97 80 6B 03 CF F9 0D A2 B3 94 77 C5 38 0F 12 13 97 66 A8 8C 03 BE 9D A2 E5 35 30 DE F5 81 ")
    (data "E7 9C 85 68 0B 2D D9 7C 71 06 FB 04 9E 73 AC ED FA 6F E5 6C 3F 9D C4 70 28 F2 50 FD 1F B0 AF ED ")
    (data "FA 69 06 F8 EB 88 E0 DD EF 03 CF 59 07 51 D6 CF 7B B3 DA 3C F0 9C AD 6C D7 6F 55 96 A9 DB EC 8D ")
    (data "C4 3D E4 61 1A B2 ED 57 46 A0 F5 5C F2 C7 42 4C 46 04 82 2F 49 C9 2C 7C 0B 78 24 F0 9C 33 91 DF ")
    (data "FA 29 E4 5B 34 EE 1F 78 CE 68 DB F5 1F CB 3B E1 82 94 09 8A FF 18 D1 66 9B 85 64 DB EF 3B 95 66 ")
    (data "54 1F C3 90 B8 C0 5E 7A 6A EA 60 0E E4 19 B1 7D DE 0B 92 2D C3 B3 3A 36 A3 E2 FC 8A 82 7A 4C 89 ")
    (data "A3 C1 EA CC 74 0A 31 0C 38 2B 34 0D B3 80 E0 EC 3E C8 C2 BC D7 9C 10 9A C6 25 8D 02 A7 9D CA 3E ")
    (data "3A 1B 78 35 E3 DC EE 49 26 CC 2C 24 E2 66 5F 42 D2 A9 1B 19 8E 64 9D CC E2 E5 CA C1 CF 49 37 A8 ")
    (data "5E 02 B6 6C A3 BD 72 32 D9 D9 3A BF B5 5D 3F AB 36 60 BF 33 19 F8 BA ED FA 27 B7 7B 10 DA AE 7F ")
    (data "0F E2 C5 CA 2D 7E 86 78 2C 9A EB 3E FE 03 D8 2C 4B 1C B5 61 BC 07 92 F1 26 E6 1C 6B 2E 24 78 B6 ")
    (data "0C 3B 23 32 0D 79 F8 1F B0 49 86 41 35 13 49 4D CC 4D 91 D4 EA BC 54 F6 C6 D6 45 22 1F 52 C4 EB ")
    (data "34 DA 76 FD C2 DA 39 49 95 81 1D 72 36 9F 0C 6C 6D BB FE EF 5A 49 35 D8 AE FF 89 ED FA 3F 27 BF ")
    (data "54 C8 30 44 DB A9 53 A4 C5 BB 3C 84 C4 09 AD 8E 2C 56 16 01 46 21 9E CF 8D 81 6D 5B BC C7 DA C2 ")
    (data "21 6A 62 C3 D0 34 3A 9D 79 D8 0D B6 6B 15 7C 9C C2 C1 D4 9B B6 5F 95 F5 42 D3 D8 3C 6F E3 44 B6 ")
    (data "A8 9F 3C E4 6B 93 33 34 25 34 8D 05 11 23 B8 1F 98 9F A6 24 BC 52 9E AA 44 3B E9 2B 48 46 C6 52 ")
    (data "88 10 DE 63 C0 5F 6C D7 7F C7 76 FD C9 81 E7 9C 86 58 CF CD 0C 43 14 92 BF 97 D6 B7 15 C5 13 12 ")
    (data "57 E0 0D CC 9C F1 31 2F 70 49 68 1A 1B E4 55 65 0D 4D E3 0B A4 C7 6B 7D 02 7C BD 55 E9 82 44 76 ")
    (data "20 2B B5 74 22 C5 84 10 FB 8D 03 6C D7 BF 29 6F 63 DB F5 1F 4F B4 9B B2 84 4F 9B 69 D6 50 79 13 ")
    (data "D8 D5 76 FD 5C 86 92 ED FA 4F 05 9E 73 24 F9 63 C9 BE 51 60 6E 8D 14 D1 E8 DA A3 88 68 A7 ED FA ")
    (data "AF 07 9E F3 0D E4 77 91 27 8D 7E C7 C0 73 16 CA FB 19 75 98 A3 C9 96 0F 69 E6 39 4A C8 65 24 5E ")
    (data "C2 22 71 54 07 DA AE 7F 7F DE C6 B6 EB 5F 1A 78 CE 7A C0 F7 73 34 DF 39 F0 9C E5 6C D7 2F 2D 6E ")
    (data "99 93 49 C0 21 B6 EB A7 79 A0 33 05 8F 07 48 4A 6A E5 AD 28 D1 4D FE 0F 91 89 19 EC 1C 8D 78 68 ")
    (data "F3 D0 2D 59 8E 22 1C 8A 48 E5 E4 61 5F 44 37 AA 9F 38 0C 91 CE 68 C7 11 E4 DF C9 E8 06 FB 85 A6 ")
    (data "E1 26 89 77 C5 3C 55 81 E7 CC 97 E8 C8 BC 08 DC 88 C8 0C EC 87 6C F5 5C 8C 88 EB 0D 88 3B 9E 47 ")
    (data "B6 B7 6A 20 EE 26 15 2B 8A 27 22 01 B2 CD 2B FD F5 80 5D 0B 4C 79 6B D2 33 97 7E 69 45 71 BB B2 ")
    (data "15 27 92 AD 38 7F 7A 5E C5 F3 3E E4 42 DB F5 C7 94 B8 EE 02 E0 A9 92 63 1E 66 BB 7E 3B E9 88 66 ")
    (data "2E 23 7F 7C CC 26 45 45 52 93 5A 7E DB E4 6C 7E AD ED FA 85 4B 44 24 5E B9 73 73 36 9F 13 91 A5 ")
    (data "E8 29 49 19 A1 22 DE 90 EF E6 51 D3 4F 61 57 D2 85 77 D3 B8 DA 76 FD CC 42 E5 2D 38 81 74 C9 96 ")
    (data "66 86 21 9E 87 4E 32 09 F1 B4 55 D9 D2 FF 0A F9 75 AE D2 78 09 59 64 AE 81 78 C7 96 42 BE 73 57 ")
    (data "54 E8 13 60 C7 24 E0 B9 1B 3C 0F D8 C8 D6 F4 A2 C9 DF 86 C8 02 BE 74 9D C4 84 DD 92 24 80 96 24 ")
    (data "F1 57 55 12 64 9E 46 9E 9B CB 22 FF 0E 2B 22 31 A8 4F 57 E8 13 E4 DF A1 6D 26 5D 52 49 C4 AE 38 ")
    (data "D6 A3 C8 9C 57 41 DE C3 48 24 79 A1 8A 5A FA 36 89 90 6D 26 C9 B6 6B 55 AF FE A5 48 BD CD CF 22 ")
    (data "31 59 1B 20 DA 84 1F 95 EC 6F 04 0D DB A8 B9 3D 55 81 E7 6C 83 3C 58 5B D5 30 1A 89 88 6F 5D 9F ")
    (data "78 AB 7E 4D FA 6A 74 7E 24 2E 20 73 4F DA 8A E2 89 A1 69 1C 82 14 C4 6C E4 40 24 E6 26 0F 69 B5 ")
    (data "A1 3E A4 8D 06 56 E0 39 06 D9 5E AA 37 49 F7 C0 0D 06 26 51 72 FB C0 76 FD A9 81 E7 5C 48 76 AC ")
    (data "5C 16 F7 01 7F 2A 31 DE B4 C0 73 42 F2 79 04 E7 41 7E 18 45 0C 9F 35 C9 9F 86 5B C5 4D 7E 36 F9 ")
    (data "BC 25 20 99 30 7F AC 30 56 1D FC 84 FC 7A 4A 17 D9 AE 7F 47 C9 71 F2 7E 26 53 C8 CE 0E 6E 89 ED ")
    (data "FA EF 25 31 56 79 3C 62 BB 53 4C 35 BE 28 DF 2D B3 45 DA 44 AB 5A 81 ED 18 0B EC D1 54 02 EC 1D ")
    (data "24 76 6B 6C 68 1A 7F 42 EE AB 65 64 12 46 20 BB 0A B7 54 98 5F 1E CE 03 8E 4A 29 30 FC 10 F0 50 ")
    (data "68 1A 17 22 EF B3 6C 10 FF 08 C4 EB 7D 51 9B 76 B9 B7 D9 52 78 04 D8 2A 71 1C 0C F0 0E F0 4C 68 ")
    (data "1A 57 20 7A 66 65 33 B4 3F 83 DC 07 EF 69 D3 6E 1B AA 19 85 1E 70 72 D3 8E D1 3B 88 B3 E5 A6 D0 ")
    (data "34 4E A1 75 F5 91 2C 86 21 71 52 17 B4 68 F3 2D 24 31 A8 0C 53 80 DD AD 28 FE 4B D3 F1 D7 80 87 ")
    (data "93 D2 79 B7 23 92 09 45 D9 87 64 4B B2 AD A7 2A F0 9C 11 49 F0 F0 58 F2 15 85 6C F4 E0 9C 87 C4 ")
    (data "42 A4 D1 76 EB C5 8A E2 7B 10 95 D4 46 B6 6C 55 C6 A6 89 34 7D A7 BF 5A 51 DC CE CB 74 04 D9 37 ")
    (data "97 5F DA AE 5F 24 BE A8 9F 38 CF 76 FD AC CC CC 3C 14 2A 9E 9C 70 5A D9 72 25 C8 16 70 5E 8A 96 ")
    (data "9D C8 5B 8C 75 32 62 18 96 C2 76 FD A7 80 BC DB 86 75 28 E7 97 26 C9 CC FD 6E CE E6 2F 53 D2 D8 ")
    (data "09 3C 67 14 F9 1F 4C BF AF B8 2D 77 11 F9 32 4A 97 0F 3C 67 AD 0A E3 B4 E2 86 92 DE E1 66 CA 3E ")
    (data "08 FF 03 EC DA AA A6 6A 92 04 54 25 13 B2 36 75 F2 0C 7E 6D 45 F1 A1 29 06 D5 74 AC 28 7E 02 91 ")
    (data "46 A9 E2 B1 CA 23 21 52 E5 7B 72 68 93 41 35 1D 2B 8A 3F 44 1E CE 55 EA 12 E6 F9 77 A8 92 B1 78 ")
    (data "A1 15 C5 3F 6E 13 82 E3 22 19 D2 65 68 27 6D 53 45 ED FD 47 29 06 D5 74 AC 28 7E 18 38 A6 64 DF ")
    (data "6B 84 A6 B1 22 B4 31 AA 12 FD 9C 47 C8 5E 55 7E 8A B8 94 3F 49 5E 5F 9A 04 1A 03 90 3C C0 B3 DC ")
    (data "F6 6B 27 E2 90 ED 68 5E 09 8F 00 F2 16 1A 4D 93 68 68 69 C5 27 2A DD FB 67 9C 7E 13 29 43 30 58 ")
    (data "B9 B7 CA C5 49 E9 91 22 C1 F9 2F 20 DB C4 65 19 4F BE C2 B5 90 3F E0 7C 80 BC A5 24 9E 29 99 D5 ")
    (data "D6 48 BB AD E6 01 46 55 1C A7 2A 01 F9 3D 15 87 DB AE DF 36 0E 28 83 22 F5 DB CA C4 CA 4D C7 76 ")
    (data "FD FF 91 FF 7B DF A9 12 17 95 B4 EC 1A 28 AB A9 75 5A CE 12 5E BF 20 FD 9E 99 87 DC C5 9F 4B F0 ")
    (data "18 39 1F 76 89 61 55 45 77 6A EB 1C 8B F6 E6 24 9C BC 3C 65 45 F1 3F 5A 35 B0 A2 F8 3D 2A E8 4E ")
    (data "21 5B BB 99 24 DB 83 5F 2F D9 F7 7B 48 15 94 96 24 19 7C 65 33 E3 33 25 3A 92 B2 3C 5B 95 EC 77 ")
    (data "02 F9 2A 58 FC 0E 59 30 96 61 2B 68 61 54 05 9E 73 00 A2 07 93 96 71 F7 22 70 08 B0 90 ED FA 5F ")
    (data "40 B6 0B 96 B0 5D 7F BF 94 B6 AD 5C A9 79 4A 82 34 67 02 42 7E 6D 8A B4 07 72 BB 7D EB EF 90 AD ")
    (data "60 3E 7A 10 7B A9 EA 22 AF 81 00 70 8D ED FA 45 74 A7 66 22 F1 70 8D CB D9 BC 68 21 D9 67 91 A0 ")
    (data "C8 81 BF BB 90 ED C3 E6 BF B2 DB 5B 8D E4 8D 45 AB BB 74 50 6E 02 CF D9 0A 89 89 C8 C3 9F 6C D7 ")
    (data "CF 5C F1 E5 20 6F EA FA 73 65 AA 15 A4 70 57 CE 76 9D 30 AA EE B1 5D 3F ED 1E 56 86 B2 22 87 B9 ")
    (data "02 FC 93 40 DB B2 9F 77 27 03 87 7F 69 45 71 11 63 EF 37 88 2C 45 19 16 A0 BD 27 AA 6C 31 E3 E6 ")
    (data "5D 97 2C 0A 87 4B 34 B0 4C 9B F3 1B 51 BE 36 E1 55 56 14 E7 92 AE B1 A2 F8 3E 44 62 A6 28 A3 42 ")
    (data "D3 C8 7A FE 6E 4D 79 C5 82 73 AD 28 FE A4 5D A3 E4 7B 36 8B 08 78 4E B6 80 8C 98 AA 44 65 F8 3C ")
    (data "D2 83 22 43 E0 C8 46 E3 C2 76 FD 8F 90 7D 6A E0 E1 D7 00 00 1C C6 49 44 41 54 C9 59 B0 5D FF FE ")
    (data "C0 73 9E 21 7D 25 B3 1B ED D3 99 AB 64 43 A5 B9 51 DB 79 3E 0E CF 38 FE 31 F2 99 CC EE 14 29 94 ")
    (data "5B 64 FB 2E 8B BC 9E B1 51 45 3A B5 5D FF 6F CC 1A AF D7 29 F2 7A DB 86 F7 22 03 B0 A0 5E D7 5B ")
    (data "64 64 EE E6 1C 6B 1E 44 36 20 0F D7 97 1D A7 89 BC 2A EF 9D D8 FE AB F2 80 6C A6 1B 0B BA 71 88 ")
    (data "1C 48 51 3A 59 64 B9 D0 FB B6 A2 F8 CD D0 34 AE A5 98 47 B4 91 F5 69 BD 78 FC 2F 12 30 5F 94 27 ")
    (data "DB 37 01 2B 8A E3 D0 34 DE A5 5C 79 B2 76 F1 64 65 3D 3D 50 3C A1 E1 66 D2 9D 32 ED 18 89 EC 52 ")
    (data "34 53 45 BA A3 48 A2 CB 5F 91 4C D0 A2 AC 0B D9 81 EA F3 32 AB 41 F5 31 92 C5 D5 2E 88 2F 8D 3F ")
    (data "93 EE 36 5C 2B F0 9C A5 6C D7 6F E5 6E 4B DB 1F CF EB FD 78 29 67 3B 00 02 CF 59 1B D1 8E 49 E3 ")
    (data "8F B6 EB A7 1A 8E B3 19 45 6E 26 75 A4 A8 E7 35 AA 7A E6 E5 C9 41 91 6D B2 4E 96 F5 C9 62 3F F2 ")
    (data "1B 14 47 55 FC 1D AC 4E FE 95 FE 03 ED 9B E4 22 AF 51 B5 42 E0 39 73 D7 B0 DD DB C8 7B 35 F6 55 ")
    (data "E8 7E D6 C0 97 C8 AF 99 56 36 AB B9 1B 75 00 8B 70 35 E5 8D AA 96 75 1A AD 28 EE 86 F8 EA 04 CA ")
    (data "19 F9 ED 7E 5B 65 E3 36 A7 50 3C B6 B4 C8 AE 46 23 4B 93 6E 54 95 55 EF FF 8F 15 C5 45 C2 56 0A ")
    (data "97 DA 4A 58 3E 34 8D 11 A9 37 70 DB F5 5F 09 3C 67 2C 33 82 C6 9E 07 BE 65 BB FE DF 4B 0E 76 35 ")
    (data "D9 7B B1 DB 20 45 7E B3 58 28 E5 58 9E 34 69 90 15 45 33 AD 5C E8 B3 28 BD 37 70 76 CE 31 87 3A ")
    (data "45 8C AA 32 59 14 CD 64 6A 89 35 31 2C F0 9C 85 2B C4 F9 F4 0B 0B 92 5D E6 A9 76 02 CF 99 0F 51 ")
    (data "1F CF C3 2D B6 EB 5F 5A 71 C8 22 E5 40 CA DE 94 9B 49 55 27 4F 61 0E 24 19 A7 48 A9 9B 6E 52 44 ")
    (data "4C B6 91 63 42 D3 F8 83 15 C5 6D 8D 45 2B 8A 4F 46 44 8F 07 3B 55 BC D0 9D 2A 38 5F 84 B2 C6 78 ")
    (data "3B EF 56 59 6F EC 3F 93 40 FA 22 94 95 88 98 65 7B 32 89 73 2B E3 F5 82 9C DB DF 0D BC 88 38 91 ")
    (data "8A 16 7A 1E 0E AC D0 6A 7F 72 37 44 89 FC 18 60 AD 0A 06 15 88 9A 76 D6 5E 6C 3B 57 73 5A FA 64 ")
    (data "DE 40 B2 34 E3 AB 55 BA 78 56 2A EB B3 35 C5 76 0C 05 DE 2D D0 B6 0E ED 9A F7 0B B4 ED 76 95 F5 ")
    (data "A1 C0 31 E4 F3 F2 4D 42 E2 28 AB 92 37 83 ED 5D F2 67 4D B6 A4 A0 A1 DD CB 5A 62 ED 28 9B 68 B2 ")
    (data "16 30 A6 8B 5A 52 3D 27 29 1B 52 66 8B 0E 3A 1B 74 9F 97 B6 F1 3F 19 64 3E D3 13 8D A7 B2 72 13 ")
    (data "65 BC 37 65 17 87 69 8E 94 E5 29 AF D1 56 28 B6 2B C9 6C 2C 6B D4 2E 9D B9 D5 60 BB FE FB 94 AC ")
    (data "1E 9D D2 D7 B4 C0 73 EE 44 34 40 9A D9 A8 CD E5 CD 37 E1 B7 B2 52 52 53 48 33 E4 52 1F 20 49 9D ")
    (data "BF 2C 31 C2 3A E3 22 06 3B 45 84 1E EB 88 B3 28 12 4F 51 26 06 61 B6 25 F0 9C CF 93 23 9B 27 E1 ")
    (data "B8 9A CA 32 E5 BD A9 BF 58 41 8A 23 8D F7 C9 17 A0 DB CF DB C8 F7 22 71 A2 65 0C BF 5D 80 7F 86 ")
    (data "A6 71 84 15 C5 37 D7 3B AD BE E5 19 F2 C9 00 35 D3 4F E5 67 EA A4 6C D6 22 14 CB FA 1E 60 22 E5 ")
    (data "0C DB B4 E7 7B 95 B9 97 59 9C 4D A2 5C 21 F4 C5 BB 19 BF 71 3F E9 46 D5 2A 81 E7 2C D0 22 AB AE ")
    (data "D9 15 9B 2B D8 0F C0 8A E2 4F 42 D3 78 8F 99 B7 A1 B2 6E EA AD 74 73 AA 64 3A 0D 35 8A C4 9B D4 ")
    (data "B1 32 2E 9B E2 AD B4 C7 23 9F A1 71 2F 15 A5 0D 1A C8 9B 25 56 36 AD 39 8B BC 2B FF B2 19 76 1D ")
    (data "C7 8A E2 A9 A1 69 9C 47 53 AD B1 02 AC 80 88 33 DE 06 FC D8 8A E2 A1 EE 7D 9F 50 F2 BA 39 43 D3 ")
    (data "58 B8 95 AE D7 20 A5 AC 68 26 94 88 E7 B3 A2 F8 6D EA 93 89 A9 62 E8 76 33 16 7A B1 4E 15 54 4E ")
    (data "23 4B 4D 78 18 AD CB 55 AC DC F4 BA E8 3E 6D 73 50 7B 96 C5 9B B5 0D F9 3F B2 E7 3E 3B 52 67 E0 ")
    (data "6D 1E 8A 6C FF 55 29 E1 31 5B 91 68 C4 E5 A9 50 FF 11 70 50 15 69 8C 26 F2 7A 2F F3 C6 4D D6 4D ")
    (data "5E 95 FD 5E 31 9A F2 C1 E4 03 6C 03 3C 10 9A C6 6D A1 69 6C 17 9A 46 56 39 AE C1 4E 15 C3 3C B3 ")
    (data "8C DA 20 A6 8C E7 65 80 5E D7 24 FD 6C 85 6B 73 C9 40 D4 C4 9C DD F4 54 B5 D2 6A 59 1D 98 25 66 ")
    (data "2B 34 8D 79 98 55 77 A3 A8 51 F5 21 33 EF D1 66 E9 78 64 29 72 DF 53 F3 36 C4 60 67 6A AF 27 D0 ")
    (data "82 B2 FA 2B 2D 09 3C 67 0E E4 FB B1 31 22 AE B7 32 E2 71 59 82 7A BC 71 DD E0 E2 C0 73 2E 2E 71 ")
    (data "DD 4F 6C D7 CF ED 1D CE 41 DE E4 85 3D 03 CF D9 B3 C6 71 F3 52 56 83 A8 2B 58 51 FC 56 68 1A DF ")
    (data "A3 BC 96 4E 23 5B 27 7F 8F 27 1E B0 2B 12 EF C2 50 A1 8A 04 45 5A 5C 4F 61 42 D3 F8 3C B2 0B B2 ")
    (data "16 E2 3C 18 89 6C 31 2F 4A 67 65 28 D2 A8 E2 44 E9 F5 8E 41 15 5B 65 7C 68 16 95 31 2C CD 02 5D ")
    (data "33 AA 6C D7 7F 37 F0 9C 17 81 2F A4 9C CE 2A 19 B2 12 B3 7E 11 8A 1A 55 CD 5F 86 59 3C 55 81 E7 ")
    (data "CC 49 B6 B7 4C BD 54 B3 21 81 E7 0C 43 34 5D F6 41 E2 51 6A B9 C9 0E 32 1E A5 78 AD 47 A5 C3 58 ")
    (data "51 3C 26 34 8D 0D 80 A3 6A EA 72 0D 44 6D FA F4 D0 34 FE 02 5C 0C 8C 6D 53 8A 64 30 50 A7 34 46 ")
    (data "6E 42 D3 58 0E B9 6F 7C 0B A9 31 DA 2F 54 B9 87 F5 DA 53 35 58 16 AF 5D D7 C4 79 8E 74 A3 2A 2B ")
    (data "98 30 2D B5 35 B7 51 95 B8 B5 9B 5D 9E 69 FB CA 4B 93 9D 3E 99 57 D1 5B 19 22 04 9E B3 2B 52 66 ")
    (data "A1 48 FA FF 50 E4 40 DB F5 CB 66 21 29 9D E5 18 64 BB BB B4 10 6B 0A 73 23 85 A5 77 07 FE 13 9A ")
    (data "C6 99 40 58 22 95 BE 5F A8 12 13 55 38 B6 2E A9 FD E6 01 DF A4 FF 74 BB AA A2 BB 35 39 E9 B6 51 ")
    (data "95 95 41 90 15 BC DA EC 55 9A 4A 31 0D 99 2F 31 6B 8C C4 DC A1 69 CC DD A4 D9 92 66 E8 0D 50 87 ")
    (data "80 A5 32 08 08 3C 67 69 A4 AC D2 76 BD 9E 4B 9F B0 2E 10 F5 7A 12 CA AC 24 F5 D5 BE 1F 9A C6 73 ")
    (data "14 AB D9 98 97 15 11 6D BE E3 42 D3 F0 10 E3 AA 9F B7 FE EB 26 B7 46 51 68 1A 73 20 45 84 8F 2F ")
    (data "72 9D 32 34 E9 66 A0 3A 64 57 DF CE D2 17 6A F6 12 5D 90 77 D5 94 68 72 9C 95 71 BA 79 15 F2 B9 ")
    (data "16 5D E5 15 9F 54 06 31 81 E7 6C 8E D4 E6 52 83 6A 06 3F 0F 3C A7 4A 80 A8 D2 61 AC 28 3E 03 A9 ")
    (data "39 36 A1 43 43 8C 04 CE 47 E4 18 36 EC D0 18 83 96 D0 34 16 02 C6 22 9E 6D 35 A8 94 AE 1B 55 59 ")
    (data "62 60 A9 59 09 56 14 DF 89 C4 B5 B8 88 18 69 56 5D BE 99 08 4D 63 11 E0 56 60 83 9C F3 CA 0C 18 ")
    (data "B4 5D 7F B0 BA BE 95 9C 04 9E B3 3D 52 A7 AA 95 71 3D 3B B2 18 70 6A AF 27 A1 B4 C6 8A E2 7B 91 ")
    (data "D8 9D D3 29 2F 1A D9 8E 35 81 FB 42 D3 38 35 34 8D 5E 94 52 EA 3B 1A 0C AA AF F4 7A 2E 4A FF D0 ")
    (data "6D A3 2A 4B 38 32 D3 75 6D 45 F1 1D 56 14 9F 62 45 F1 35 79 02 27 43 D3 58 0F D9 B2 C8 92 48 98 ")
    (data "C2 AC B2 00 DD FE 1C 94 3E 21 F0 9C 75 90 DA 94 FD 9E 4A DF 2B 0E 0C 3C E7 CB BD 9E 84 D2 1A 2B ")
    (data "8A 27 59 51 7C 2C 62 FC 8C A1 33 31 30 C3 11 B1 D8 3B 42 D3 98 AD AB 17 24 5B 7E 63 90 E2 CB 8A ")
    (data "32 9D 6E 1B 13 59 46 51 65 25 EC D0 34 E6 0D 4D E3 64 A4 08 EB A8 16 4D FF 93 12 1B 90 A9 85 14 ")
    (data "78 8E 3E 6C 87 28 81 E7 2C 80 18 54 7D 2B F8 D8 27 9C 9B 64 C8 2A 7D 8E 15 C5 4F 5A 51 FC 6D 24 ")
    (data "A3 AF 53 C6 D5 A6 C0 BD A1 69 CC CE 9E DD A3 D1 50 01 25 85 6E DF 28 B3 8C B8 D2 A9 BB A1 69 AC ")
    (data "80 A4 AE 1E 4E BE 12 18 77 A5 1C 6B 25 0E B6 14 10 17 9F 99 32 08 38 09 58 AE C4 75 11 F2 C0 BA ")
    (data "1F 29 81 D0 6E 8B 78 2F 7A 5F 90 FB 70 E0 CA 86 D7 9F 41 62 C8 F2 78 1C D6 02 BE 0F FC AA 03 F3 ")
    (data "CA E2 F7 C0 61 5D 1C 6F 80 C9 3D 18 B3 76 AC 28 7E 02 F8 76 68 1A C7 03 07 03 07 52 EF F6 F6 AA ")
    (data "C0 6D A1 69 7C D9 8A E2 21 F1 99 E5 25 34 8D 2F 00 3F E9 F5 3C 94 FE A4 5F 56 9F 99 45 7A 43 D3 ")
    (data "98 1B D1 AB 5A 11 29 B3 B0 34 92 AD B7 1C 60 50 5C 7B E3 92 94 63 AD EA 13 AD 8A 1A 55 43 8E C0 ")
    (data "73 96 A4 78 3A FA F3 C0 A1 B6 EB DF 52 70 AC 22 F5 12 3B C5 07 4D 85 85 DF 09 3C C7 25 BF B1 F7 ")
    (data "93 C0 73 C6 D8 AE 5F 77 F9 98 2C 3E 2E 58 08 59 49 C1 8A E2 E7 80 E3 43 D3 38 09 49 F5 FF 01 92 ")
    (data "15 5D 07 5F 44 0C ED 43 6B EA AF 6E AA 08 B9 B6 AA E4 70 2C 83 33 5C 20 F3 39 9B 83 85 6B 9B C5 ")
    (data "10 A7 DB 46 55 96 80 D7 74 4F 55 A2 A2 BE 03 B0 33 B0 09 62 38 D5 B5 4D 79 B3 15 C5 0F A7 1C FF ")
    (data "2F B2 42 4D FB A1 6C 0C DC 50 D3 F8 4A FF F0 7F 14 53 34 7E 18 D8 C1 76 FD 6E 96 3C E8 34 E7 23 ")
    (data "9F C3 1A 39 DA 2E 88 3C 40 F7 A8 38 A6 EA 5E F5 80 44 42 E6 4A E0 CA D0 34 36 47 D2 FF EB D8 BE ")
    (data "3A 38 34 8D 8B AC 28 9E A5 22 46 1F 50 C5 F0 49 55 10 0F 4D 63 04 70 40 85 7E 41 6A 69 9E 8F 84 ")
    (data "AA 64 95 1C BA 01 79 F6 D4 49 15 31 D7 5E EB 6E 55 49 18 5B 0D 78 A5 AE 89 B4 E1 C3 6E 1B 55 59 ")
    (data "05 1D DF 00 08 4D 63 5F E0 E7 74 A6 52 FC 33 64 D4 3A B3 5D FF D3 C0 73 22 D2 BF C4 3B 22 37 20 ")
    (data "65 68 B1 77 81 B6 CF 31 F4 0C 2A 6C D7 FF 24 F0 9C 23 81 BF E6 BC 64 F7 C0 73 2E B4 5D FF B6 0A ")
    (data "C3 E6 2D 1D 32 54 EB D1 F5 1C 2B 8A EF 06 EE 4E 24 12 4E 03 36 AB D0 DD 30 64 1B FD 6B 75 CC AD ")
    (data "66 AA C4 EA 7E 94 71 7C 87 8A FD 1E 6D 45 71 DB 6D F4 D0 34 3A B1 F8 A8 52 82 A8 D7 9E AA 2A 46 ")
    (data "D5 B0 6E 16 C7 EE 76 A0 7A A6 51 15 9A C6 D9 C8 D6 5C 9D 06 D5 24 E0 41 C0 01 D6 B3 A2 F8 D5 16 ")
    (data "6D B3 1E 14 6B 05 9E B3 6E 8D 73 52 7A 4C E0 39 2B 90 5D 1A 29 8D 03 86 9A 41 35 80 ED FA 77 00 ")
    (data "7F 29 70 C9 D9 81 E7 54 D9 56 C9 7B 63 CF BA 57 28 35 61 45 F1 83 56 14 6F 0E EC 49 B6 DC 4D 1E ")
    (data "BE 1A 9A 46 56 4D D5 5E 52 45 63 2D EB 21 BC 65 85 3E C7 E4 31 A8 3A 48 96 4E 64 1E 3E 5F DB 2C ")
    (data "CA 51 C5 20 EC 6A A6 6A 5F C4 54 CD F7 C4 BF E6 27 7F 50 EA 34 E0 6F C0 23 48 15 F2 0F 98 61 C5 ")
    (data "4E 41 7E 0C 6F 01 CF 5A 51 5C E4 4B 74 0B 70 72 C6 B9 03 93 F1 94 A1 C1 46 05 DA DE 68 BB FE DD ")
    (data "1D 9B 49 7F 70 0C B2 02 CF 63 2C AD 08 D8 48 39 8E 32 BC 98 B3 5D 27 BC D5 4A 0A 56 14 FF 21 34 ")
    (data "8D 7B 90 7B 60 9E AD E0 34 BE 8E D4 0F EC 27 8A 2C 9C 9A C9 DA 96 AB 22 80 7A 62 85 6B EB E0 A5 ")
    (data "0A D7 16 36 9A 93 78 E8 BD 4A 8C 75 87 15 C5 CD D5 57 AA 88 70 7F 11 D9 72 ED 0A DD 36 AA 6E A2 ")
    (data "39 26 63 DA 34 E6 7D E6 A9 B5 72 5C FB 06 70 1E 70 7E CA 07 5E 19 DB F5 1F 0A 3C 67 3C B0 7A CA ")
    (data "E9 7E 2A 8A A9 54 67 A5 02 6D 7F D7 A9 49 F4 0B B6 EB 3F 1B 78 CE AF 80 E3 72 5E E2 04 9E 73 85 ")
    (data "ED FA CF 96 18 AE 55 52 48 23 2B 06 9E 33 DC 76 FD C1 5E D4 B7 16 42 D3 08 29 BE B3 F0 17 2B 8A ")
    (data "73 79 21 AD 28 7E 29 34 8D 6D 81 C7 29 B7 B2 DF 84 FE 33 AA D2 6A C7 E6 E1 0D 2B 8A 53 63 AA 90 ")
    (data "18 DF 32 3C 6A 45 F1 33 25 AF AD 05 2B 8A DF 0B 4D E3 35 CA 79 81 57 29 71 CD E2 48 71 EE A2 1C ")
    (data "C0 AC F7 DD BC F7 8D 34 EA 4A CC C8 45 B7 8D AA CB 90 B8 A5 83 93 D7 9F CE FB 5C 7C CD B0 A9 53 ")
    (data "77 6B 73 DD 14 C4 E2 7D 02 98 2B 34 0D 03 09 9C 9D 07 09 7E 5F 10 D1 63 99 88 B8 B1 DF 04 5E 2D ")
    (data "51 65 FD 3C D2 4B DB 94 79 78 28 FD 4B 73 4D C9 2C A6 01 77 74 72 22 7D C4 CF 80 FD C8 AE C3 D9 ")
    (data "C8 08 E4 01 FA D5 12 E3 3C 96 B3 DD BC C8 02 E7 5F 25 C6 18 8A 94 09 8E 9E 48 81 AD 5D 2B 8A 5F ")
    (data "09 4D 63 34 E5 E4 02 56 2D 71 4D C7 08 4D E3 F3 14 5B 3C 35 92 6A FC 84 A6 31 1F E5 B7 92 FA A5 ")
    (data "86 E6 63 C0 36 25 AE 5B 2F 34 8D 39 AD 28 2E 12 EB 55 36 F6 2C 2D 5B FA 39 24 9C 27 2B D9 AD 15 ")
    (data "DB 87 A6 31 47 B7 6A 57 76 35 A6 CA 76 FD 4F 6D D7 3F 04 B1 F6 77 02 96 9B 7F 5C 74 53 8E 4B E7 ")
    (data "42 CA 01 BC 88 7C B8 CF 20 1A 3B 0F 02 B7 03 D7 20 37 8F 3B 91 7A 81 2F 01 93 43 D3 18 1F 9A C6 ")
    (data "1F 42 D3 38 34 31 C4 DA 71 11 30 BE E9 D8 BB 48 30 A7 32 74 C8 2B C3 F1 E2 50 8D A5 6A C6 76 FD ")
    (data "49 14 4B C8 D8 31 F0 9C 76 8B A1 34 1E 2D D0 56 CB 7F CC A0 8C 88 67 19 0D B6 3B 4B 5C 03 AD 8B ")
    (data "D2 F7 82 2A DF 9D A7 32 8E 17 C9 16 6E 26 6B 3B B1 DB 14 F9 FD 35 32 1F C5 3D 3E 65 BC 5B 30 6B ")
    (data "C5 13 12 07 49 D9 0C D3 25 90 ED E9 AE D0 93 F2 2C B6 EB 3F 6B BB FE 0D B6 EB 3F 8F A4 8E 56 09 ")
    (data "92 CC 62 6E 24 95 72 0F E0 1C E0 99 D0 34 EE 0A 4D 23 33 9E C6 76 FD 0F 10 B5 60 1F 31 D6 2E 00 ")
    (data "36 B0 5D FF 89 0E CC 4F E9 7F 5E EB F5 04 BA CC A5 88 74 44 5E CE 0C 3C 67 FE 22 03 D8 AE FF 3A ")
    (data "B3 2E 5C B2 E8 DA 8D 70 10 D0 2A C9 26 8B 4D 42 D3 28 7A 8F FF B8 C4 38 50 5C 2F B0 D3 EC 5F E1 ")
    (data "DA 2C 6F 6A A1 EF 7A 13 FD 52 B5 21 6F A6 6F 1A 45 E3 A3 CA C6 9F 65 C5 5D FE AD 64 7F 00 27 25 ")
    (data "A5 85 3A 4E CF 6B DE 25 C1 E4 9B 00 FF E9 C2 70 9B 03 F7 84 A6 71 48 56 03 DB F5 DF B6 5D FF 04 ")
    (data "DB F5 B7 B1 5D FF 60 DB F5 9F EC C2 BC 94 FE A4 2E 77 71 5F 24 84 B4 C3 76 FD 4F 81 23 0B 5C 32 ")
    (data "12 49 A7 2F 4A 5E F1 D4 2D 02 CF 29 1B C3 32 D4 28 13 8F B3 08 B0 7B C1 6B CA 6E E3 75 72 6B A5 ")
    (data "90 C7 23 34 8D D5 28 B7 C5 35 C0 7D 19 C7 67 F1 A0 14 20 77 5C 6E 68 1A 73 D1 B9 6C BB 7B C8 96 ")
    (data "8B 68 C7 5E A1 69 E4 DA 7E 4B 8A 6E 7F B3 C4 18 D3 90 DD A8 34 AE 2F D1 DF 00 6B 21 09 36 B5 10 ")
    (data "9A C6 0A A1 69 5C 98 E8 96 CD 44 CF 8D 2A 90 7A 55 48 D6 89 05 DC 4A F9 D5 52 1E 86 03 BF 4E 4A ")
    (data "0D 28 B3 27 13 73 B6 5B AC A6 F1 F6 AD A9 9F 8E 63 BB FE 83 48 EC 63 5E 8E 0A 3C 67 B5 82 C3 5C ")
    (data "93 B3 DD 30 E0 87 05 FB 1E AA 3C 58 F2 BA 53 42 D3 C8 E5 45 0A 4D 63 18 22 06 5B 86 2A 06 47 3B ")
    (data "DC D0 34 D6 C9 D3 30 F1 46 9C 5B 61 AC F7 90 D0 92 34 DE A7 7C 2D C5 CD 42 D3 68 1B 38 9F 18 23 ")
    (data "BF 03 56 2E 39 4E CB 0C 5E 2B 8A 3F 00 6E 2C D9 F7 A2 E4 CF FA 3D 90 72 DB CF 4F 5A 51 9C A5 65 ")
    (data "17 91 6D 70 E5 E1 94 D0 34 F6 AC 70 3D A1 69 2C 19 9A C6 B9 C0 93 C8 7B FC 46 73 9B BE 30 AA 40 ")
    (data "14 7F AD 28 BE D8 8A E2 ED 11 CF D5 ED 74 A6 18 28 48 8C D6 A6 1D EA 5B E9 7F F2 96 5A 59 3E F0 ")
    (data "9C 05 AB 0C 14 78 CE 5E 0C BE EF DA F1 B4 2E D3 D1 C8 9C C0 39 81 E7 E4 16 EB B4 5D FF 3E E0 E9 ")
    (data "9C CD AD C0 73 CA C6 66 B4 24 F0 9C B9 3B D1 6F 87 28 9B 30 61 00 77 B5 7B A0 27 0F F3 DF 00 EB ")
    (data "97 1C A7 93 C9 3C F3 01 B7 87 A6 D1 52 01 3E 09 24 BF 9C 6A BF B7 9B B3 32 FF 92 E3 65 B5 9E 86 ")
    (data "01 97 86 A6 91 79 3F 09 4D 63 15 A4 36 6D 19 19 82 01 F2 C4 7D 15 59 34 35 F3 83 D0 34 4E 4A 0C ")
    (data "F0 54 92 10 9B D3 4B F6 7F 57 D6 09 2B 8A 3F 45 94 E8 CB 32 1C B8 3C 34 8D D3 F2 7A DC 06 08 4D ")
    (data "63 FD 24 03 77 02 70 08 33 14 E6 0F 6A 6E DB 57 DB 12 A1 69 2C 87 94 C2 E8 46 2C 45 95 3A 48 CA ")
    (data "E0 26 2B 10 B5 99 E1 C0 D6 E4 F7 AC CC 44 E0 39 2B 21 F1 7C 83 0A DB F5 5F 0A 3C C7 47 32 02 F3 ")
    (data "B0 19 F0 1D 24 26 2B 2F 67 03 A3 73 B4 9B 0B B8 30 F0 9C 2D 6C D7 AF 4D 65 3A F0 9C A5 80 EB 03 ")
    (data "CF 39 C6 76 FD BB EA EA B7 83 DC 06 BC 4E B9 A2 C8 6B 03 E3 43 D3 B8 12 D9 42 79 14 89 63 1D 8E ")
    (data "04 98 6F 8A D4 EF 2B AB 51 05 E5 03 A0 F3 B2 28 70 4B 68 1A B7 22 E5 76 1E 66 46 9C D9 48 60 5B ")
    (data "A4 96 E7 A8 8A E3 5C DD E6 FC BF 29 BF 35 B7 21 F0 70 68 1A A7 20 C6 C3 FB 88 52 F9 FA C8 56 D9 ")
    (data "6E D4 50 0E 26 34 8D F9 AD 28 6E B5 28 BA 11 D1 7D CA 9B 05 DD CC C9 C0 2E A1 69 FC 16 D9 4E 7C ")
    (data "15 F1 90 AD 80 08 C9 1E 8C FC 6E CB D0 2E 5B 35 44 F4 BE CA C6 B7 0D 47 B6 01 0F 4C 7E 0F B7 21 ")
    (data "31 9E 8D 09 49 8B 21 C1 ED AB 00 EB 22 DF AD 15 32 FA DB 3C 34 8D 15 AD 28 9E 1E BE D4 37 9E AA ")
    (data "D0 34 76 40 02 04 BB 61 50 7D 00 0C 75 41 47 25 9B 2C F7 7E 1A 47 94 19 20 F0 9C 15 11 EF 42 D1 ")
    (data "B4 E2 7E F9 4D 9E 81 AC CA F2 F2 8B C0 73 16 29 D0 FE 02 F2 07 5F 6F 9C CC A7 16 02 CF D9 01 F9 ")
    (data "0E 98 94 93 0F E8 3A 49 3A 78 95 55 FA 5C 88 64 C6 55 48 7C D6 DB 88 61 F5 18 E2 A1 AA 62 50 81 ")
    (data "84 6D 74 83 ED 90 CA 1B FF 46 DE C3 DB 48 C6 F7 2F A9 6E 50 BD 49 FB 87 7A 55 11 E8 55 10 6F DA ")
    (data "8B C8 DC 9F 03 C6 00 DF A2 BE FA 7A 2D BD EB 89 C7 ED 17 15 C7 58 1B F9 3E 0E FC 3B BC 8A 08 6C ")
    (data "1E 4E 79 83 EA BF B4 C9 3E B5 A2 F8 35 D2 65 8F 8A B2 18 F0 7D E0 3A 20 66 C6 77 E9 6D E4 F7 71 ")
    (data "1F A2 06 70 18 D9 06 D5 00 33 79 AB FA E2 06 1E 9A C6 97 91 2F 73 A5 AD 96 02 B8 2D F6 6D 95 A1 ")
    (data "CF BF C8 9F 71 BA 45 E0 39 FB 17 E9 3C F0 9C 1D 81 87 80 A5 0B CE 0B AA D5 15 AB 0D DB F5 3F 44 ")
    (data "94 D6 F3 B2 38 F9 3D 5B D8 AE 3F 19 38 A5 40 FF DF 0F 3C 67 74 E0 39 A5 BD EB 81 E7 7C 3E F0 9C ")
    (data "4B 11 11 E2 01 01 C4 CD 02 CF D9 BE 6C 9F 5D 66 34 F9 6B 27 76 93 77 90 CF 74 B0 73 81 15 C5 ED ")
    (data "82 B8 AB D4 BD EC 16 79 3C 50 17 52 6C D1 D4 0D 7E 9D 53 07 2B 40 BC B6 FD C2 7E 49 72 01 D0 27 ")
    (data "46 15 72 B3 68 17 DF 70 3F B2 62 5D 06 59 91 2C 87 64 AA AC 83 6C D1 EC 8E 04 59 9E 88 AC 6A 2F ")
    (data "05 AE 45 DC AC 77 23 31 5A E7 00 9B 59 51 5C DB AA 57 19 7C 24 2A DD D7 16 B8 E4 9C C0 73 76 6D ")
    (data "D7 28 F0 9C 65 03 CF B9 12 71 AF 17 F1 DA 34 52 46 DC AE 23 D8 AE 7F 35 2D 62 1C 52 38 34 F0 9C ")
    (data "F5 0A B4 3F 87 62 DA 33 47 00 F7 16 1C 83 C0 73 56 09 3C E7 4C C4 2B F0 9D 94 26 27 17 E9 AF 57 ")
    (data "58 51 FC 3A E5 CB 03 75 92 F3 93 00 E8 C1 CC FB E4 8B 03 BA 9B CE 48 00 D5 49 DB 92 32 56 14 4F ")
    (data "A6 D8 A2 A9 D3 BC 84 84 04 B4 25 29 8E 7C 78 67 A7 53 88 C5 81 9D 07 5E F4 4B 4C 55 9E E0 BA CB ")
    (data "AD 28 BE BF E3 33 51 66 17 42 24 DB 34 0F 23 80 AB 03 CF B9 1E F8 03 E2 85 7A 33 39 BE 24 12 2B ")
    (data "F1 55 A4 7E 5E DA 42 65 22 F9 75 7C FA AD E6 DD 91 48 D6 4D 9E AD 89 61 C0 B9 81 E7 AC 9F A7 BC ")
    (data "8C ED FA D3 02 CF 39 00 89 8F C9 AB E3 B3 01 F0 F7 C0 73 EE 41 E2 5F 1E 46 DC F7 03 1E 86 05 90 ")
    (data "CF 70 79 24 56 65 4B 64 AB A2 65 9F 81 E7 EC 64 BB 7E 95 94 ED 6E F1 2B 64 AB A8 90 61 D9 41 DE ")
    (data "00 7E DE EB 49 D4 C0 19 56 14 B7 15 E8 B4 A2 F8 A3 D0 34 2E 06 8E ED C2 9C CA 92 2B B3 DD 8A E2 ")
    (data "AB 43 D3 F8 13 F2 7D EA 35 C7 14 31 CC AD 28 FE 53 68 1A 97 03 FB 74 70 4E 45 38 08 F8 33 F4 8F ")
    (data "51 75 09 B2 27 DE 8A B3 42 D3 D8 09 D9 3F 7F 0D 49 7D FD 94 19 65 6A 16 41 82 CF DF 07 5E 41 B2 ")
    (data "34 9E 06 FE 5B A2 5C 8D 32 C4 B1 5D FF BE C0 73 EE 46 B4 CB F2 B2 53 F2 57 84 4F 90 12 23 ED 02 ")
    (data "60 07 28 53 97 AB 63 D8 AE 3F 2E F0 9C 0B 90 40 E6 3C AC 8B 78 8C 73 AD 3A 6D D7 1F 1F 78 CE 21 ")
    (data "14 CF 48 DA 94 7A B3 2A 7F 1A 78 CE 0D 89 56 57 DF 62 45 F1 94 D0 34 BE 8D C4 F6 F4 83 E0 E6 81 ")
    (data "89 E7 60 30 F3 34 22 F8 9C 97 33 90 A0 F8 2A 0A EB ED 78 97 F2 A1 00 45 B4 C6 0E 42 0C F4 32 F2 ")
    (data "07 75 71 85 15 C5 63 4A 5C 77 30 22 F0 6D D6 3C 9F 32 6C 1B 9A C6 B2 56 14 3F DF 2F DB 7F BF 46 ")
    (data "56 9B AD 98 13 F1 04 FC 08 71 D3 9E 8F 04 BB FE 0A F8 29 70 14 22 44 18 20 37 E8 B1 C8 9E F1 FB ")
    (data "A1 69 DC 19 9A C6 89 A1 69 68 61 64 A5 11 9B CE C9 76 0C 70 1C 70 73 81 71 96 EF E0 5C CA 72 22 ")
    (data "12 37 93 97 53 02 CF 59 22 6F 63 DB F5 2F A7 40 3C 56 87 F8 1C 92 89 D5 F7 58 51 1C 23 99 62 59 ")
    (data "45 7F BB C5 4F AC 28 BE AE C7 73 A8 CA 14 60 3F 2B 8A 3F CC 7B 81 15 C5 AF 50 2C 1E B0 0C FB 90 ")
    (data "5E 03 2F 0F B9 65 31 AC 28 9E 88 2C 14 7B 55 8E EB 61 66 D4 02 2E 44 B2 85 F9 75 DA DB 0E DD 60 ")
    (data "18 89 E0 6C 5F 18 55 56 14 7F 8C C4 3A 4C EE 40 F7 23 80 2D 90 58 84 71 A1 69 8C CD 23 C2 A6 0C ")
    (data "7D 6C D7 7F 98 F6 1E D2 2A 5C 68 BB FE E9 49 D0 77 DE 2A EB 45 85 34 3B 8E ED FA 6F 52 2C EE 68 ")
    (data "61 0A 7E AE B6 EB 9F 48 F5 8C A4 B2 3C 0F 6C 61 BB FE DB 3D 1A BF 30 56 14 DF 81 A4 E1 F7 CA B0 ")
    (data "3A CD 8A E2 93 BB 34 56 27 9E 0B 03 1C 61 45 71 19 61 D5 D3 90 6C B7 4E 70 96 15 C5 D7 53 2C 4B ")
    (data "B9 91 35 43 D3 68 29 02 DA 88 15 C5 E3 81 1D E9 BE CC D0 E3 C0 D7 AA C4 E3 59 51 FC 22 F2 7C EF ")
    (data "46 45 96 56 9C 82 64 0B F6 87 51 05 60 45 F1 03 88 1B F2 CF 94 97 D1 CF C3 36 88 56 48 D9 0A E6 ")
    (data "CA D0 E2 78 3A 93 D1 73 39 33 6F 99 E5 D5 F1 E9 3B A3 2A E1 6C 24 7D 3A 2F FB 04 9E 53 64 6B 15 ")
    (data "DB F5 6D E0 07 48 A9 8A 6E 71 0B 60 DA AE 5F A6 0C 4C 4F 49 BC 44 3B 51 CC 8B 58 95 8F 81 C3 AD ")
    (data "28 3E AE 8B 63 1E 4F 67 B2 BD 8E B7 A2 B8 94 FA 7A 92 A5 F6 4D EA F7 92 8C 05 8E 4E FE FF AE 92 ")
    (data "7D CC 49 FB 38 C2 99 B0 A2 F8 21 E0 CB E4 5F FC 55 E5 3E 60 D3 24 F9 A2 12 89 61 B5 01 F2 D9 75 ")
    (data "9B 97 81 ED AC 28 76 13 71 D2 FE 31 AA 00 AC 28 7E C2 8A E2 6F 02 9F 45 BE B0 E7 20 41 C1 AF 51 ")
    (data "EF 8A 6C 61 E0 84 1A FB 53 06 29 B6 EB 4F 05 76 A1 5E 9D 9D 00 D8 37 E9 7B 80 BC C5 40 47 06 9E ")
    (data "B3 64 8D 73 A9 85 44 78 F3 A8 82 97 9D 13 78 4E 21 CD 1A DB F5 47 03 5B D1 F9 74 EF 37 91 6D 87 ")
    (data "1D 6D D7 EF D5 D6 47 65 AC 28 BE 15 89 29 79 A0 0B C3 8D 03 36 B4 A2 F8 B7 5D 18 AB 91 E7 91 EF ")
    (data "44 DB 40 F2 9C 4C 01 FE CF 8A E2 53 AB 74 92 D4 AD DD 82 FC 05 C2 DB 71 3D B0 73 A2 49 06 70 43 ")
    (data "85 BE 76 28 7A 81 15 C5 4F 20 31 91 57 56 18 37 0F A7 03 5B D6 19 8B 67 45 F1 DB 88 B7 ED 87 74 ")
    (data "D6 B3 39 C0 87 C0 A9 C0 6A 56 14 CF 64 CC F5 95 51 35 80 15 C5 93 AC 28 FE 33 92 36 F9 7F 48 60 ")
    (data "E0 D5 C8 97 B7 2E 55 65 AD FD A7 00 60 BB FE 07 48 F6 DE CF A8 56 18 F6 75 60 37 DB F5 7F 94 12 ")
    (data "F0 7C 4F 81 7E B6 AA 30 87 8E 61 BB FE AD 14 2B 6A BA 2A 33 56 DD 45 C6 B9 0B 29 40 7B 0A F9 CB ")
    (data "E5 E4 65 22 12 0A B0 B2 ED FA 17 F4 7B 60 7A 1E AC 28 7E 0E 29 ED 75 30 92 A4 53 37 13 92 BE 4D ")
    (data "2B 8A CB 6E 49 55 C2 8A E2 7F 21 9E 94 71 15 BB 7A 0C D8 B8 AC 87 AA 99 C4 4B B2 21 C5 AA 09 A4 ")
    (data "71 3A B0 5B 93 4E D6 43 C0 0B 25 FB DB B1 CC 45 56 14 BF 69 45 F1 DE C0 D7 A8 5F 25 3F 02 36 B2 ")
    (data "A2 F8 D8 AC 52 40 55 B0 A2 78 AA 15 C5 BF 44 BC FD 97 D0 99 22 DF 6F 20 C6 D4 F2 56 14 1F 9F C4 ")
    (data "A4 CD 44 5F 1A 55 A1 69 2C 18 9A C6 B1 C8 8F 39 42 DE C4 1E C0 EA D4 97 B1 D8 93 9B 83 D2 9F D8 ")
    (data "AE 3F 35 89 EB 59 07 F8 13 C5 B6 A0 DE 43 6E 8A 2B DA AE 9F 55 D2 E6 9F E4 8F 59 D8 A2 C0 D8 DD ")
    (data "E6 18 8A 79 8D 7F 1C 78 4E 5B DD 9C 66 6C D7 9F 64 BB BE 8B 68 D2 1D 4F B1 AD C7 66 3E 45 F4 85 ")
    (data "0E 02 96 B1 5D FF C7 49 9C D8 90 C1 8A E2 69 56 14 5F 80 7C 5E 16 12 EF 53 C5 60 FC 08 59 C8 EE ")
    (data "0A AC 68 45 F1 05 0D 1E 94 9E 60 45 F1 33 C0 97 90 EF 43 D1 7F BF 71 C8 E7 B2 AE 15 C5 45 B4 D1 ")
    (data "F2 CC 6B 92 15 C5 FB 21 99 C4 45 6B 34 46 C0 E6 89 A1 31 93 C3 20 D9 4E BA A4 E4 B4 D6 0B 4D 23 ")
    (data "77 B2 48 33 56 14 DF 88 78 40 77 40 64 64 CA 7A 7F 3E 41 12 75 76 04 D6 4B C2 7C 3A 8A 15 C5 13 ")
    (data "AC 28 DE 1F 58 09 C9 EA AC 52 84 19 64 61 37 06 F8 36 30 32 31 A6 32 17 2F FD 22 A9 30 9D 44 5D ")
    (data "FD 4F 94 53 A3 CE CB 14 AA 55 32 EF 27 26 92 5F 68 B2 8E 55 FF 0B 5D 1E EF DE 02 E3 55 56 9B B6 ")
    (data "5D FF 5F C0 EE 49 F6 DA AE C8 8D 72 0D 60 59 66 28 FE 4F 42 CA 4C FC 1D B9 89 FE C9 76 FD 96 EF ")
    (data "D5 76 FD A9 81 E7 7C 81 7C 7A 4F 45 BC B1 79 3F 9B 5A C4 19 6D D7 FF 4F E0 39 8B 51 AC A4 46 E9 ")
    (data "B1 6D D7 1F 58 19 9E 9A 14 56 DE 02 F1 58 AC 90 FC 7D 86 19 A9 ED 1F 25 63 BD 88 C4 BA 3C 8D 7C ")
    (data "7F EE AB 79 8B AF C8 6F AE AB A2 98 49 D2 CF C5 C0 C5 A1 69 2C C9 8C CF 6B 35 C4 E0 5A 9C 99 2B ")
    (data "57 7C 8C 78 58 5F 46 82 7D C7 23 42 CB 0F 16 C9 88 EB 16 C9 FB 3B 35 34 8D D1 48 E6 D7 8E 48 FC ")
    (data "90 C1 0C AD B3 49 88 C7 EE 09 C4 DB 73 B3 15 C5 9D AE 4D 88 15 C5 7F 03 B6 0A 4D C3 40 42 0A 36 ")
    (data "46 1C 01 CB 30 E3 3B FA 0E F2 39 3F 00 8C C9 A1 BD E8 51 BE 44 53 A5 FB 61 62 D4 DD 82 D4 5C 9C ")
    (data "0F F9 1E 6D 8A 78 91 97 47 DE D7 02 CC 10 EE FE 08 F9 2E 3D 8B 04 A1 DF 0B DC 6A 45 71 4F B6 D7 ")
    (data "AD 28 7E 16 38 21 34 8D 13 91 7F 87 4D 90 D8 2B 23 F9 FB 0C 33 C4 96 3F 45 16 BD EF 20 F3 9F 80 ")
    (data "78 EA 1E 04 FE 59 C4 B3 96 BB B2 7C 37 48 AA 74 3F 44 67 4B 75 3C 0B 1C 6D 45 71 11 45 6D 45 51 ")
    (data "94 21 43 68 1A C3 BB A9 DF 17 9A C6 2E 94 2C 4C 0E EC 6A 45 71 BB 9A 7C 84 A6 31 6C 20 58 B8 1F ")
    (data "E9 F7 F9 95 65 B0 BF AF BA E7 DF 6F 46 D5 55 C0 37 32 4E 7F 88 64 69 8D 45 B4 2D 5E 48 8E 81 6C ")
    (data "63 2E 8C 88 E1 2D 04 CC 8B 54 CD 6E E4 03 20 4E 34 5E 14 45 51 94 2E D1 0D A3 4A 51 FA 81 7E DB ")
    (data "FE DB 26 E5 D8 B3 88 0B F4 AA 36 45 90 07 6D 06 8F A2 28 8A A2 28 83 9F 7E 0B 54 4F AB FF 75 29 ")
    (data "F0 E7 36 06 95 A2 28 8A A2 28 4A 4F E9 37 4F D5 93 48 50 70 23 27 03 27 85 A6 F1 02 12 E0 F7 1A ")
    (data "12 0C F7 4E F2 37 11 D9 06 1C C8 4E 98 84 04 FA 4E 63 46 B6 D5 47 64 67 2F 64 69 65 7C 3C 04 2A ")
    (data "AF 2B 8A A2 28 8A D2 25 FA CD A8 BA 82 F4 8A E7 C3 90 EC AB 65 BB 39 99 D0 34 B2 4E 0D 64 0A 14 ")
    (data "65 2A 92 7E 5F 94 4F 28 97 C9 31 85 72 19 78 AD 8C D0 AA 4C A4 F3 F5 F6 66 A7 F1 8A 52 F6 BB D4 ")
    (data "8F 7C C8 8C B8 4A A5 BF A9 52 F4 76 83 16 F7 62 65 E8 F1 29 72 1F 1D 4C 7C 00 3C 62 45 F1 D4 7E ")
    (data "0B 54 9F 07 B8 1D 49 7D 54 14 45 51 14 45 19 0C DC 0D 7C A5 AF 8C 2A 80 44 0F E3 14 44 4D 7D EE ")
    (data "36 CD 15 45 51 14 45 51 FA 81 8D FB CE A8 1A 20 34 8D C5 81 DD 81 ED 90 42 CB 9F EF ED 8C 14 45 ")
    (data "51 14 45 51 32 D9 A8 6F 8D AA 66 42 D3 58 10 51 59 5F 18 51 33 6E D6 A1 CA CB C2 2D CE CD C9 0C ")
    (data "85 D5 34 E6 41 34 B0 8A 30 37 E9 59 8D 55 98 1F 28 54 A8 36 07 0B D1 5D DD B2 39 98 59 D9 B9 DF ")
    (data "18 4E 67 45 68 AB A2 F3 AB C6 30 FA 7B 7E 8A A2 0C 2E C6 02 DB 0F 1A A3 4A 51 14 45 A9 87 D0 34 ")
    (data "46 30 A3 74 4A 37 F8 2A 70 79 C9 6B F7 01 6E AC 71 2E CD 74 7B 41 D9 AF 74 C2 01 30 58 59 80 62 ")
    (data "89 7C EF 00 E3 AC 28 9E D6 6F D9 7F 8A A2 28 4A 87 49 EA FA 75 2D 73 32 34 8D 2A 75 40 DF B7 A2 ")
    (data "38 4B FA A6 0E 3A D9 B7 32 9B D1 6F E2 9F 8A A2 28 8A A2 28 83 12 35 AA 14 45 51 14 45 51 6A 40 ")
    (data "8D 2A 45 51 14 45 51 94 1A 50 A3 4A 51 14 45 51 14 A5 06 D4 A8 52 14 45 51 14 45 A9 01 35 AA 14 ")
    (data "45 51 14 45 51 6A 40 8D 2A 45 51 14 45 51 94 1A 50 A3 4A 51 14 45 51 14 A5 06 FE 1F 5A 56 C4 3F ")
    (data "78 AD F0 DF 00 00 00 00 49 45 4E 44 AE 42 60 82 ")
    )
  )
)
