﻿{
  "profiles": {
    "Borepin.Browser": {
      "commandName": "Project",
      "launchBrowser": true,
      "environmentVariables": {
        "ASPNETCORE_ENVIRONMENT": "Development"
      },
      "applicationUrl": "https://localhost:5001;http://localhost:5000",
      "inspectUri": "{wsProtocol}://{url.hostname}:{url.port}/debug?browser={browserInspectUri}"
    }
  }
}
