<?xml version="1.0" encoding="UTF-8" standalone="no"?>
<svg
   xmlns:dc="http://purl.org/dc/elements/1.1/"
   xmlns:cc="http://creativecommons.org/ns#"
   xmlns:rdf="http://www.w3.org/1999/02/22-rdf-syntax-ns#"
   xmlns:svg="http://www.w3.org/2000/svg"
   xmlns="http://www.w3.org/2000/svg"
   xmlns:sodipodi="http://sodipodi.sourceforge.net/DTD/sodipodi-0.dtd"
   xmlns:inkscape="http://www.inkscape.org/namespaces/inkscape"
   width="500"
   height="500"
   viewBox="0 0 132.29166 132.29166"
   version="1.1"
   id="svg8"
   inkscape:version="1.0.1 (3bc2e813f5, 2020-09-07)"
   sodipodi:docname="Logo.svg">
  <defs
     id="defs2" />
  <sodipodi:namedview
     id="base"
     pagecolor="#3c474d"
     bordercolor="#666666"
     borderopacity="1.0"
     inkscape:pageopacity="1"
     inkscape:pageshadow="2"
     inkscape:zoom="1.4142136"
     inkscape:cx="183.10598"
     inkscape:cy="259.32089"
     inkscape:document-units="mm"
     inkscape:current-layer="g5017"
     showgrid="true"
     inkscape:window-width="2560"
     inkscape:window-height="1330"
     inkscape:window-x="-12"
     inkscape:window-y="-12"
     inkscape:window-maximized="1"
     units="px"
     inkscape:document-rotation="0" />
  <metadata
     id="metadata5">
    <rdf:RDF>
      <cc:Work
         rdf:about="">
        <dc:format>image/svg+xml</dc:format>
        <dc:type
           rdf:resource="http://purl.org/dc/dcmitype/StillImage" />
        <dc:title></dc:title>
      </cc:Work>
    </rdf:RDF>
  </metadata>
  <g
     inkscape:groupmode="layer"
     id="layer2"
     inkscape:label="Ebene 0"
     transform="translate(0,-67.708342)" />
  <g
     inkscape:label="Ebene 1"
     inkscape:groupmode="layer"
     id="layer1"
     transform="translate(0,-164.70834)"
     style="display:inline">
    <path
       cx="90"
       cy="137"
       rx="40"
       ry="7.5"
       id="path4731"
       style="fill:none;fill-opacity:1;stroke:#ff0000;stroke-width:4.81531763;stroke-linecap:round;stroke-linejoin:round;stroke-miterlimit:4;stroke-dasharray:none;stroke-dashoffset:0;stroke-opacity:1;paint-order:normal"
       d=""
       inkscape:connector-curvature="0" />
    <path
       cx="50"
       cy="137"
       r="10"
       id="path4810"
       style="fill:#808000;fill-opacity:1;stroke:none;stroke-width:0.60454923;stroke-miterlimit:4;stroke-dasharray:1.8136478, 0.60454927;stroke-dashoffset:0;stroke-opacity:1"
       d=""
       inkscape:connector-curvature="0" />
    <g
       id="g5017"
       transform="translate(-9.9998126,31.617937)">
      <g
         id="g4850"
         transform="matrix(0.6614572,0,0,0.66919108,16.614605,74.638827)">
        <path
           style="fill:#00d4aa;fill-opacity:1;stroke:none;stroke-width:1.06181;stroke-miterlimit:4;stroke-dasharray:3.18542, 1.06181;stroke-dashoffset:0;stroke-opacity:1"
           d="M 151.18164,43.910156 A 113.38583,113.38582 0 0 0 37.794922,157.29688 113.38583,113.38582 0 0 0 113.38672,264.07031 V 535.25 l 30.23047,31.67969 45.35937,-31.67969 v -26.84766 l -11.33789,-29.22656 11.33789,-12.56445 v -33.31836 l -26.45703,-37.90625 26.45703,-25.2207 V 357.2207 l -11.33789,-29.22656 11.33789,-12.56445 v -51.37696 a 113.38583,113.38582 0 0 0 75.58985,-106.75585 113.38583,113.38582 0 0 0 -0.0625,-1.23243 c -33.8533,-1.58791 -63.87791,-5.29175 -85.69727,-10.83789 a 37.795276,37.795276 0 0 1 -27.625,12.07032 37.795276,37.795276 0 0 1 -37.79492,-37.79493 37.795276,37.795276 0 0 1 37.79492,-37.794919 37.795276,37.795276 0 0 1 37.79492,37.794919 37.795276,37.795276 0 0 1 -1.16992,9.14063 c 18.94418,4.26853 45.32423,7.5204 74.94531,9.07812 A 113.38583,113.38582 0 0 0 151.18164,43.910156 Z M 132.2832,289.58008 h 18.89844 V 516.35156 H 132.2832 Z"
           transform="matrix(0.26458333,0,0,0.26458333,9.9998126,105.38206)"
           id="path10"
           inkscape:connector-curvature="0" />
      </g>
      <g
         id="g4835"
         transform="matrix(0.6614572,0,0,0.66919108,16.614605,74.638827)">
        <path
           style="fill:#00d4aa;fill-opacity:0.964865;stroke:none;stroke-width:1.60927;stroke-miterlimit:4;stroke-dasharray:4.8278, 1.60927;stroke-dashoffset:0;stroke-opacity:1"
           d="M 453.54297,43.910156 A 113.38583,113.38583 0 0 0 341.875,137.73047 c 29.79282,-1.56256 56.20979,-4.89099 75.02734,-9.11133 a 37.795276,37.795276 0 0 1 -1.15429,-9.11719 37.795276,37.795276 0 0 1 37.79492,-37.794919 37.795276,37.795276 0 0 1 37.79687,37.794919 37.795276,37.795276 0 0 1 -37.79687,37.79493 37.795276,37.795276 0 0 1 -27.61328,-12.03126 c -21.70666,5.54313 -51.57227,9.18175 -85.72852,10.78907 a 113.38583,113.38583 0 0 0 -0.043,1.24219 V 384.06836 H 566.92969 V 157.29688 A 113.38583,113.38583 0 0 0 453.54297,43.910156 Z M 370.39453,176.19336 h 166.29883 c 6.28157,0 11.33789,5.05827 11.33789,11.33984 v 166.29883 c 0,6.28158 -5.05632,11.33789 -11.33789,11.33789 H 370.39453 c -6.28154,0 -11.33984,-5.05631 -11.33984,-11.33789 V 187.5332 c 0,-6.28157 5.0583,-11.33984 11.33984,-11.33984 z"
           transform="matrix(0.26458333,0,0,0.26458333,9.9998126,105.38206)"
           id="rect4534"
           inkscape:connector-curvature="0" />
        <path
           id="circle4715"
           d="m 114.0901,173.5901 a 22.5,22.5 0 0 1 31.8198,0"
           style="fill:none;fill-opacity:1;stroke:#00d4aa;stroke-width:5;stroke-linecap:round;stroke-miterlimit:4;stroke-dasharray:none;stroke-dashoffset:0;stroke-opacity:1;paint-order:normal"
           inkscape:connector-curvature="0" />
        <path
           id="circle4713"
           d="m 119.3934,178.8934 a 15,15 0 0 1 21.2132,0"
           style="fill:none;fill-opacity:1;stroke:#00d4aa;stroke-width:5;stroke-linecap:round;stroke-miterlimit:4;stroke-dasharray:none;stroke-dashoffset:0;stroke-opacity:1"
           inkscape:connector-curvature="0" />
        <path
           id="circle4711"
           d="m 124.6967,184.1967 a 7.5,7.5 0 0 1 10.6066,0"
           style="fill:none;fill-opacity:1;stroke:#00d4aa;stroke-width:5;stroke-linecap:round;stroke-miterlimit:4;stroke-dasharray:none;stroke-dashoffset:0;stroke-opacity:1"
           inkscape:connector-curvature="0" />
        <path
           id="path4614"
           d="m 132.5,189.5 a 2.5,2.5 0 0 1 -2.5,2.5 2.5,2.5 0 0 1 -2.5,-2.5 2.5,2.5 0 0 1 2.5,-2.5 2.5,2.5 0 0 1 2.5,2.5 z"
           style="fill:#00d4aa;fill-opacity:1;stroke:none;stroke-width:0.226274;stroke-miterlimit:4;stroke-dasharray:0.678823, 0.226274;stroke-dashoffset:0;stroke-opacity:1"
           inkscape:connector-curvature="0" />
      </g>
      <path
         id="path4717"
         d="m 75.677932,159.68746 c -2.981346,0.009 -5.951674,0.11655 -8.794624,0.31573 a 21.497359,21.748711 0 0 1 1.924091,3.10714 c 4.783538,-0.26482 9.890389,-0.26476 14.685164,0.001 a 21.497359,21.748711 0 0 1 1.90392,-3.10992 c -3.141727,-0.21968 -6.434688,-0.32488 -9.718551,-0.31399 z"
         style="color:#000000;font-style:normal;font-variant:normal;font-weight:normal;font-stretch:normal;font-size:medium;line-height:normal;font-family:sans-serif;font-variant-ligatures:normal;font-variant-position:normal;font-variant-caps:normal;font-variant-numeric:normal;font-variant-alternates:normal;font-feature-settings:normal;text-indent:0;text-align:start;text-decoration:none;text-decoration-line:none;text-decoration-style:solid;text-decoration-color:#000000;letter-spacing:normal;word-spacing:normal;text-transform:none;writing-mode:lr-tb;direction:ltr;text-orientation:mixed;dominant-baseline:auto;baseline-shift:baseline;text-anchor:start;white-space:normal;shape-padding:0;clip-rule:nonzero;display:inline;overflow:visible;visibility:visible;opacity:1;isolation:auto;mix-blend-mode:normal;color-interpolation:sRGB;color-interpolation-filters:linearRGB;solid-color:#000000;solid-opacity:1;vector-effect:none;fill:#00d4aa;fill-opacity:1;fill-rule:nonzero;stroke:none;stroke-width:3.20369;stroke-linecap:round;stroke-linejoin:round;stroke-miterlimit:4;stroke-dasharray:none;stroke-dashoffset:0;stroke-opacity:1;paint-order:normal;color-rendering:auto;image-rendering:auto;shape-rendering:auto;text-rendering:auto;enable-background:accumulate"
         inkscape:connector-curvature="0" />
      <path
         id="path4904"
         d="m 99.624301,162.2987 c -0.89832,0.6813 -1.557465,1.66507 -1.835217,2.80456 1.384757,0.39896 2.374496,0.82785 2.883576,1.15605 0.0474,0.0307 0.0284,0.0218 0.0646,0.047 -0.0768,0.0608 -0.0849,0.0867 -0.22731,0.1698 -0.544834,0.31755 -1.469481,0.69614 -2.720862,1.0575 0.277813,1.13877 0.936853,2.12173 1.834525,2.80282 0.969607,-0.32054 1.789767,-0.66832 2.476467,-1.06856 1.03088,-0.60082 1.98778,-1.40653 2.0892,-2.75648 0.10138,-1.34996 -0.82439,-2.33743 -1.8048,-2.96952 -0.74404,-0.47969 -1.65155,-0.87802 -2.760167,-1.24321 z"
         style="color:#000000;font-style:normal;font-variant:normal;font-weight:normal;font-stretch:normal;font-size:medium;line-height:normal;font-family:sans-serif;font-variant-ligatures:normal;font-variant-position:normal;font-variant-caps:normal;font-variant-numeric:normal;font-variant-alternates:normal;font-feature-settings:normal;text-indent:0;text-align:start;text-decoration:none;text-decoration-line:none;text-decoration-style:solid;text-decoration-color:#000000;letter-spacing:normal;word-spacing:normal;text-transform:none;writing-mode:lr-tb;direction:ltr;text-orientation:mixed;dominant-baseline:auto;baseline-shift:baseline;text-anchor:start;white-space:normal;shape-padding:0;clip-rule:nonzero;display:inline;overflow:visible;visibility:visible;opacity:1;isolation:auto;mix-blend-mode:normal;color-interpolation:sRGB;color-interpolation-filters:linearRGB;solid-color:#000000;solid-opacity:1;vector-effect:none;fill:#00d4aa;fill-opacity:1;fill-rule:nonzero;stroke:none;stroke-width:3.20348;stroke-linecap:butt;stroke-linejoin:round;stroke-miterlimit:4;stroke-dasharray:none;stroke-dashoffset:0;stroke-opacity:1;paint-order:normal;color-rendering:auto;image-rendering:auto;shape-rendering:auto;text-rendering:auto;enable-background:accumulate"
         inkscape:connector-curvature="0" />
      <path
         id="path4911"
         d="m 81.393461,169.62236 c -3.463238,0.13429 -7.037215,0.13622 -10.496873,0.001 a 21.497359,21.748711 0 0 1 0.277214,3.23439 c 3.286985,0.11812 6.657593,0.11574 9.947571,-0.002 a 21.497359,21.748711 0 0 1 0.272088,-3.23406 z"
         style="color:#000000;font-style:normal;font-variant:normal;font-weight:normal;font-stretch:normal;font-size:medium;line-height:normal;font-family:sans-serif;font-variant-ligatures:normal;font-variant-position:normal;font-variant-caps:normal;font-variant-numeric:normal;font-variant-alternates:normal;font-feature-settings:normal;text-indent:0;text-align:start;text-decoration:none;text-decoration-line:none;text-decoration-style:solid;text-decoration-color:#000000;letter-spacing:normal;word-spacing:normal;text-transform:none;writing-mode:lr-tb;direction:ltr;text-orientation:mixed;dominant-baseline:auto;baseline-shift:baseline;text-anchor:start;white-space:normal;shape-padding:0;clip-rule:nonzero;display:inline;overflow:visible;visibility:visible;opacity:1;isolation:auto;mix-blend-mode:normal;color-interpolation:sRGB;color-interpolation-filters:linearRGB;solid-color:#000000;solid-opacity:1;vector-effect:none;fill:#00d4aa;fill-opacity:1;fill-rule:nonzero;stroke:none;stroke-width:3.20369;stroke-linecap:round;stroke-linejoin:round;stroke-miterlimit:4;stroke-dasharray:none;stroke-dashoffset:0;stroke-opacity:1;paint-order:normal;color-rendering:auto;image-rendering:auto;shape-rendering:auto;text-rendering:auto;enable-background:accumulate"
         inkscape:connector-curvature="0" />
      <path
         id="path4981"
         d="m 52.666093,162.29801 c -0.960289,0.3172 -1.771939,0.6623 -2.454247,1.05717 -1.078185,0.62394 -2.086734,1.49708 -2.115851,2.90931 -0.02911,1.41225 0.973673,2.33736 2.037232,2.96952 0.698432,0.41514 1.536752,0.77371 2.533892,1.10315 0.898438,-0.68138 1.557862,-1.66521 1.83556,-2.80491 -1.278915,-0.36974 -2.218296,-0.7566 -2.757098,-1.07685 -0.123477,-0.0734 -0.114345,-0.0815 -0.183557,-0.13349 0.07825,-0.0608 0.08153,-0.0831 0.231411,-0.1698 0.545765,-0.31583 1.468644,-0.68886 2.709244,-1.04747 -0.277668,-1.1405 -0.937404,-2.12502 -1.836586,-2.80663 z"
         style="color:#000000;font-style:normal;font-variant:normal;font-weight:normal;font-stretch:normal;font-size:medium;line-height:normal;font-family:sans-serif;font-variant-ligatures:normal;font-variant-position:normal;font-variant-caps:normal;font-variant-numeric:normal;font-variant-alternates:normal;font-feature-settings:normal;text-indent:0;text-align:start;text-decoration:none;text-decoration-line:none;text-decoration-style:solid;text-decoration-color:#000000;letter-spacing:normal;word-spacing:normal;text-transform:none;writing-mode:lr-tb;direction:ltr;text-orientation:mixed;dominant-baseline:auto;baseline-shift:baseline;text-anchor:start;white-space:normal;shape-padding:0;clip-rule:nonzero;display:inline;overflow:visible;visibility:visible;opacity:1;isolation:auto;mix-blend-mode:normal;color-interpolation:sRGB;color-interpolation-filters:linearRGB;solid-color:#000000;solid-opacity:1;vector-effect:none;fill:#00d4aa;fill-opacity:1;fill-rule:nonzero;stroke:none;stroke-width:3.20348;stroke-linecap:butt;stroke-linejoin:round;stroke-miterlimit:4;stroke-dasharray:none;stroke-dashoffset:0;stroke-opacity:1;paint-order:normal;color-rendering:auto;image-rendering:auto;shape-rendering:auto;text-rendering:auto;enable-background:accumulate"
         inkscape:connector-curvature="0" />
    </g>
  </g>
</svg>
