%!PS-Adobe-3.0 EPSF-3.0
%%Creator: cairo 1.16.0 (https://cairographics.org)
%%CreationDate: Mon May  4 07:13:31 2020
%%Pages: 1
%%DocumentData: Clean7Bit
%%LanguageLevel: 3
%%BoundingBox: 6 6 378 382
%%EndComments
%%BeginProlog
50 dict begin
/q { gsave } bind def
/Q { grestore } bind def
/cm { 6 array astore concat } bind def
/w { setlinewidth } bind def
/J { setlinecap } bind def
/j { setlinejoin } bind def
/M { setmiterlimit } bind def
/d { setdash } bind def
/m { moveto } bind def
/l { lineto } bind def
/c { curveto } bind def
/h { closepath } bind def
/re { exch dup neg 3 1 roll 5 3 roll moveto 0 rlineto
      0 exch rlineto 0 rlineto closepath } bind def
/S { stroke } bind def
/f { fill } bind def
/f* { eofill } bind def
/n { newpath } bind def
/W { clip } bind def
/W* { eoclip } bind def
/BT { } bind def
/ET { } bind def
/BDC { mark 3 1 roll /BDC pdfmark } bind def
/EMC { mark /EMC pdfmark } bind def
/cairo_store_point { /cairo_point_y exch def /cairo_point_x exch def } def
/Tj { show currentpoint cairo_store_point } bind def
/TJ {
  {
    dup
    type /stringtype eq
    { show } { -0.001 mul 0 cairo_font_matrix dtransform rmoveto } ifelse
  } forall
  currentpoint cairo_store_point
} bind def
/cairo_selectfont { cairo_font_matrix aload pop pop pop 0 0 6 array astore
    cairo_font exch selectfont cairo_point_x cairo_point_y moveto } bind def
/Tf { pop /cairo_font exch def /cairo_font_matrix where
      { pop cairo_selectfont } if } bind def
/Td { matrix translate cairo_font_matrix matrix concatmatrix dup
      /cairo_font_matrix exch def dup 4 get exch 5 get cairo_store_point
      /cairo_font where { pop cairo_selectfont } if } bind def
/Tm { 2 copy 8 2 roll 6 array astore /cairo_font_matrix exch def
      cairo_store_point /cairo_font where { pop cairo_selectfont } if } bind def
/g { setgray } bind def
/rg { setrgbcolor } bind def
/d1 { setcachedevice } bind def
/cairo_data_source {
  CairoDataIndex CairoData length lt
    { CairoData CairoDataIndex get /CairoDataIndex CairoDataIndex 1 add def }
    { () } ifelse
} def
/cairo_flush_ascii85_file { cairo_ascii85_file status { cairo_ascii85_file flushfile } if } def
/cairo_image { image cairo_flush_ascii85_file } def
/cairo_imagemask { imagemask cairo_flush_ascii85_file } def
%%EndProlog
%%BeginSetup
%%EndSetup
%%Page: 1 1
%%BeginPageSetup
%%PageBoundingBox: 6 6 378 382
%%EndPageSetup
q 6 6 372 376 rectclip
1 0 0 -1 0 384 cm q
q
84 258 m 66 258 l 66 246 l 84 246 l 89.117 246 93.715 243.156 96 238.586
 c 96.629 237.316 l 107.363 242.688 l 106.734 243.953 l 102.402 252.617 
93.691 258 84 258 c h
83.82 208.547 m 77.82 184.547 l 66.18 187.453 l 72.18 211.453 l h
107.82 208.547 m 101.82 184.547 l 90.18 187.453 l 96.18 211.453 l h
378 349.477 m 378 378 l 6 378 l 6 349.477 l 6 318.707 26.117 291.863 55.32
 283.066 c 57.059 277.859 l 49.766 273.625 44.34 266.516 42.605 258 c 42
 258 l 28.766 258 18 247.234 18 234 c 18 229.109 19.488 224.566 22.008 220.77
 c 19.457 210.559 l 18.492 206.707 18 202.727 18 198.738 c 18 171.863 39.863
 150 66.738 150 c 101.262 150 l 128.137 150 150 171.863 150 198.738 c 150
 202.727 149.508 206.707 148.543 210.562 c 145.992 220.77 l 148.512 224.566
 150 229.109 150 234 c 150 247.234 139.234 258 126 258 c 125.395 258 l 123.66
 266.516 118.234 273.625 110.945 277.855 c 112.68 283.062 l 141.883 291.863
 162 318.703 162 349.469 c 162 366 l 222 366 l 222 349.477 l 222 328.34 
231.504 309.066 246.91 296.215 c 238.555 284.723 234 270.871 234 256.547
 c 234 216 l 234 179.609 263.609 150 300 150 c 336.391 150 366 179.609 366
 216 c 366 256.547 l 366 270.871 361.445 284.73 353.09 296.215 c 368.496
 309.07 378 328.344 378 349.477 c h
256.754 289.363 m 261.438 286.668 266.477 284.477 271.828 282.91 c 276.055
 274.457 l 265.156 266.867 258 254.262 258 240 c 258 216.973 l 258 203.039
 266.879 190.715 280.105 186.312 c 283.086 185.316 l 285.602 187.199 l 300.594
 198.438 318.227 206.328 336.594 210 c 342 211.086 l 342 240 l 342 254.262
 334.844 266.867 323.941 274.465 c 328.164 282.918 l 333.516 284.484 338.562
 286.676 343.242 289.367 c 350.207 279.883 354 268.402 354 256.547 c 354
 216 l 354 186.223 329.773 162 300 162 c 270.227 162 246 186.223 246 216
 c 246 256.547 l 246 268.402 249.793 279.883 256.754 289.363 c h
330 240 m 330 220.848 l 312.535 216.77 295.793 209.219 281.172 198.828 
c 274.387 202.242 270 209.207 270 216.973 c 270 240 l 270 256.543 283.457
 270 300 270 c 316.543 270 330 256.543 330 240 c h
286.789 279.84 m 282 289.414 l 282 303.168 l 282 304.121 282.113 305.059
 282.18 306 c 317.812 306 l 317.887 305.059 317.992 304.129 317.992 303.168
 c 317.992 289.414 l 313.207 279.84 l 309.055 281.219 304.621 282 300 282
 c 295.379 282 290.945 281.219 286.789 279.84 c h
285.07 318 m 288.102 325.043 293.23 331.066 300 335.152 c 306.77 331.062
 311.898 325.039 314.93 318 c h
127.656 304.031 m 117.289 340.312 l 99.703 326.25 l 96.523 331.02 l 106.523
 366 l 150 366 l 150 349.477 l 150 331.211 141.426 314.633 127.656 304.031
 c h
77.695 318.727 m 81.211 324 l 86.789 324 l 90.305 318.727 l 84 313.688 
l h
73.957 366 m 94.051 366 l 85.477 336 l 82.523 336 l h
109.195 294.602 m 93.793 306.148 l 110.699 319.68 l 117.02 297.582 l 114.516
 296.41 111.906 295.414 109.195 294.602 c h
138 234 m 138 227.383 132.617 222 126 222 c 126 246 l 132.617 246 138 240.617
 138 234 c h
42 246 m 42 222 l 35.383 222 30 227.383 30 234 c 30 240.617 35.383 246 
42 246 c h
62.684 197.371 m 57.328 200.047 54 205.43 54 211.414 c 54 252 l 54 261.926
 62.074 270 72 270 c 96 270 l 105.926 270 114 261.926 114 252 c 114 198 
l 126 198 l 126 210 l 129.492 210 132.785 210.785 135.781 212.129 c 136.902
 207.648 l 137.629 204.742 138 201.742 138 198.738 c 138 178.48 121.52 162
 101.262 162 c 66.738 162 l 46.48 162 30 178.48 30 198.738 c 30 201.742 
30.371 204.742 31.098 207.641 c 32.219 212.129 l 35.215 210.785 38.508 210
 42 210 c 42.098 210 l 42.602 200.023 48.293 191.148 57.312 186.629 c h
68.449 281.641 m 67.062 285.793 l 84 298.5 l 100.938 285.797 l 99.551 281.641
 l 98.375 281.785 97.219 282 96 282 c 72 282 l 70.781 282 69.625 281.785
 68.449 281.641 c h
50.977 297.582 m 57.293 319.68 l 74.203 306.148 l 58.805 294.602 l 56.094
 295.414 53.484 296.41 50.977 297.582 c h
18 366 m 61.477 366 l 71.473 331.02 l 68.293 326.25 l 50.707 340.32 l 40.34
 304.039 l 26.574 314.633 18 331.211 18 349.477 c h
366 349.477 m 366 325.758 351.523 304.902 330 296.281 c 330 303.168 l 330
 322.008 319.531 338.941 302.684 347.363 c 300 348.707 l 297.316 347.363
 l 280.469 338.941 270 322.008 270 303.168 c 270 296.281 l 248.477 304.902
 234 325.758 234 349.477 c 234 366 l 366 366 l h
312 238.586 m 309.715 243.156 305.117 246 300 246 c 282 246 l 282 258 l
 300 258 l 309.691 258 318.402 252.617 322.734 243.949 c 323.363 242.684
 l 312.629 237.312 l h
136.488 57.984 m 120.742 75.695 l 124.078 81.719 126 88.637 126 96 c 126
 119.152 107.16 138 84 138 c 60.84 138 42 119.152 42 96 c 42 72.848 60.84
 54 84 54 c 95.398 54 105.742 58.586 113.32 65.98 c 127.52 50.016 l h
112.008 85.523 m 84.258 116.742 l 61.758 94.242 l 70.242 85.758 l 83.742
 99.258 l 105.336 74.965 l 99.895 69.438 92.348 66 84 66 c 67.457 66 54 
79.457 54 96 c 54 112.543 67.457 126 84 126 c 100.543 126 114 112.543 114
 96 c 114 92.305 113.238 88.793 112.008 85.523 c h
340.488 9.984 m 324.742 27.695 l 328.078 33.719 330 40.637 330 48 c 330
 71.152 311.16 90 288 90 c 264.84 90 246 71.152 246 48 c 246 24.848 264.84
 6 288 6 c 299.398 6 309.742 10.586 317.32 17.98 c 331.52 2.016 l h
316.008 37.523 m 288.258 68.742 l 265.758 46.242 l 274.242 37.758 l 287.742
 51.258 l 309.336 26.965 l 303.895 21.438 296.348 18 288 18 c 271.457 18
 258 31.457 258 48 c 258 64.543 271.457 78 288 78 c 304.543 78 318 64.543
 318 48 c 318 44.305 317.238 40.793 316.008 37.523 c h
234 54 m 234 42 l 186 42 l 186 90 l 138 90 l 138 102 l 186 102 l 186 282
 l 150 282 l 150 294 l 198 294 l 198 174 l 234 174 l 234 162 l 198 162 l
 198 54 l h
234 54 m W n
[6 0 0 6 0 0] concat
/CairoFunction
   << /FunctionType 2
      /Domain [ 0 1 ]
      /C0 [ 0.623529 0.184314 1 ]
      /C1 [ 0.0431373 0.694118 0.827451 ]
      /N 1
   >>
def
   << /ShadingType 2
      /ColorSpace /DeviceRGB
      /Coords [ 32 63 32 0.336 ]
      /Extend [ true true ]
      /Function CairoFunction
   >>
shfill
Q
Q Q
showpage
%%Trailer
end
%%EOF
