%!PS-Adobe-3.0 EPSF-3.0
%%Creator: cairo 1.16.0 (https://cairographics.org)
%%CreationDate: Mon May  4 07:13:12 2020
%%Pages: 1
%%DocumentData: Clean7Bit
%%LanguageLevel: 3
%%BoundingBox: 6 6 378 378
%%EndComments
%%BeginProlog
50 dict begin
/q { gsave } bind def
/Q { grestore } bind def
/cm { 6 array astore concat } bind def
/w { setlinewidth } bind def
/J { setlinecap } bind def
/j { setlinejoin } bind def
/M { setmiterlimit } bind def
/d { setdash } bind def
/m { moveto } bind def
/l { lineto } bind def
/c { curveto } bind def
/h { closepath } bind def
/re { exch dup neg 3 1 roll 5 3 roll moveto 0 rlineto
      0 exch rlineto 0 rlineto closepath } bind def
/S { stroke } bind def
/f { fill } bind def
/f* { eofill } bind def
/n { newpath } bind def
/W { clip } bind def
/W* { eoclip } bind def
/BT { } bind def
/ET { } bind def
/BDC { mark 3 1 roll /BDC pdfmark } bind def
/EMC { mark /EMC pdfmark } bind def
/cairo_store_point { /cairo_point_y exch def /cairo_point_x exch def } def
/Tj { show currentpoint cairo_store_point } bind def
/TJ {
  {
    dup
    type /stringtype eq
    { show } { -0.001 mul 0 cairo_font_matrix dtransform rmoveto } ifelse
  } forall
  currentpoint cairo_store_point
} bind def
/cairo_selectfont { cairo_font_matrix aload pop pop pop 0 0 6 array astore
    cairo_font exch selectfont cairo_point_x cairo_point_y moveto } bind def
/Tf { pop /cairo_font exch def /cairo_font_matrix where
      { pop cairo_selectfont } if } bind def
/Td { matrix translate cairo_font_matrix matrix concatmatrix dup
      /cairo_font_matrix exch def dup 4 get exch 5 get cairo_store_point
      /cairo_font where { pop cairo_selectfont } if } bind def
/Tm { 2 copy 8 2 roll 6 array astore /cairo_font_matrix exch def
      cairo_store_point /cairo_font where { pop cairo_selectfont } if } bind def
/g { setgray } bind def
/rg { setrgbcolor } bind def
/d1 { setcachedevice } bind def
/cairo_data_source {
  CairoDataIndex CairoData length lt
    { CairoData CairoDataIndex get /CairoDataIndex CairoDataIndex 1 add def }
    { () } ifelse
} def
/cairo_flush_ascii85_file { cairo_ascii85_file status { cairo_ascii85_file flushfile } if } def
/cairo_image { image cairo_flush_ascii85_file } def
/cairo_imagemask { imagemask cairo_flush_ascii85_file } def
%%EndProlog
%%BeginSetup
%%EndSetup
%%Page: 1 1
%%BeginPageSetup
%%PageBoundingBox: 6 6 378 378
%%EndPageSetup
q 6 6 372 372 rectclip
1 0 0 -1 0 384 cm q
q
210 240 m 210 237.629 209.516 235.379 208.68 233.309 c 216.328 231.227 
222 224.297 222 216 c 222 211.375 220.195 207.191 217.32 204 c 220.199 200.809
 222 196.625 222 192 c 222 187.375 220.195 183.191 217.32 180 c 220.199 
176.809 222 172.625 222 168 c 222 158.082 213.93 150 204.008 150 c 174 150
 l 167.383 150 162 144.617 162 138 c 162 108 l 162 106.848 161.785 105.758
 161.656 104.641 c 170.316 110.539 180.758 114 192 114 c 221.777 114 246
 89.773 246 60 c 246 30.227 221.777 6 192 6 c 162.223 6 138 30.227 138 60
 c 138 66.988 139.379 73.648 141.805 79.789 c 138.715 78.707 135.449 78 
132 78 c 122.074 78 114 86.082 114 96 c 114 110.832 l 114 121.789 108.16
 132.098 98.766 137.734 c 89.891 143.062 83.203 151.402 79.938 161.215 c
 79.801 161.633 l 6 155.484 l 6 258 l 192 258 l 201.926 258 210 249.926 
210 240 c h
192 18 m 215.152 18 234 36.84 234 60 c 234 83.16 215.152 102 192 102 c 
168.848 102 150 83.16 150 60 c 150 36.84 168.848 18 192 18 c h
78 246 m 18 246 l 18 168.523 l 78 173.52 l h
90 168.973 m 91.324 165.012 l 93.691 157.914 98.52 151.883 104.945 148.031
 c 117.938 140.238 126.008 125.98 126.008 110.84 c 126.008 96.008 l 126.008
 92.699 128.699 90.008 132.008 90.008 c 141.93 90.008 150.008 98.082 150.008
 108.008 c 150.008 138.008 l 150.008 151.242 160.77 162.008 174.008 162.008
 c 204.012 162.008 l 207.312 162 210 164.695 210 168 c 210 171.305 207.312
 174 204 174 c 162 174 l 162 186 l 204 186 l 207.312 186 210 188.695 210
 192 c 210 195.305 207.312 198 204 198 c 162 198 l 162 210 l 204 210 l 207.312
 210 210 212.695 210 216 c 210 219.305 207.312 222 204 222 c 162 222 l 162
 234 l 192 234 l 195.312 234 198 236.688 198 240 c 198 243.312 195.312 246
 192 246 c 90 246 l h
192 270 m 162.223 270 138 294.227 138 324 c 138 353.773 162.223 378 192
 378 c 221.777 378 246 353.773 246 324 c 246 294.227 221.777 270 192 270
 c h
169.062 359.141 m 172.055 349.176 181.332 342 192 342 c 202.668 342 211.945
 349.176 214.938 359.141 c 208.332 363.461 200.461 366 192 366 c 183.539
 366 175.668 363.461 169.062 359.141 c h
180 318 m 180 311.383 185.383 306 192 306 c 198.617 306 204 311.383 204
 318 c 204 324.617 198.617 330 192 330 c 185.383 330 180 324.617 180 318
 c h
224.418 350.672 m 221.152 343.824 215.855 338.203 209.285 334.566 c 213.426
 330.258 216 324.434 216 318 c 216 304.766 205.234 294 192 294 c 178.766
 294 168 304.766 168 318 c 168 324.434 170.574 330.258 174.715 334.57 c 
168.145 338.207 162.852 343.824 159.582 350.676 c 153.602 343.41 150 334.117
 150 324 c 150 300.84 168.848 282 192 282 c 215.152 282 234 300.84 234 324
 c 234 334.117 230.398 343.41 224.418 350.672 c h
324 138 m 294.223 138 270 162.227 270 192 c 270 221.773 294.223 246 324
 246 c 353.777 246 378 221.773 378 192 c 378 162.227 353.777 138 324 138
 c h
324 234 m 300.848 234 282 215.16 282 192 c 282 168.84 300.848 150 324 150
 c 347.152 150 366 168.84 366 192 c 366 215.16 347.152 234 324 234 c h
342 174 m 354 174 l 354 210 l 294 210 l 294 186 l 306 186 l 306 198 l 318
 198 l 318 162 l 330 162 l 330 198 l 342 198 l h
198 66 m 186 66 l 186 54 l 198 54 l h
222 66 m 210 66 l 210 54 l 222 54 l h
174 66 m 162 66 l 162 54 l 174 54 l h
255.457 56.039 m 260.543 45.168 l 285.918 57.035 305.398 72.395 320.902
 92.914 c 324.121 76.816 l 335.887 79.176 l 326.934 123.961 l 318.918 111.188
 l 303.496 86.605 283.332 69.078 255.457 56.039 c h
92.914 63.102 m 76.824 59.879 l 79.184 48.113 l 123.961 57.07 l 111.191
 65.082 l 86.598 80.508 69.07 100.676 56.051 128.539 c 45.176 123.457 l 
57.035 98.09 72.391 78.613 92.914 63.102 c h
65.09 272.812 m 80.504 297.402 100.676 314.922 128.543 327.961 c 123.457
 338.832 l 98.082 326.965 78.602 311.605 63.098 291.086 c 59.879 307.176
 l 48.121 304.824 l 57.07 260.039 l h
291.086 320.898 m 307.184 324.121 l 304.824 335.887 l 260.047 326.93 l 
272.812 318.918 l 297.406 303.492 314.934 283.324 327.953 255.461 c 338.832
 260.543 l 326.965 285.91 311.609 305.387 291.086 320.898 c h
291.086 320.898 m W n
[6 0 0 6 0 0] concat
/CairoFunction
   << /FunctionType 2
      /Domain [ 0 1 ]
      /C0 [ 0.623529 0.184314 1 ]
      /C1 [ 0.0431373 0.694118 0.827451 ]
      /N 1
   >>
def
   << /ShadingType 2
      /ColorSpace /DeviceRGB
      /Coords [ 32 63 32 1 ]
      /Extend [ true true ]
      /Function CairoFunction
   >>
shfill
Q
Q Q
showpage
%%Trailer
end
%%EOF
