%!PS-Adobe-3.0 EPSF-3.0
%%Creator: cairo 1.16.0 (https://cairographics.org)
%%CreationDate: Mon May  4 07:13:11 2020
%%Pages: 1
%%DocumentData: Clean7Bit
%%LanguageLevel: 3
%%BoundingBox: 6 6 378 378
%%EndComments
%%BeginProlog
50 dict begin
/q { gsave } bind def
/Q { grestore } bind def
/cm { 6 array astore concat } bind def
/w { setlinewidth } bind def
/J { setlinecap } bind def
/j { setlinejoin } bind def
/M { setmiterlimit } bind def
/d { setdash } bind def
/m { moveto } bind def
/l { lineto } bind def
/c { curveto } bind def
/h { closepath } bind def
/re { exch dup neg 3 1 roll 5 3 roll moveto 0 rlineto
      0 exch rlineto 0 rlineto closepath } bind def
/S { stroke } bind def
/f { fill } bind def
/f* { eofill } bind def
/n { newpath } bind def
/W { clip } bind def
/W* { eoclip } bind def
/BT { } bind def
/ET { } bind def
/BDC { mark 3 1 roll /BDC pdfmark } bind def
/EMC { mark /EMC pdfmark } bind def
/cairo_store_point { /cairo_point_y exch def /cairo_point_x exch def } def
/Tj { show currentpoint cairo_store_point } bind def
/TJ {
  {
    dup
    type /stringtype eq
    { show } { -0.001 mul 0 cairo_font_matrix dtransform rmoveto } ifelse
  } forall
  currentpoint cairo_store_point
} bind def
/cairo_selectfont { cairo_font_matrix aload pop pop pop 0 0 6 array astore
    cairo_font exch selectfont cairo_point_x cairo_point_y moveto } bind def
/Tf { pop /cairo_font exch def /cairo_font_matrix where
      { pop cairo_selectfont } if } bind def
/Td { matrix translate cairo_font_matrix matrix concatmatrix dup
      /cairo_font_matrix exch def dup 4 get exch 5 get cairo_store_point
      /cairo_font where { pop cairo_selectfont } if } bind def
/Tm { 2 copy 8 2 roll 6 array astore /cairo_font_matrix exch def
      cairo_store_point /cairo_font where { pop cairo_selectfont } if } bind def
/g { setgray } bind def
/rg { setrgbcolor } bind def
/d1 { setcachedevice } bind def
/cairo_data_source {
  CairoDataIndex CairoData length lt
    { CairoData CairoDataIndex get /CairoDataIndex CairoDataIndex 1 add def }
    { () } ifelse
} def
/cairo_flush_ascii85_file { cairo_ascii85_file status { cairo_ascii85_file flushfile } if } def
/cairo_image { image cairo_flush_ascii85_file } def
/cairo_imagemask { imagemask cairo_flush_ascii85_file } def
%%EndProlog
%%BeginSetup
%%EndSetup
%%Page: 1 1
%%BeginPageSetup
%%PageBoundingBox: 6 6 378 378
%%EndPageSetup
q 6 6 372 372 rectclip
1 0 0 -1 0 384 cm q
q
120 210 m 169.625 210 210 169.625 210 120 c 210 70.375 169.625 30 120 30
 c 70.375 30 30 70.375 30 120 c 30 169.625 70.375 210 120 210 c h
120 42 m 163.008 42 198 76.992 198 120 c 198 163.008 163.008 198 120 198
 c 76.992 198 42 163.008 42 120 c 42 76.992 76.992 42 120 42 c h
82.121 227.395 m 79.949 229.566 l 70.957 238.566 66 250.523 66 263.242 
c 66 268.379 66.828 273.449 68.449 278.309 c 83.875 324.605 l 77.203 378
 l 150.797 378 l 144.316 326.164 l 149.18 321.305 l 157.445 313.039 162 
302.047 162 290.352 c 162 288.539 161.879 286.727 161.656 284.922 c 158.262
 257.773 l 167.113 256.645 174 249.148 174 240 c 174 233.449 170.441 227.762
 165.199 224.609 c 176.617 219.66 187.004 212.832 196.129 204.613 c 220.352
 228.836 l 206.477 244.676 198 265.344 198 288 c 198 337.625 238.375 378
 288 378 c 337.625 378 378 337.625 378 288 c 378 238.375 337.625 198 288
 198 c 265.344 198 244.676 206.477 228.836 220.352 c 204.613 196.129 l 221.555
 177.316 232.285 152.902 233.695 126 c 306 126 l 306 114 l 233.695 114 l
 230.543 53.934 180.836 6 120 6 c 57.137 6 6 57.137 6 120 c 6 169.566 37.855
 211.727 82.121 227.395 c h
120 234 m 126.137 234 132.121 233.375 138 232.434 c 138 234.203 l 131.34
 235.184 125.801 240.043 124.129 246.738 c 115.902 279.637 l 115.301 282.043
 111.66 282.664 110.281 280.609 c 108.043 277.246 l 104.094 271.32 102 264.414
 102 257.281 c 102 232.434 l 107.879 233.375 113.863 234 120 234 c h
90.797 366 m 95.297 330 l 132.707 330 l 137.207 366 l h
140.695 312.82 m 135.516 318 l 94.324 318 l 79.828 274.508 l 78.617 270.875
 78 267.086 78 263.242 c 78 253.727 81.707 244.781 88.434 238.051 c 90 236.484
 l 90 257.281 l 90 266.789 92.789 275.992 98.062 283.906 c 100.301 287.27
 l 103.117 291.484 107.82 294 112.879 294 c 119.832 294 125.863 289.289 
127.543 282.547 c 135.762 249.652 l 136.309 247.5 138.234 246 140.449 246
 c 142.871 246 144.93 247.812 145.23 250.223 c 149.754 286.41 l 149.914 
287.719 150 289.031 150 290.352 c 150 298.844 146.695 306.82 140.695 312.82
 c h
156.512 245.898 m 155.387 242.238 153.043 239.172 150 237.055 c 150 234
 l 156 234 l 159.312 234 162 236.695 162 240 c 162 243.125 159.57 245.621
 156.512 245.898 c h
338.777 305.262 m 339.516 306 l 341.125 307.602 342 309.73 342 312 c 342
 314.27 341.125 316.398 339.516 318 c 336 321.512 l 334.086 323.426 332.598
 325.656 331.586 328.086 c 325.414 323.609 318.316 320.348 310.566 318.715
 c 308.621 312.895 l 314.285 308.504 318 301.711 318 294 c 318 274.164 l
 318 265.324 311.676 257.863 302.957 256.41 c 294.738 255.035 l 287.359 
253.812 282 247.488 282 240 c 282 234.48 l 283.969 234.199 285.961 234 288
 234 c 311.152 234 330 252.84 330 276 c 330 284.059 l 330 292.066 333.125
 299.605 338.777 305.262 c h
281.25 262.086 m 284.566 264.484 288.473 266.164 292.77 266.879 c 300.988
 268.254 l 303.887 268.734 306 271.223 306 274.164 c 306 294 l 306 300.617
 300.617 306 294 306 c 282 306 l 275.383 306 270 300.617 270 294 c 270 271.414
 l 270 269.129 271.273 267.07 273.316 266.051 c h
282 318 m 294 318 l 295.219 318 296.387 317.812 297.559 317.641 c 300 324.965
 l 300 328.543 l 300 333.145 299.383 337.645 298.297 342 c 277.703 342 l
 276.617 337.645 276 333.145 276 328.543 c 276 324.973 l 278.449 317.633
 l 279.613 317.812 280.781 318 282 318 c h
293.809 354 m 292.176 357.145 290.23 360.137 288 362.953 c 285.762 360.137
 283.816 357.148 282.191 354 c h
311.855 331.445 m 321.715 334.43 330.148 340.855 335.605 349.648 c 325.789
 357.246 314.137 362.543 301.414 364.766 c 307.766 354.84 311.352 343.43
 311.855 331.445 c h
273.125 252.727 m 267.949 255.316 l 261.816 258.383 258 264.551 258 271.414
 c 258 294 l 258 301.711 261.715 308.504 267.379 312.898 c 265.445 318.695
 l 257.73 320.281 250.609 323.543 244.402 328.066 c 243.391 325.648 241.906
 323.426 240 321.516 c 236.484 318 l 234.875 316.398 234 314.27 234 312 
c 234 309.73 234.875 307.602 236.496 305.992 c 237.211 305.273 l 242.875
 299.609 246 292.074 246 284.062 c 246 276 l 246 259.289 255.836 244.867
 270 238.109 c 270 240 l 270 244.578 271.121 248.914 273.125 252.727 c h
264.145 331.5 m 264.66 343.465 268.246 354.852 274.586 364.766 c 261.863
 362.543 250.211 357.254 240.395 349.648 c 245.801 340.934 254.172 334.543
 264.145 331.5 c h
288 210 m 331.008 210 366 244.992 366 288 c 366 308.73 357.82 327.539 344.586
 341.527 c 343.902 340.52 343.219 339.512 342.473 338.555 c 342.215 337.727
 342 336.875 342 336 c 342 333.73 342.875 331.602 344.484 330 c 348 326.488
 l 351.871 322.621 354 317.477 354 312 c 354 306.523 351.871 301.379 348.012
 297.523 c 347.273 296.785 l 343.922 293.438 342 288.797 342 284.059 c 342
 276 l 342 246.227 317.777 222 288 222 c 258.223 222 234 246.227 234 276
 c 234 284.059 l 234 288.797 232.078 293.438 228.715 296.797 c 228 297.512
 l 224.129 301.379 222 306.523 222 312 c 222 317.477 224.129 322.621 228
 326.484 c 231.516 330 l 233.125 331.602 234 333.73 234 336 c 234 336.883
 233.785 337.727 233.52 338.562 c 232.777 339.516 232.094 340.52 231.406
 341.527 c 218.18 327.539 210 308.73 210 288 c 210 244.992 244.992 210 288
 210 c h
120 18 m 176.242 18 222 63.758 222 120 c 222 176.242 176.242 222 120 222
 c 63.758 222 18 176.242 18 120 c 18 63.758 63.758 18 120 18 c h
120 138 m 129.926 138 138 129.926 138 120 c 138 110.074 129.926 102 120
 102 c 110.074 102 102 110.074 102 120 c 102 129.926 110.074 138 120 138
 c h
120 114 m 123.312 114 126 116.695 126 120 c 126 123.305 123.312 126 120
 126 c 116.688 126 114 123.305 114 120 c 114 116.695 116.688 114 120 114
 c h
90 120 m 90 110.074 81.926 102 72 102 c 62.074 102 54 110.074 54 120 c 
54 129.926 62.074 138 72 138 c 81.926 138 90 129.926 90 120 c h
66 120 m 66 116.695 68.688 114 72 114 c 75.312 114 78 116.695 78 120 c 
78 123.305 75.312 126 72 126 c 68.688 126 66 123.305 66 120 c h
168 138 m 177.926 138 186 129.926 186 120 c 186 110.074 177.926 102 168
 102 c 158.074 102 150 110.074 150 120 c 150 129.926 158.074 138 168 138
 c h
168 114 m 171.312 114 174 116.695 174 120 c 174 123.305 171.312 126 168
 126 c 164.688 126 162 123.305 162 120 c 162 116.695 164.688 114 168 114
 c h
330 102 m 318 102 l 318 96 l 318 79.457 331.457 66 348 66 c 364.543 66 
378 79.457 378 96 c 378 110.488 367.676 122.609 354 125.395 c 354 144 l 
342 144 l 342 114 l 348 114 l 357.926 114 366 105.926 366 96 c 366 86.074
 357.926 78 348 78 c 338.074 78 330 86.074 330 96 c h
342 156 m 354 156 l 354 168 l 342 168 l h
342 156 m W n
[6 0 0 6 0 0] concat
/CairoFunction
   << /FunctionType 2
      /Domain [ 0 1 ]
      /C0 [ 0.623529 0.184314 1 ]
      /C1 [ 0.0431373 0.694118 0.827451 ]
      /N 1
   >>
def
   << /ShadingType 2
      /ColorSpace /DeviceRGB
      /Coords [ 32 63 32 1 ]
      /Extend [ true true ]
      /Function CairoFunction
   >>
shfill
Q
Q Q
showpage
%%Trailer
end
%%EOF
