%!PS-Adobe-3.0 EPSF-3.0
%%Creator: cairo 1.16.0 (https://cairographics.org)
%%CreationDate: Mon May  4 07:13:33 2020
%%Pages: 1
%%DocumentData: Clean7Bit
%%LanguageLevel: 3
%%BoundingBox: 6 6 378 378
%%EndComments
%%BeginProlog
50 dict begin
/q { gsave } bind def
/Q { grestore } bind def
/cm { 6 array astore concat } bind def
/w { setlinewidth } bind def
/J { setlinecap } bind def
/j { setlinejoin } bind def
/M { setmiterlimit } bind def
/d { setdash } bind def
/m { moveto } bind def
/l { lineto } bind def
/c { curveto } bind def
/h { closepath } bind def
/re { exch dup neg 3 1 roll 5 3 roll moveto 0 rlineto
      0 exch rlineto 0 rlineto closepath } bind def
/S { stroke } bind def
/f { fill } bind def
/f* { eofill } bind def
/n { newpath } bind def
/W { clip } bind def
/W* { eoclip } bind def
/BT { } bind def
/ET { } bind def
/BDC { mark 3 1 roll /BDC pdfmark } bind def
/EMC { mark /EMC pdfmark } bind def
/cairo_store_point { /cairo_point_y exch def /cairo_point_x exch def } def
/Tj { show currentpoint cairo_store_point } bind def
/TJ {
  {
    dup
    type /stringtype eq
    { show } { -0.001 mul 0 cairo_font_matrix dtransform rmoveto } ifelse
  } forall
  currentpoint cairo_store_point
} bind def
/cairo_selectfont { cairo_font_matrix aload pop pop pop 0 0 6 array astore
    cairo_font exch selectfont cairo_point_x cairo_point_y moveto } bind def
/Tf { pop /cairo_font exch def /cairo_font_matrix where
      { pop cairo_selectfont } if } bind def
/Td { matrix translate cairo_font_matrix matrix concatmatrix dup
      /cairo_font_matrix exch def dup 4 get exch 5 get cairo_store_point
      /cairo_font where { pop cairo_selectfont } if } bind def
/Tm { 2 copy 8 2 roll 6 array astore /cairo_font_matrix exch def
      cairo_store_point /cairo_font where { pop cairo_selectfont } if } bind def
/g { setgray } bind def
/rg { setrgbcolor } bind def
/d1 { setcachedevice } bind def
/cairo_data_source {
  CairoDataIndex CairoData length lt
    { CairoData CairoDataIndex get /CairoDataIndex CairoDataIndex 1 add def }
    { () } ifelse
} def
/cairo_flush_ascii85_file { cairo_ascii85_file status { cairo_ascii85_file flushfile } if } def
/cairo_image { image cairo_flush_ascii85_file } def
/cairo_imagemask { imagemask cairo_flush_ascii85_file } def
%%EndProlog
%%BeginSetup
%%EndSetup
%%Page: 1 1
%%BeginPageSetup
%%PageBoundingBox: 6 6 378 378
%%EndPageSetup
q 6 6 372 372 rectclip
1 0 0 -1 0 384 cm q
q
78 96 m 78 99.312 75.312 102 72 102 c 68.688 102 66 99.312 66 96 c 66 92.688
 68.688 90 72 90 c 75.312 90 78 92.688 78 96 c h
120 102 m 123.312 102 126 99.312 126 96 c 126 92.688 123.312 90 120 90 
c 116.688 90 114 92.688 114 96 c 114 99.312 116.688 102 120 102 c h
126 126 m 114 126 l 114 132.617 108.617 138 102 138 c 78 138 l 78 150 l
 102 150 l 115.234 150 126 139.234 126 126 c h
378 246 m 378 366 l 378 372.617 372.617 378 366 378 c 186 378 l 179.383
 378 174 372.617 174 366 c 174 324 l 174 338.484 163.676 350.605 150 353.395
 c 150 378 l 42 378 l 42 353.395 l 28.324 350.605 18 338.484 18 324 c 18
 318 l 6 318 l 6 242.27 l 6 213.77 26.285 189.023 54.234 183.434 c 67.105
 180.859 l 69.48 171.355 l 55.277 166.098 44.699 153.395 42.48 137.992 c
 42 137.992 l 28.766 137.992 18 127.23 18 113.992 c 18 108.895 19.621 104.184
 22.344 100.297 c 18.852 82.848 l 18.289 80.016 18 77.125 18 74.25 c 18 
59.699 25.156 46.188 37.164 38.016 c 45.77 18.504 64.855 6 86.309 6 c 107.945
 6 l 138.102 6 163.547 26.336 171.426 54 c 234.48 54 l 237.406 33.684 254.887
 18 276 18 c 287.516 18 297.953 22.66 305.551 30.199 c 325.535 7.984 l 334.453
 16.016 l 312.898 39.965 l 316.152 45.926 318 52.754 318 60 c 318 81.113
 302.316 98.594 282 101.52 c 282 126.48 l 291.113 127.793 299.305 132 305.551
 138.199 c 325.535 115.984 l 334.453 124.016 l 312.895 147.965 l 316.152
 153.926 318 160.754 318 168 c 318 189.113 302.316 206.594 282 209.52 c 
282 234 l 366 234 l 372.617 234 378 239.383 378 246 c h
150 240 m 150 306 l 174 306 l 174 242.27 l 174 220.922 159.762 202.207 
139.59 196.234 c 121.637 232.129 l 112.523 223.016 l 108.457 229.117 l 126.637
 301.836 l 110.484 318 l 138 318 l 138 240 l h
106.129 199.645 m 118.355 211.871 l 127.48 193.621 l 120.84 192.293 l h
96 206.484 m 88.121 214.363 l 93.211 222 l 98.789 222 l 103.879 214.363
 l h
78.641 298.156 m 96 315.516 l 113.359 298.156 l 97.312 234 l 94.68 234 
l h
358.152 246 m 193.848 246 l 270.277 327.523 l 273.227 330.672 278.777 330.664
 281.719 327.527 c h
186 357.516 m 235.523 307.992 l 186 255.168 l h
194.484 366 m 357.516 366 l 308.27 316.754 l 290.477 335.723 l 286.754 
339.707 281.473 342 276 342 c 270.527 342 265.246 339.707 261.516 335.719
 c 243.73 316.754 l h
366 357.516 m 366 255.168 l 316.477 307.992 l h
276 138 m 259.457 138 246 151.457 246 168 c 246 184.543 259.457 198 276
 198 c 292.543 198 306 184.543 306 168 c 306 164.387 305.258 160.973 304.086
 157.766 c 276.234 188.711 l 253.766 166.242 l 262.246 157.758 l 275.777
 171.289 l 297.496 147.148 l 292.039 141.527 284.438 138 276 138 c h
246 60 m 246 76.543 259.457 90 276 90 c 292.543 90 306 76.543 306 60 c 
306 56.387 305.258 52.973 304.086 49.766 c 276.234 80.711 l 253.766 58.242
 l 262.246 49.758 l 275.777 63.289 l 297.496 39.148 l 292.039 33.527 284.438
 30 276 30 c 259.457 30 246 43.457 246 60 c h
173.695 66 m 173.875 67.996 174 70.008 174 72.055 c 174 76.387 173.566 
80.734 172.715 85.004 c 169.656 100.297 l 172.375 104.191 174 108.898 174
 114 c 174 127.234 163.234 138 150 138 c 149.52 138 l 147.301 153.402 136.723
 166.098 122.52 171.359 c 124.895 180.863 l 137.766 183.438 l 162.977 188.484
 181.949 209.105 185.426 234.02 c 185.621 234.008 185.809 234 186 234 c 
270 234 l 270 209.52 l 249.684 206.594 234 189.113 234 168 c 234 146.887
 249.684 129.406 270 126.48 c 270 101.52 l 251.645 98.875 237.125 84.355
 234.48 66 c h
150 126 m 156.617 126 162 120.617 162 114 c 162 107.383 156.617 102 150
 102 c h
30 74.25 m 30 76.344 30.203 78.445 30.617 80.504 c 32.887 91.824 l 35.699
 90.66 38.773 90 42 90 c 42 73.816 l 42 62.887 50.887 54 61.816 54 c 65.742
 54 69.547 55.145 72.809 57.328 c 81.324 63 91.223 66 101.449 66 c 115.387
 66 l 130.77 66 143.824 76.094 148.32 90 c 150 90 l 153.227 90 156.301 90.66
 159.113 91.816 c 160.949 82.648 l 161.645 79.156 162 75.594 162 72.055 
c 162 42.246 137.754 18 107.945 18 c 86.309 18 l 69.156 18 53.945 28.297
 47.574 44.227 c 46.879 45.953 l 44.184 47.754 l 35.305 53.676 30 63.582
 30 74.25 c h
42 126 m 42 102 l 35.383 102 30 107.383 30 114 c 30 120.617 35.383 126 
42 126 c h
84 162 m 108 162 l 124.543 162 138 148.543 138 132 c 138 100.613 l 138 
88.141 127.859 78 115.387 78 c 101.449 78 l 88.844 78 76.637 74.305 66.148
 67.312 c 64.867 66.449 63.367 66 61.816 66 c 57.504 66 54 69.504 54 73.816
 c 54 132 l 54 148.543 67.457 162 84 162 c h
81.215 173.863 m 78.984 182.789 l 96 191.293 l 113.016 182.785 l 110.785
 173.855 l 109.859 173.922 108.938 174 108 174 c 84 174 l 83.062 174 82.141
 173.922 81.215 173.863 c h
64.512 193.613 m 73.637 211.867 l 85.867 199.637 l 71.152 192.281 l h
18 306 m 42 306 l 42 240 l 54 240 l 54 318 l 81.516 318 l 65.359 301.844
 l 83.539 229.121 l 79.469 223.02 l 70.355 232.133 l 52.402 196.242 l 32.238
 202.207 18 220.914 18 242.27 c h
42 340.895 m 42 318 l 30 318 l 30 324 l 30 331.812 35.035 338.41 42 340.895
 c h
138 366 m 138 330 l 54 330 l 54 366 l 90 366 l 90 342 l 102 342 l 102 366
 l h
162 324 m 162 318 l 150 318 l 150 340.895 l 156.965 338.41 162 331.812 
162 324 c h
162 324 m W n
[6 0 0 6 0 0] concat
/CairoFunction
   << /FunctionType 2
      /Domain [ 0 1 ]
      /C0 [ 0.623529 0.184314 1 ]
      /C1 [ 0.0431373 0.694118 0.827451 ]
      /N 1
   >>
def
   << /ShadingType 2
      /ColorSpace /DeviceRGB
      /Coords [ 32 63 32 1 ]
      /Extend [ true true ]
      /Function CairoFunction
   >>
shfill
Q
Q Q
showpage
%%Trailer
end
%%EOF
