%!PS-Adobe-3.0 EPSF-3.0
%%Creator: cairo 1.16.0 (https://cairographics.org)
%%CreationDate: Mon May  4 07:13:09 2020
%%Pages: 1
%%DocumentData: Clean7Bit
%%LanguageLevel: 3
%%BoundingBox: 6 6 378 378
%%EndComments
%%BeginProlog
50 dict begin
/q { gsave } bind def
/Q { grestore } bind def
/cm { 6 array astore concat } bind def
/w { setlinewidth } bind def
/J { setlinecap } bind def
/j { setlinejoin } bind def
/M { setmiterlimit } bind def
/d { setdash } bind def
/m { moveto } bind def
/l { lineto } bind def
/c { curveto } bind def
/h { closepath } bind def
/re { exch dup neg 3 1 roll 5 3 roll moveto 0 rlineto
      0 exch rlineto 0 rlineto closepath } bind def
/S { stroke } bind def
/f { fill } bind def
/f* { eofill } bind def
/n { newpath } bind def
/W { clip } bind def
/W* { eoclip } bind def
/BT { } bind def
/ET { } bind def
/BDC { mark 3 1 roll /BDC pdfmark } bind def
/EMC { mark /EMC pdfmark } bind def
/cairo_store_point { /cairo_point_y exch def /cairo_point_x exch def } def
/Tj { show currentpoint cairo_store_point } bind def
/TJ {
  {
    dup
    type /stringtype eq
    { show } { -0.001 mul 0 cairo_font_matrix dtransform rmoveto } ifelse
  } forall
  currentpoint cairo_store_point
} bind def
/cairo_selectfont { cairo_font_matrix aload pop pop pop 0 0 6 array astore
    cairo_font exch selectfont cairo_point_x cairo_point_y moveto } bind def
/Tf { pop /cairo_font exch def /cairo_font_matrix where
      { pop cairo_selectfont } if } bind def
/Td { matrix translate cairo_font_matrix matrix concatmatrix dup
      /cairo_font_matrix exch def dup 4 get exch 5 get cairo_store_point
      /cairo_font where { pop cairo_selectfont } if } bind def
/Tm { 2 copy 8 2 roll 6 array astore /cairo_font_matrix exch def
      cairo_store_point /cairo_font where { pop cairo_selectfont } if } bind def
/g { setgray } bind def
/rg { setrgbcolor } bind def
/d1 { setcachedevice } bind def
/cairo_data_source {
  CairoDataIndex CairoData length lt
    { CairoData CairoDataIndex get /CairoDataIndex CairoDataIndex 1 add def }
    { () } ifelse
} def
/cairo_flush_ascii85_file { cairo_ascii85_file status { cairo_ascii85_file flushfile } if } def
/cairo_image { image cairo_flush_ascii85_file } def
/cairo_imagemask { imagemask cairo_flush_ascii85_file } def
%%EndProlog
%%BeginSetup
%%EndSetup
%%Page: 1 1
%%BeginPageSetup
%%PageBoundingBox: 6 6 378 378
%%EndPageSetup
q 6 6 372 372 rectclip
1 0 0 -1 0 384 cm q
q
66 96 m 66 92.688 68.688 90 72 90 c 75.312 90 78 92.688 78 96 c 78 99.312
 75.312 102 72 102 c 68.688 102 66 99.312 66 96 c h
120 102 m 123.312 102 126 99.312 126 96 c 126 92.688 123.312 90 120 90 
c 116.688 90 114 92.688 114 96 c 114 99.312 116.688 102 120 102 c h
78 150 m 102 150 l 115.234 150 126 139.234 126 126 c 114 126 l 114 132.617
 108.617 138 102 138 c 78 138 l h
378 336 m 378 378 l 6 378 l 6 132 l 6 124.145 11.082 117.527 18.109 115.074
 c 18.09 114.707 18 114.367 18 114 c 18 108.906 19.621 104.195 22.344 100.301
 c 18.852 82.848 l 18.289 80.027 18 77.137 18 74.25 c 18 59.699 25.156 46.188
 37.172 38.012 c 45.77 18.496 64.855 6 86.309 6 c 107.945 6 l 144.371 6 
174 35.629 174 72.055 c 174 76.402 173.566 80.762 172.715 85.008 c 169.656
 100.301 l 172.379 104.195 174 108.906 174 114 c 174 114.367 173.91 114.707
 173.891 115.074 c 180.918 117.527 186 124.145 186 132 c 186 162 l 234.66
 162 l 242.238 154.59 252.59 150 264 150 c 271.105 150 l 270.434 148.117
 270 146.113 270 144 c 270 134.074 278.074 126 288 126 c 294 126 l 294 138
 l 288 138 l 284.695 138 282 140.695 282 144 c 282 147.305 284.695 150 288
 150 c 297.926 150 306 141.926 306 132 c 306 122.074 297.926 114 288 114
 c 198 114 l 198 102 l 288 102 l 304.543 102 318 115.457 318 132 c 318 138.781
 315.652 144.973 311.844 150 c 330 150 l 336.617 150 342 155.383 342 162
 c 342 226.051 l 342 249.863 327.703 271.074 306 280.141 c 306 294 l 309.168
 294 l 326.711 294 342.504 303.148 351.414 318 c 360 318 l 369.926 318 378
 326.074 378 336 c h
309.168 306 m 254.832 306 l 244.172 306 234.316 310.434 227.352 318 c 336.641
 318 l 329.684 310.434 319.828 306 309.168 306 c h
197.488 319.266 m 192.57 270 l 179.43 270 l 174.031 324.031 l 174 327.562
 176.438 330 179.43 330 c 187.105 330 l 188.855 325.086 192.641 321.156 
197.488 319.266 c h
179.43 258 m 192.57 258 l 198.762 258 203.898 262.645 204.512 268.812 c
 207.02 294 l 258 294 l 258 280.141 l 236.297 271.074 222 249.863 222 226.051
 c 222 192 l 222 185.551 223.5 179.465 226.109 174 c 102 174 l 102 294 l
 164.969 294 l 167.488 268.805 l 168.102 262.645 173.238 258 179.43 258 
c h
90 174 m 84 174 l 83.062 174 82.141 173.922 81.223 173.863 c 78.254 185.734
 l 80.305 191.164 84.672 195.238 90 197.016 c h
72 66 m 62.074 66 54 74.074 54 84 c 54 132 l 54 148.543 67.457 162 84 162
 c 108 162 l 124.543 162 138 148.543 138 132 c 138 84 l 138 80.695 135.305
 78 132 78 c 102 78 l 91.375 78 81.84 73.344 75.238 66 c h
212.586 318 m 215.328 313.434 218.676 309.379 222.582 306 c 208.211 306
 l 209.406 318 l h
294 294 m 294 282 l 270 282 l 270 294 l h
234 192 m 234 226.051 l 234 245.348 245.852 262.422 263.656 269.398 c 259.973
 262.609 258 254.977 258 247.027 c 258 234 l 270 234 l 270 247.027 l 270
 255.57 273.078 263.629 278.645 270 c 285.348 270 l 290.922 263.629 294 
255.574 294 247.027 c 294 234 l 306 234 l 306 247.027 l 306 254.969 304.027
 262.609 300.344 269.398 c 318.148 262.43 330 245.348 330 226.051 c 330 
162 l 264 162 l 247.457 162 234 175.457 234 192 c h
170.387 126.512 m 166.156 133.375 158.633 138 150 138 c 149.52 138 l 148.176
 147.344 143.785 155.695 137.336 162 c 174 162 l 174 132 l 174 129.539 172.508
 127.434 170.387 126.512 c h
150 126 m 156.617 126 162 120.617 162 114 c 162 107.383 156.617 102 150
 102 c h
30 74.25 m 30 76.344 30.211 78.445 30.617 80.496 c 32.879 91.824 l 35.699
 90.66 38.773 90 42 90 c 42 84 l 42 68.746 53.484 56.258 68.238 54.379 c
 66.816 50.516 66 46.355 66 42 c 78 42 l 78 55.234 88.766 66 102 66 c 132
 66 l 141.926 66 150 74.074 150 84 c 150 90 l 153.227 90 156.301 90.66 159.121
 91.824 c 160.957 82.656 l 161.645 79.176 162 75.613 162 72.055 c 162 42.254
 137.746 18 107.945 18 c 86.309 18 l 69.148 18 53.941 28.297 47.566 44.23
 c 46.879 45.961 l 44.18 47.762 l 35.297 53.676 30 63.582 30 74.25 c h
42 102 m 35.383 102 30 107.383 30 114 c 30 120.617 35.383 126 42 126 c 
h
18 212.285 m 28.902 195.742 46.422 183.949 67.152 180.652 c 69.473 171.355
 l 55.277 166.098 44.699 153.402 42.48 138 c 42 138 l 33.367 138 25.844 
133.375 21.613 126.512 c 19.492 127.434 18 129.539 18 132 c h
18 252.301 m 18 270 l 42 270 l 42 246 l 54 246 l 54 270 l 90 270 l 90 209.352
 l 80.551 207.484 72.484 201.344 68.227 192.617 c 39.305 197.617 18 222.512
 18 252.301 c h
186 366 m 186 342 l 179.43 342 l 169.816 342 162 334.184 162 324.57 c 162
 323.988 162.023 323.406 162.086 322.828 c 163.77 306 l 102 306 l 95.383
 306 90 300.617 90 294 c 90 282 l 18 282 l 18 366 l h
366 336 m 366 332.695 363.305 330 360 330 c 204 330 l 200.695 330 198 332.695
 198 336 c 198 366 l 366 366 l h
30 330 m 78 330 l 78 318 l 42 318 l 42 306 l 78 306 l 78 294 l 30 294 l
 h
312 54 m 198 54 l 198 66 l 312 66 l 328.543 66 342 52.543 342 36 c 342 
19.457 328.543 6 312 6 c 302.074 6 294 14.074 294 24 c 294 33.926 302.074
 42 312 42 c 318 42 l 318 30 l 312 30 l 308.695 30 306 27.305 306 24 c 306
 20.695 308.695 18 312 18 c 321.926 18 330 26.074 330 36 c 330 45.926 321.926
 54 312 54 c h
348 78 m 198 78 l 198 90 l 348 90 l 357.926 90 366 98.074 366 108 c 366
 117.926 357.926 126 348 126 c 344.695 126 342 123.305 342 120 c 342 116.695
 344.695 114 348 114 c 354 114 l 354 102 l 348 102 l 338.074 102 330 110.074
 330 120 c 330 129.926 338.074 138 348 138 c 364.543 138 378 124.543 378
 108 c 378 91.457 364.543 78 348 78 c h
348 78 m W n
[6 0 0 6 0 0] concat
/CairoFunction
   << /FunctionType 2
      /Domain [ 0 1 ]
      /C0 [ 0.623529 0.184314 1 ]
      /C1 [ 0.0431373 0.694118 0.827451 ]
      /N 1
   >>
def
   << /ShadingType 2
      /ColorSpace /DeviceRGB
      /Coords [ 32 63 32 1 ]
      /Extend [ true true ]
      /Function CairoFunction
   >>
shfill
Q
Q Q
showpage
%%Trailer
end
%%EOF
