%!PS-Adobe-3.0 EPSF-3.0
%%Creator: cairo 1.16.0 (https://cairographics.org)
%%CreationDate: Mon May  4 07:13:21 2020
%%Pages: 1
%%DocumentData: Clean7Bit
%%LanguageLevel: 3
%%BoundingBox: 6 6 378 381
%%EndComments
%%BeginProlog
50 dict begin
/q { gsave } bind def
/Q { grestore } bind def
/cm { 6 array astore concat } bind def
/w { setlinewidth } bind def
/J { setlinecap } bind def
/j { setlinejoin } bind def
/M { setmiterlimit } bind def
/d { setdash } bind def
/m { moveto } bind def
/l { lineto } bind def
/c { curveto } bind def
/h { closepath } bind def
/re { exch dup neg 3 1 roll 5 3 roll moveto 0 rlineto
      0 exch rlineto 0 rlineto closepath } bind def
/S { stroke } bind def
/f { fill } bind def
/f* { eofill } bind def
/n { newpath } bind def
/W { clip } bind def
/W* { eoclip } bind def
/BT { } bind def
/ET { } bind def
/BDC { mark 3 1 roll /BDC pdfmark } bind def
/EMC { mark /EMC pdfmark } bind def
/cairo_store_point { /cairo_point_y exch def /cairo_point_x exch def } def
/Tj { show currentpoint cairo_store_point } bind def
/TJ {
  {
    dup
    type /stringtype eq
    { show } { -0.001 mul 0 cairo_font_matrix dtransform rmoveto } ifelse
  } forall
  currentpoint cairo_store_point
} bind def
/cairo_selectfont { cairo_font_matrix aload pop pop pop 0 0 6 array astore
    cairo_font exch selectfont cairo_point_x cairo_point_y moveto } bind def
/Tf { pop /cairo_font exch def /cairo_font_matrix where
      { pop cairo_selectfont } if } bind def
/Td { matrix translate cairo_font_matrix matrix concatmatrix dup
      /cairo_font_matrix exch def dup 4 get exch 5 get cairo_store_point
      /cairo_font where { pop cairo_selectfont } if } bind def
/Tm { 2 copy 8 2 roll 6 array astore /cairo_font_matrix exch def
      cairo_store_point /cairo_font where { pop cairo_selectfont } if } bind def
/g { setgray } bind def
/rg { setrgbcolor } bind def
/d1 { setcachedevice } bind def
/cairo_data_source {
  CairoDataIndex CairoData length lt
    { CairoData CairoDataIndex get /CairoDataIndex CairoDataIndex 1 add def }
    { () } ifelse
} def
/cairo_flush_ascii85_file { cairo_ascii85_file status { cairo_ascii85_file flushfile } if } def
/cairo_image { image cairo_flush_ascii85_file } def
/cairo_imagemask { imagemask cairo_flush_ascii85_file } def
%%EndProlog
%%BeginSetup
%%EndSetup
%%Page: 1 1
%%BeginPageSetup
%%PageBoundingBox: 6 6 378 381
%%EndPageSetup
q 6 6 372 375 rectclip
1 0 0 -1 0 384 cm q
q
366 342 m 317.43 342 l 316.23 330 l 354 330 l 360.617 330 366 324.617 366
 318 c 366 234 l 366 229.477 363.449 225.57 359.742 223.531 c 363.805 217.297
 366 210.023 366 202.402 c 366 190.262 360.199 178.648 350.473 171.355 c
 345.168 167.375 342 161.047 342 154.41 c 342 152.129 342.367 149.875 343.086
 147.715 c 351.148 123.516 l 337.531 126.938 l 322.543 130.68 309.57 139.816
 301.008 152.672 c 310.992 159.324 l 316.355 151.285 323.855 145.043 332.594
 141.238 c 331.703 143.91 l 330.57 147.312 330 150.848 330 154.41 c 330 
164.797 334.961 174.727 343.273 180.953 c 349.992 185.992 354 194.016 354
 202.402 c 354 209.566 351.211 216.301 346.141 221.363 c 345.512 222 l 306
 222 l 306 192 l 306 182.074 297.926 174 288 174 c 258 174 l 258 169.109
 256.512 164.566 253.992 160.77 c 256.543 150.562 l 257.508 146.707 258 
142.727 258 138.738 c 258 111.863 236.137 90 209.262 90 c 169.414 90 l 159.73
 90 150.938 94.934 145.906 103.043 c 145.422 103.199 l 133.805 107.074 126
 117.898 126 130.145 c 126 131.707 126.125 133.266 126.383 134.809 c 130.586
 160.004 l 127.727 163.957 126 168.77 126 174 c 96 174 l 86.074 174 78 182.074
 78 192 c 78 282 l 30 282 l 23.383 282 18 287.383 18 294 c 18 342 l 11.383
 342 6 347.383 6 354 c 6 366 l 6 372.617 11.383 378 18 378 c 366 378 l 372.617
 378 378 372.617 378 366 c 378 354 l 378 347.383 372.617 342 366 342 c h
114 294 m 114 342 l 102 342 l 102 294 l 102 291.738 101.336 289.645 100.242
 287.84 c 110.32 267.289 127.133 250.895 147.547 241.242 c 158.711 280.32
 l 176.297 266.258 l 179.578 271.176 l 163.223 342 l 126 342 l 126 294 l
 h
54 342 m 54 294 l 66 294 l 66 342 l h
78 294 m 90 294 l 90 342 l 78 342 l h
180 222 m 204 222 l 205.219 222 206.375 221.785 207.551 221.641 c 208.938
 225.797 l 192 238.5 l 175.062 225.797 l 176.449 221.641 l 177.625 221.785
 178.781 222 180 222 c h
222 248.164 m 218.707 259.688 l 201.797 246.156 l 217.332 234.504 l 218.898
 234.883 220.457 235.285 222.008 235.738 c 222.008 248.164 l h
194.789 264 m 189.211 264 l 185.695 258.727 l 192 253.688 l 198.305 258.727
 l h
166.668 234.504 m 182.203 246.156 l 165.293 259.688 l 158.742 236.762 l
 161.34 235.895 163.984 235.152 166.668 234.504 c h
190.777 276 m 193.23 276 l 208.457 342 l 175.543 342 l h
220.777 342 m 204.434 271.172 l 207.715 266.25 l 222 277.688 l 222 318 
l 222 324.617 227.383 330 234 330 c 271.77 330 l 270.57 342 l h
354 318 m 315.031 318 l 312.512 292.812 l 311.898 286.645 306.762 282 300.57
 282 c 287.43 282 l 281.238 282 276.102 286.645 275.488 292.805 c 272.969
 318 l 234 318 l 234 234 l 354 234 l h
305.371 342 m 282.629 342 l 287.43 294 l 300.57 294 l h
288 186 m 291.305 186 294 188.688 294 192 c 294 222 l 234 222 l 231.176
 222 228.613 223.02 226.559 224.656 c 224.586 224.059 222.637 223.402 220.625
 222.906 c 218.941 217.859 l 226.234 213.629 231.652 206.52 233.387 198 
c 234 198 l 242.844 198 250.5 193.141 254.664 186 c h
234 162 m 240.617 162 246 167.383 246 174 c 246 180.617 240.617 186 234
 186 c h
149.219 114.59 m 154.262 112.906 l 155.371 110.688 l 158.047 105.328 163.43
 102 169.414 102 c 209.262 102 l 229.52 102 246 118.48 246 138.738 c 246
 141.742 245.629 144.742 244.902 147.648 c 243.781 152.129 l 240.785 150.785
 237.492 150 234 150 c 234 138 l 222 138 l 222 192 l 222 201.926 213.926
 210 204 210 c 180 210 l 170.074 210 162 201.926 162 192 c 162 151.414 l
 162 145.43 165.328 140.039 170.684 137.363 c 165.312 126.629 l 156.301 
131.148 150.602 140.023 150.098 150 c 150 150 l 146.945 150 144.047 150.629
 141.359 151.676 c 138.223 132.848 l 138.078 131.953 138 131.051 138 130.145
 c 138 123.078 142.508 116.824 149.219 114.59 c h
150 186 m 143.383 186 138 180.617 138 174 c 138 167.383 143.383 162 150
 162 c h
96 186 m 129.336 186 l 133.5 193.141 141.156 198 150 198 c 150.605 198 
l 152.34 206.516 157.766 213.625 165.055 217.855 c 163.367 222.906 l 131.617
 230.762 104.707 252.281 90 281.449 c 90 192 l 90 188.688 92.695 186 96 
186 c h
30 294 m 42 294 l 42 342 l 30 342 l h
18 366 m 18 354 l 366 354 l 366.008 366 l h
192 198 m 174 198 l 174 186 l 192 186 l 197.117 186 201.715 183.156 204
 178.586 c 204.629 177.316 l 215.363 182.688 l 214.734 183.953 l 210.402
 192.617 201.691 198 192 198 c h
180.18 151.453 m 174.18 127.453 l 185.82 124.547 l 191.82 148.547 l h
204.18 151.453 m 198.18 127.453 l 209.82 124.547 l 215.82 148.547 l h
90 80.941 m 90 79.633 89.789 78.344 89.375 77.105 c 81.035 52.078 l 97.645
 55.41 l 114.07 58.699 126 73.242 126 90 c 114 90 l 114 80.281 107.922 71.688
 99.086 68.281 c 100.766 73.312 l 101.586 75.773 102 78.344 102 80.941 c
 102 88.492 98.395 95.707 92.352 100.234 c 84.871 105.848 l 80.566 109.074
 78 114.211 78 119.594 c 78 125.352 80.863 130.703 85.648 133.895 c 93.324
 139.016 l 86.672 148.996 l 78.996 143.879 l 70.859 138.449 66 129.379 66
 119.594 c 66 110.461 70.363 101.723 77.672 96.246 c 85.152 90.637 l 88.188
 88.363 90 84.738 90 80.941 c h
174 28.441 m 174 26.461 173.531 24.48 172.645 22.711 c 162.793 3.012 l 
181.043 7.586 l 194.566 10.961 205.277 20.879 209.688 34.105 c 198.305 37.902
 l 196.008 31.02 191.293 25.402 185.141 21.988 c 185.707 24.09 186 26.27
 186 28.441 c 186 39.137 179.184 48.594 169.031 51.977 c 163.043 53.977 
l 155.242 56.578 150 63.852 150 72.078 c 150 75.023 150.695 77.977 152.016
 80.617 c 155.371 87.316 l 144.637 92.688 l 141.281 85.984 l 139.133 81.684
 138 76.879 138 72.078 c 138 58.688 146.539 46.828 159.254 42.594 c 165.238
 40.598 l 170.477 38.852 174 33.965 174 28.441 c h
48.402 201.113 m 52.008 197.504 54 192.703 54 187.602 c 54 183.816 52.891
 180.156 50.789 177.008 c 48.043 172.883 l 44.094 166.957 42 160.051 42 
152.914 c 42 150 l 54 150 l 54 152.914 l 54 157.676 55.391 162.277 58.031
 166.23 c 60.781 170.352 l 64.195 175.469 66 181.434 66 187.602 c 66 195.91
 62.766 203.723 56.891 209.598 c 50.852 215.641 l 45.145 221.348 42 228.93
 42 237 c 42 245.07 45.145 252.652 50.852 258.367 c 58.242 265.758 l 49.758
 274.242 l 42.367 266.852 l 34.391 258.875 30 248.273 30 237 c 30 225.727
 34.391 215.125 42.367 207.148 c h
271.055 27.805 m 270.355 29.902 270 32.094 270 34.312 c 270 41.227 273.043
 47.723 278.352 52.152 c 287.684 59.93 l 299.32 69.625 306 83.875 306 99.031
 c 306 109.969 302.383 120.816 295.824 129.574 c 286.801 141.605 l 277.199
 134.398 l 286.219 122.375 l 291.238 115.68 294 107.387 294 99.031 c 294
 87.449 288.898 76.559 280.004 69.148 c 270.672 61.375 l 262.621 54.66 258
 44.797 258 34.312 c 258 30.805 258.562 27.336 259.676 24.008 c 260.852 
20.473 l 258.781 20.988 l 253.688 22.266 249.652 25.992 247.996 30.973 c
 246.09 36.695 242.27 41.695 237.254 45.043 c 235.723 46.066 l 230.887 49.289
 228 54.68 228 60.492 c 228 63.168 228.629 65.852 229.828 68.242 c 233.363
 75.316 l 222.629 80.688 l 219.098 73.613 l 217.074 69.559 216 65.023 216
 60.492 c 216 50.652 220.883 41.531 229.066 36.086 c 230.594 35.059 l 233.406
 33.18 235.547 30.391 236.617 27.18 c 239.578 18.293 246.781 11.621 255.871
 9.355 c 279.148 3.527 l h
271.055 27.805 m W n
[6 0 0 6 0 0] concat
/CairoFunction
   << /FunctionType 2
      /Domain [ 0 1 ]
      /C0 [ 0.623529 0.184314 1 ]
      /C1 [ 0.0431373 0.694118 0.827451 ]
      /N 1
   >>
def
   << /ShadingType 2
      /ColorSpace /DeviceRGB
      /Coords [ 32 63 32 0.502 ]
      /Extend [ true true ]
      /Function CairoFunction
   >>
shfill
Q
Q Q
showpage
%%Trailer
end
%%EOF
