%!PS-Adobe-3.0 EPSF-3.0
%%Creator: cairo 1.16.0 (https://cairographics.org)
%%CreationDate: Mon May  4 07:13:34 2020
%%Pages: 1
%%DocumentData: Clean7Bit
%%LanguageLevel: 3
%%BoundingBox: 6 5 378 378
%%EndComments
%%BeginProlog
50 dict begin
/q { gsave } bind def
/Q { grestore } bind def
/cm { 6 array astore concat } bind def
/w { setlinewidth } bind def
/J { setlinecap } bind def
/j { setlinejoin } bind def
/M { setmiterlimit } bind def
/d { setdash } bind def
/m { moveto } bind def
/l { lineto } bind def
/c { curveto } bind def
/h { closepath } bind def
/re { exch dup neg 3 1 roll 5 3 roll moveto 0 rlineto
      0 exch rlineto 0 rlineto closepath } bind def
/S { stroke } bind def
/f { fill } bind def
/f* { eofill } bind def
/n { newpath } bind def
/W { clip } bind def
/W* { eoclip } bind def
/BT { } bind def
/ET { } bind def
/BDC { mark 3 1 roll /BDC pdfmark } bind def
/EMC { mark /EMC pdfmark } bind def
/cairo_store_point { /cairo_point_y exch def /cairo_point_x exch def } def
/Tj { show currentpoint cairo_store_point } bind def
/TJ {
  {
    dup
    type /stringtype eq
    { show } { -0.001 mul 0 cairo_font_matrix dtransform rmoveto } ifelse
  } forall
  currentpoint cairo_store_point
} bind def
/cairo_selectfont { cairo_font_matrix aload pop pop pop 0 0 6 array astore
    cairo_font exch selectfont cairo_point_x cairo_point_y moveto } bind def
/Tf { pop /cairo_font exch def /cairo_font_matrix where
      { pop cairo_selectfont } if } bind def
/Td { matrix translate cairo_font_matrix matrix concatmatrix dup
      /cairo_font_matrix exch def dup 4 get exch 5 get cairo_store_point
      /cairo_font where { pop cairo_selectfont } if } bind def
/Tm { 2 copy 8 2 roll 6 array astore /cairo_font_matrix exch def
      cairo_store_point /cairo_font where { pop cairo_selectfont } if } bind def
/g { setgray } bind def
/rg { setrgbcolor } bind def
/d1 { setcachedevice } bind def
/cairo_data_source {
  CairoDataIndex CairoData length lt
    { CairoData CairoDataIndex get /CairoDataIndex CairoDataIndex 1 add def }
    { () } ifelse
} def
/cairo_flush_ascii85_file { cairo_ascii85_file status { cairo_ascii85_file flushfile } if } def
/cairo_image { image cairo_flush_ascii85_file } def
/cairo_imagemask { imagemask cairo_flush_ascii85_file } def
%%EndProlog
%%BeginSetup
%%EndSetup
%%Page: 1 1
%%BeginPageSetup
%%PageBoundingBox: 6 5 378 378
%%EndPageSetup
q 6 5 372 373 rectclip
1 0 0 -1 0 384 cm q
q
112.68 295.141 m 110.941 289.934 l 118.234 285.703 123.652 278.594 125.395
 270.07 c 126 270.07 l 139.234 270.07 150 259.309 150 246.07 c 150 241.184
 148.512 236.633 145.992 232.836 c 148.543 222.637 l 149.508 218.785 150
 214.805 150 210.816 c 150 183.941 128.137 162.078 101.262 162.078 c 90 
162.078 l 90 149.395 l 103.676 146.605 114 134.488 114 120 c 114 113.621
 l 114 111.836 114.785 110.16 116.16 109.016 c 131.664 96.09 l 143.32 86.375
 150 72.121 150 56.945 c 150 28.859 127.141 6 99.055 6 c 68.945 6 l 40.859
 6 18 28.859 18 56.945 c 18 72.113 24.68 86.375 36.328 96.086 c 51.848 109.008
 l 53.215 110.152 54 111.836 54 113.621 c 54 120 l 54 134.484 64.324 146.605
 78 149.395 c 78 162.078 l 66.738 162.078 l 39.863 162.078 18 183.938 18
 210.816 c 18 214.805 18.492 218.785 19.457 222.637 c 22.008 232.844 l 19.488
 236.641 18 241.184 18 246.078 c 18 259.312 28.766 270.078 42 270.078 c 
42.605 270.078 l 44.34 278.594 49.766 285.703 57.055 289.938 c 55.32 295.141
 l 26.117 303.941 6 330.785 6 361.555 c 6 378.07 l 133.5 378.109 l 149.82
 378.102 l 157.68 378.09 162 378.086 162 372.078 c 162 361.555 l 162 330.785
 141.883 303.941 112.68 295.141 c h
44.012 86.867 m 35.113 79.445 30 68.543 30 56.945 c 30 35.473 47.473 18
 68.945 18 c 99.055 18 l 120.527 18 138 35.473 138 56.945 c 138 68.543 132.887
 79.445 123.984 86.863 c 108.48 99.785 l 104.363 103.219 102 108.266 102
 113.621 c 102 114 l 90 114 l 90 82.895 l 96.965 80.41 102 73.812 102 66
 c 102 56.074 93.926 48 84 48 c 74.074 48 66 56.074 66 66 c 66 73.812 71.035
 80.41 78 82.895 c 78 114 l 66 114 l 66 113.621 l 66 108.266 63.637 103.223
 59.527 99.793 c h
78 66 m 78 62.688 80.688 60 84 60 c 87.312 60 90 62.688 90 66 c 90 69.312
 87.312 72 84 72 c 80.688 72 78 69.312 78 66 c h
67.105 126 m 100.891 126 l 98.406 132.965 91.805 138 83.992 138 c 76.184
 138 69.59 132.965 67.105 126 c h
116.297 309.305 m 111.176 321.379 l 96.461 312.551 l 108.582 306.492 l 
111.238 307.266 113.824 308.191 116.297 309.305 c h
82.32 342.078 m 85.676 342.078 l 93.684 366.109 l 87.359 366.109 80.863
 366.109 74.309 366.102 c h
86.125 330.078 m 81.883 330.078 l 78.434 322.422 l 84 319.074 l 89.574 
322.414 l h
126 258.078 m 126 234.078 l 132.617 234.078 138 239.461 138 246.078 c 138
 252.695 132.617 258.078 126 258.078 c h
30 246.078 m 30 239.461 35.383 234.078 42 234.078 c 42 258.078 l 35.383
 258.078 30 252.691 30 246.078 c h
42.602 222.078 m 42 222.078 l 38.508 222.078 35.215 222.863 32.215 224.207
 c 31.098 219.719 l 30.371 216.82 30 213.82 30 210.816 c 30 190.559 46.48
 174.078 66.738 174.078 c 101.262 174.078 l 121.52 174.078 138 190.559 138
 210.816 c 138 213.82 137.629 216.82 136.902 219.727 c 135.781 224.207 l
 132.785 222.863 129.484 222.07 125.992 222.07 c 120.305 222.07 l 84.473
 218.488 l 73.945 217.441 66 208.66 66 198.078 c 54 198.078 l 54 200.773
 54.324 203.395 54.938 205.902 c 48.496 209.238 44.094 215.184 42.602 222.078
 c h
54 227.203 m 54 222.895 56.25 219 59.922 216.848 c 65.184 224.305 73.535
 229.457 83.285 230.438 c 114 233.508 l 114 264.078 l 114 274.004 105.926
 282.078 96 282.078 c 72 282.078 l 62.074 282.078 54 274.004 54 264.078 
c h
72 294.078 m 96 294.078 l 97.219 294.078 98.375 293.863 99.551 293.719 
c 100.656 297.035 l 84 305.371 l 67.34 297.035 l 68.441 293.719 l 69.625
 293.855 70.781 294.078 72 294.078 c h
59.418 306.496 m 71.539 312.559 l 56.824 321.383 l 51.703 309.312 l 54.176
 308.191 56.762 307.266 59.418 306.496 c h
18 361.555 m 18 342.895 26.977 326.016 41.27 315.449 c 51.176 338.773 l
 68.062 328.637 l 71.566 336.406 l 61.676 366.098 l 46.105 366.09 30.859
 366.09 18 366.086 c h
150 366.102 m 141.75 366.109 125.508 366.109 106.332 366.109 c 96.434 336.414
 l 99.938 328.645 l 116.824 338.777 l 126.73 315.457 l 141.023 326.016 150
 342.895 150 361.555 c h
84 270.078 m 66 270.078 l 66 258.078 l 84 258.078 l 89.117 258.078 93.715
 255.234 96 250.66 c 96.629 249.395 l 107.363 254.766 l 106.734 256.031 
l 102.402 264.691 93.691 270.078 84 270.078 c h
354.199 153.199 m 361.727 144.762 366 133.883 366 122.371 c 366 72 l 366
 35.609 336.391 6 300 6 c 263.609 6 234 35.609 234 72 c 234 122.371 l 234
 133.891 238.273 144.762 245.801 153.199 c 231.059 166.043 222 184.859 222
 205.477 c 222 222 l 294 222 l 294 282 l 282.102 282 l 282.246 298.734 l
 282.293 298.816 l 282.211 298.867 l 267.703 290.387 l 249.828 321.574 l
 264.438 329.945 l 249.828 338.43 l 267.703 369.617 l 282.098 361.152 l 
282.098 378 l 317.898 378 l 317.785 361.133 l 332.293 369.613 l 350.164 
338.426 l 335.664 330 l 350.172 321.574 l 332.297 290.387 l 317.941 298.844
 l 317.898 282 l 306 282 l 306 222 l 378 222 l 378 205.477 l 378 184.859
 368.941 166.043 354.199 153.199 c h
311.977 309.258 m 312.047 309.293 l 312.156 309.355 312.258 309.414 312.367
 309.469 c 312.512 309.539 l 316.078 311.371 320.363 311.262 323.852 309.223
 c 327.906 306.848 l 333.828 317.191 l 329.539 319.68 l 325.895 321.805 
323.633 325.746 323.645 330.023 c 323.633 334.254 325.895 338.195 329.539
 340.32 c 333.828 342.809 l 327.906 353.152 l 323.84 350.777 l 320.148 348.641
 315.57 348.648 311.82 350.844 c 308.172 352.969 305.902 356.93 305.902 
361.156 c 305.902 366 l 294.102 366 l 294.102 361.145 l 294.102 356.914 
291.836 352.961 288.133 350.797 c 284.426 348.629 279.84 348.617 276.156
 350.773 c 272.102 353.148 l 266.18 342.805 l 270.469 340.312 l 274.109 
338.191 276.371 334.246 276.359 329.969 c 276.371 325.738 274.109 321.797
 270.461 319.668 c 266.18 317.184 l 272.102 306.84 l 276.168 309.215 l 279.664
 311.25 283.957 311.34 287.543 309.504 c 288.188 309.148 l 291.836 307.027
 294.102 303.066 294.102 298.836 c 294.102 294 l 305.902 294 l 305.902 298.855
 l 305.898 303.086 308.164 307.039 311.977 309.258 c h
246 122.371 m 246 72 l 246 42.223 270.223 18 300 18 c 329.777 18 354 42.223
 354 72 c 354 122.371 l 354 131.305 350.566 139.727 344.488 146.094 c 339.605
 143.152 334.32 140.766 328.68 139.066 c 326.238 131.746 l 335.746 125.262
 342 114.348 342 102 c 342 66 l 330 66 l 330 102 l 330 115.234 319.234 126
 306 126 c 294 126 l 280.766 126 270 115.234 270 102 c 270 67.414 l 270 
62.484 272.258 57.965 276.047 55.027 c 302.914 71.148 l 309.09 60.859 l 
276.266 41.16 l 273.316 42.629 l 263.875 47.363 258 56.863 258 67.414 c 
258 102 l 258 114.348 264.254 125.262 273.758 131.746 c 271.312 139.066 
l 265.676 140.766 260.387 143.152 255.504 146.094 c 249.434 139.727 246 
131.305 246 122.371 c h
314.824 162 m 285.168 162 l 283.223 156.527 282.137 150.742 282.043 144.84
 c 284.734 136.754 l 287.699 137.539 290.797 138 294 138 c 306 138 l 309.203
 138 312.301 137.539 315.258 136.746 c 317.953 144.836 l 317.863 150.742
 316.777 156.527 314.824 162 c h
308.785 174 m 306.289 177.738 303.383 181.211 300 184.242 c 296.617 181.211
 293.711 177.738 291.215 174 c h
366 210 m 234 210 l 234 205.477 l 234 181.566 248.719 160.566 270.523 152.074
 c 272.723 169.715 282.035 186.031 296.395 196.801 c 300 199.5 l 303.605
 196.801 l 317.965 186.031 327.277 169.715 329.477 152.074 c 351.289 160.566
 366 181.566 366 205.477 c h
326.91 59.141 m 296.91 41.141 l 303.086 30.852 l 333.086 48.852 l h
312.629 93.316 m 323.363 98.688 l 322.734 99.953 l 318.402 108.617 309.691
 114 300 114 c 282 114 l 282 102 l 300 102 l 305.117 102 309.715 99.156 
312 94.586 c h
282 330 m 282 339.926 290.074 348 300 348 c 309.926 348 318 339.926 318
 330 c 318 320.074 309.926 312 300 312 c 290.074 312 282 320.074 282 330
 c h
306 330 m 306 333.312 303.312 336 300 336 c 296.688 336 294 333.312 294
 330 c 294 326.688 296.688 324 300 324 c 303.312 324 306 326.688 306 330
 c h
306 330 m W n
[6 0 0 6 0 0] concat
/CairoFunction
   << /FunctionType 2
      /Domain [ 0 1 ]
      /C0 [ 0.623529 0.184314 1 ]
      /C1 [ 0.0431373 0.694118 0.827451 ]
      /N 1
   >>
def
   << /ShadingType 2
      /ColorSpace /DeviceRGB
      /Coords [ 32 63.018002 32 1 ]
      /Extend [ true true ]
      /Function CairoFunction
   >>
shfill
Q
Q Q
showpage
%%Trailer
end
%%EOF
