%!PS-Adobe-3.0 EPSF-3.0
%%Creator: cairo 1.16.0 (https://cairographics.org)
%%CreationDate: Mon May  4 07:13:18 2020
%%Pages: 1
%%DocumentData: Clean7Bit
%%LanguageLevel: 3
%%BoundingBox: 6 6 378 378
%%EndComments
%%BeginProlog
50 dict begin
/q { gsave } bind def
/Q { grestore } bind def
/cm { 6 array astore concat } bind def
/w { setlinewidth } bind def
/J { setlinecap } bind def
/j { setlinejoin } bind def
/M { setmiterlimit } bind def
/d { setdash } bind def
/m { moveto } bind def
/l { lineto } bind def
/c { curveto } bind def
/h { closepath } bind def
/re { exch dup neg 3 1 roll 5 3 roll moveto 0 rlineto
      0 exch rlineto 0 rlineto closepath } bind def
/S { stroke } bind def
/f { fill } bind def
/f* { eofill } bind def
/n { newpath } bind def
/W { clip } bind def
/W* { eoclip } bind def
/BT { } bind def
/ET { } bind def
/BDC { mark 3 1 roll /BDC pdfmark } bind def
/EMC { mark /EMC pdfmark } bind def
/cairo_store_point { /cairo_point_y exch def /cairo_point_x exch def } def
/Tj { show currentpoint cairo_store_point } bind def
/TJ {
  {
    dup
    type /stringtype eq
    { show } { -0.001 mul 0 cairo_font_matrix dtransform rmoveto } ifelse
  } forall
  currentpoint cairo_store_point
} bind def
/cairo_selectfont { cairo_font_matrix aload pop pop pop 0 0 6 array astore
    cairo_font exch selectfont cairo_point_x cairo_point_y moveto } bind def
/Tf { pop /cairo_font exch def /cairo_font_matrix where
      { pop cairo_selectfont } if } bind def
/Td { matrix translate cairo_font_matrix matrix concatmatrix dup
      /cairo_font_matrix exch def dup 4 get exch 5 get cairo_store_point
      /cairo_font where { pop cairo_selectfont } if } bind def
/Tm { 2 copy 8 2 roll 6 array astore /cairo_font_matrix exch def
      cairo_store_point /cairo_font where { pop cairo_selectfont } if } bind def
/g { setgray } bind def
/rg { setrgbcolor } bind def
/d1 { setcachedevice } bind def
/cairo_data_source {
  CairoDataIndex CairoData length lt
    { CairoData CairoDataIndex get /CairoDataIndex CairoDataIndex 1 add def }
    { () } ifelse
} def
/cairo_flush_ascii85_file { cairo_ascii85_file status { cairo_ascii85_file flushfile } if } def
/cairo_image { image cairo_flush_ascii85_file } def
/cairo_imagemask { imagemask cairo_flush_ascii85_file } def
%%EndProlog
%%BeginSetup
%%EndSetup
%%Page: 1 1
%%BeginPageSetup
%%PageBoundingBox: 6 6 378 378
%%EndPageSetup
q 6 6 372 372 rectclip
1 0 0 -1 0 384 cm q
q
192 204 m 174 204 l 174 192 l 192 192 l 197.117 192 201.715 189.156 204
 184.586 c 204.629 183.316 l 215.363 188.688 l 214.734 189.953 l 210.402
 198.617 201.691 204 192 204 c h
191.82 154.543 m 185.82 130.543 l 174.18 133.453 l 180.18 157.453 l h
215.82 154.543 m 209.82 130.543 l 198.18 133.453 l 204.18 157.453 l h
42 252 m 30 252 l 30 264 l 42 264 l h
66 252 m 54 252 l 54 264 l 66 264 l h
90 252 m 78 252 l 78 264 l 90 264 l h
42 216 m 30 216 l 30 228 l 42 228 l h
66 216 m 54 216 l 54 228 l 66 228 l h
90 216 m 78 216 l 78 228 l 90 228 l h
42 180 m 30 180 l 30 192 l 42 192 l h
66 180 m 54 180 l 54 192 l 66 192 l h
90 180 m 78 180 l 78 192 l 90 192 l h
306 252 m 294 252 l 294 264 l 306 264 l h
330 252 m 318 252 l 318 264 l 330 264 l h
354 252 m 342 252 l 342 264 l 354 264 l h
306 216 m 294 216 l 294 228 l 306 228 l h
330 216 m 318 216 l 318 228 l 330 228 l h
354 216 m 342 216 l 342 228 l 354 228 l h
306 180 m 294 180 l 294 192 l 306 192 l h
330 180 m 318 180 l 318 192 l 330 192 l h
354 180 m 342 180 l 342 192 l 354 192 l h
342 148.312 m 378 157.312 l 378 366 l 234 366 l 234 372.617 228.617 378
 222 378 c 162 378 l 155.383 378 150 372.617 150 366 c 6 366 l 6 130.312
 l 42 139.312 l 42 114 l 54 114 l 54 142.312 l 66 145.312 l 66 90 l 78 90
 l 78 148.312 l 90 151.312 l 90 79.312 l 162 61.312 l 162 30 l 174 30 l 
174 58.312 l 186 55.312 l 186 6 l 198 6 l 198 52.312 l 210 49.312 l 210 
18 l 222 18 l 222 46.312 l 294 28.312 l 294 136.312 l 306 139.312 l 306 
114 l 318 114 l 318 142.312 l 330 145.312 l 330 90 l 342 90 l h
102 154.312 m 114 157.312 l 114 260.41 l 124.301 244.867 140.504 233.383
 159.773 229.523 c 163.41 228.797 l 165.059 223.855 l 157.766 219.625 152.348
 212.516 150.613 203.992 c 150 203.992 l 136.766 203.992 126 193.23 126 
179.992 c 126 174.762 127.727 169.949 130.586 166.004 c 126.383 140.809 
l 126.125 139.273 126 137.711 126 136.145 c 126 123.898 133.805 113.074 
145.414 109.199 c 145.906 109.039 l 150.941 100.934 159.73 96 169.414 96
 c 209.262 96 l 236.137 96 258 117.863 258 144.738 c 258 148.727 257.508
 152.707 256.543 156.562 c 253.992 166.77 l 256.512 170.566 258 175.109 
258 180 c 258 193.234 247.234 204 234 204 c 233.395 204 l 231.66 212.516
 226.234 219.625 218.945 223.859 c 220.598 228.805 l 224.23 229.531 l 243.504
 233.387 259.703 244.871 270.008 260.418 c 270.008 130.312 l 282.008 133.312
 l 282.008 43.688 l 102.008 88.688 l 102.008 154.312 l h
269.672 294 m 267.582 273.383 254.902 255.422 236.707 246.367 c 225.293
 286.312 l 207.707 272.25 l 204.461 277.117 l 208.688 294 l h
186 306 m 174 306 l 174 330 l 186 330 l 192.617 330 198 324.617 198 318
 c 198 311.383 192.617 306 186 306 c h
170.684 143.371 m 165.328 146.047 162 151.43 162 157.414 c 162 198 l 162
 207.926 170.074 216 180 216 c 204 216 l 213.926 216 222 207.926 222 198
 c 222 144 l 234 144 l 234 156 l 237.492 156 240.785 156.785 243.781 158.129
 c 244.902 153.648 l 245.629 150.742 246 147.742 246 144.738 c 246 124.48
 229.52 108 209.262 108 c 169.414 108 l 163.43 108 158.047 111.328 155.371
 116.684 c 154.254 118.906 l 149.215 120.59 l 142.508 122.82 138 129.078
 138 136.145 c 138 137.047 138.078 137.953 138.223 138.848 c 141.359 157.676
 l 144.047 156.629 146.945 156 150 156 c 150.098 156 l 150.602 146.016 156.293
 137.141 165.312 132.629 c h
150 168 m 143.383 168 138 173.383 138 180 c 138 186.617 143.383 192 150
 192 c h
234 192 m 240.617 192 246 186.617 246 180 c 246 173.383 240.617 168 234
 168 c h
196.312 294 m 193.312 282 l 190.688 282 l 187.688 294 l h
198.305 264.727 m 192 259.688 l 185.695 264.727 l 189.211 270 l 194.789
 270 l h
218.707 265.68 m 225.426 242.172 l 224.25 241.859 223.078 241.535 221.867
 241.297 c 217.453 240.406 l 201.797 252.148 l h
176.449 227.641 m 175.062 231.793 l 192 244.5 l 208.938 231.797 l 207.551
 227.645 l 206.375 227.785 205.219 228 204 228 c 180 228 l 178.781 228 177.625
 227.785 176.449 227.641 c h
162.125 241.297 m 160.922 241.535 159.75 241.859 158.566 242.172 c 165.289
 265.68 l 182.195 252.148 l 166.543 240.406 l h
114 300 m 114 316.543 127.457 330 144 330 c 162 330 l 162 306 l 126 306
 l 126 294 l 175.312 294 l 179.531 277.121 l 176.285 272.258 l 158.699 286.32
 l 147.289 246.371 l 127.344 256.289 114 276.91 114 300 c h
18 145.688 m 18 294 l 102 294 l 102 166.688 l h
150 354 m 150 342 l 144 342 l 122.887 342 105.406 326.316 102.48 306 c 
18 306 l 18 354 l h
222 366 m 222 306 l 206.664 306 l 208.727 309.547 210 313.609 210 318 c
 210 331.234 199.234 342 186 342 c 162 342 l 162 366 l h
366 354 m 366 306 l 234 306 l 234 354 l h
366 166.688 m 282 145.688 l 282 294 l 366 294 l h
366 166.688 m W n
[6 0 0 6 0 0] concat
/CairoFunction
   << /FunctionType 2
      /Domain [ 0 1 ]
      /C0 [ 0.623529 0.184314 1 ]
      /C1 [ 0.0431373 0.694118 0.827451 ]
      /N 1
   >>
def
   << /ShadingType 2
      /ColorSpace /DeviceRGB
      /Coords [ 32 63 32 1 ]
      /Extend [ true true ]
      /Function CairoFunction
   >>
shfill
Q
Q Q
showpage
%%Trailer
end
%%EOF
