%!PS-Adobe-3.0 EPSF-3.0
%%Creator: cairo 1.16.0 (https://cairographics.org)
%%CreationDate: Mon May  4 07:13:22 2020
%%Pages: 1
%%DocumentData: Clean7Bit
%%LanguageLevel: 3
%%BoundingBox: 6 6 378 378
%%EndComments
%%BeginProlog
50 dict begin
/q { gsave } bind def
/Q { grestore } bind def
/cm { 6 array astore concat } bind def
/w { setlinewidth } bind def
/J { setlinecap } bind def
/j { setlinejoin } bind def
/M { setmiterlimit } bind def
/d { setdash } bind def
/m { moveto } bind def
/l { lineto } bind def
/c { curveto } bind def
/h { closepath } bind def
/re { exch dup neg 3 1 roll 5 3 roll moveto 0 rlineto
      0 exch rlineto 0 rlineto closepath } bind def
/S { stroke } bind def
/f { fill } bind def
/f* { eofill } bind def
/n { newpath } bind def
/W { clip } bind def
/W* { eoclip } bind def
/BT { } bind def
/ET { } bind def
/BDC { mark 3 1 roll /BDC pdfmark } bind def
/EMC { mark /EMC pdfmark } bind def
/cairo_store_point { /cairo_point_y exch def /cairo_point_x exch def } def
/Tj { show currentpoint cairo_store_point } bind def
/TJ {
  {
    dup
    type /stringtype eq
    { show } { -0.001 mul 0 cairo_font_matrix dtransform rmoveto } ifelse
  } forall
  currentpoint cairo_store_point
} bind def
/cairo_selectfont { cairo_font_matrix aload pop pop pop 0 0 6 array astore
    cairo_font exch selectfont cairo_point_x cairo_point_y moveto } bind def
/Tf { pop /cairo_font exch def /cairo_font_matrix where
      { pop cairo_selectfont } if } bind def
/Td { matrix translate cairo_font_matrix matrix concatmatrix dup
      /cairo_font_matrix exch def dup 4 get exch 5 get cairo_store_point
      /cairo_font where { pop cairo_selectfont } if } bind def
/Tm { 2 copy 8 2 roll 6 array astore /cairo_font_matrix exch def
      cairo_store_point /cairo_font where { pop cairo_selectfont } if } bind def
/g { setgray } bind def
/rg { setrgbcolor } bind def
/d1 { setcachedevice } bind def
/cairo_data_source {
  CairoDataIndex CairoData length lt
    { CairoData CairoDataIndex get /CairoDataIndex CairoDataIndex 1 add def }
    { () } ifelse
} def
/cairo_flush_ascii85_file { cairo_ascii85_file status { cairo_ascii85_file flushfile } if } def
/cairo_image { image cairo_flush_ascii85_file } def
/cairo_imagemask { imagemask cairo_flush_ascii85_file } def
%%EndProlog
%%BeginSetup
%%EndSetup
%%Page: 1 1
%%BeginPageSetup
%%PageBoundingBox: 6 6 378 378
%%EndPageSetup
q 6 6 372 372 rectclip
1 0 0 -1 0 384 cm q
q
66 96 m 66 92.688 68.688 90 72 90 c 75.312 90 78 92.688 78 96 c 78 99.312
 75.312 102 72 102 c 68.688 102 66 99.312 66 96 c h
108 102 m 111.312 102 114 99.312 114 96 c 114 92.688 111.312 90 108 90 
c 104.688 90 102 92.688 102 96 c 102 99.312 104.688 102 108 102 c h
114 114 m 102 114 l 102 120.617 96.617 126 90 126 c 78 126 l 78 138 l 90
 138 l 103.234 138 114 127.234 114 114 c h
282 6 m 282 30 l 294 30 l 294 6 l h
244.242 13.758 m 235.758 22.242 l 253.758 40.242 l 262.242 31.758 l h
331.758 13.758 m 313.758 31.758 l 322.242 40.242 l 340.242 22.242 l h
354 144 m 354 167.566 342.391 181.691 332.152 194.152 c 325.727 201.977
 320.203 208.777 318 216.953 c 318 240 l 318 256.543 304.543 270 288 270
 c 271.457 270 258 256.543 258 240 c 258 216.953 l 255.797 208.777 250.273
 201.977 243.848 194.152 c 233.609 181.691 222 167.566 222 144 c 222 107.609
 251.609 78 288 78 c 324.391 78 354 107.609 354 144 c h
288 150 m 291.312 150 294 147.312 294 144 c 294 140.688 291.312 138 288
 138 c 284.688 138 282 140.688 282 144 c 282 147.312 284.688 150 288 150
 c h
270 222 m 270 234 l 306 234 l 306 222 l h
304.895 246 m 271.109 246 l 273.594 252.965 280.195 258 288.008 258 c 295.816
 258 302.41 252.965 304.895 246 c h
342 144 m 342 114.223 317.777 90 288 90 c 258.223 90 234 114.223 234 144
 c 234 163.266 243.719 175.098 253.121 186.539 c 259.004 193.699 265.039
 201.086 268.379 210 c 282 210 l 282 160.895 l 275.035 158.41 270 151.812
 270 144 c 270 134.074 278.074 126 288 126 c 297.926 126 306 134.074 306
 144 c 306 151.812 300.965 158.41 294 160.895 c 294 210 l 307.621 210 l 
310.961 201.078 316.996 193.699 322.879 186.539 c 332.281 175.098 342 163.266
 342 144 c h
378 66 m 378 330 l 378 336.617 372.617 342 366 342 c 210 342 l 203.383 
342 198 336.617 198 330 c 198 198 l 172.039 198 l 173.305 202.32 174 206.879
 174 211.598 c 174 252 l 174 261.926 165.926 270 156 270 c 150.918 270 l
 156.551 309.434 l 152.684 311.363 l 151.844 311.785 146.418 314.215 131.113
 316.008 c 127.262 358.352 l 126.246 369.551 116.992 378 105.75 378 c 99.539
 378 93.965 375.355 90 371.164 c 86.035 375.355 80.461 378 74.25 378 c 63
 378 53.746 369.551 52.734 358.352 c 48.883 316.016 l 33.574 314.215 28.152
 311.789 27.312 311.371 c 23.441 309.438 l 29.082 270 l 24 270 l 14.074 
270 6 261.926 6 252 c 6 211.598 l 6 194.867 14.566 180.008 27.758 171.395
 c 21.457 160.926 18 148.793 18 136.547 c 18 78 l 18 38.297 50.297 6 90 
6 c 129.703 6 162 38.297 162 78 c 162 136.547 l 162 148.793 158.543 160.926
 152.238 171.395 c 158.035 175.176 162.926 180.176 166.602 186.008 c 198
 186.008 l 198 66 l 198 59.383 203.383 54 210 54 c 366 54 l 372.617 54 378
 59.383 378 66 c h
102 252 m 102 244.188 107.035 237.59 114 235.105 c 114 210 l 66 210 l 66
 235.105 l 72.965 237.59 78 244.188 78 252 c 78 259.812 72.965 266.41 66
 268.895 c 66 282 l 114 282 l 114 268.895 l 107.035 266.41 102 259.812 102
 252 c h
82.324 198 m 97.68 198 l 107.52 168.461 l 103.902 161.227 l 101.34 161.719
 98.707 162 96 162 c 84 162 l 81.293 162 78.652 161.719 76.094 161.227 c
 72.48 168.457 l h
62.395 65.09 m 57 71.281 54 79.219 54 87.629 c 54 120 l 54 136.543 67.457
 150 84 150 c 96 150 l 112.543 150 126 136.543 126 120 c 126 84 l 126 80.688
 123.312 78 120 78 c 90 78 l 78.926 78 69.008 72.973 62.395 65.09 c h
129.516 186 m 151.145 186 l 145.57 180.523 138.281 176.742 129.973 175.816
 c 118.156 174.504 l 110.32 198 l 117.516 198 l h
38.578 166.172 m 41.809 165.078 45.18 164.281 48.695 163.891 c 62.09 162.402
 l 64.66 157.254 l 51.215 150.234 42 136.184 42 120 c 42 87.629 l 42 74.887
 47.105 62.965 56.148 54.254 c 54.758 50.426 54 46.301 54 42 c 66 42 l 66
 54.199 75.176 64.184 86.965 65.695 c 81.402 59.352 78 51.078 78 42 c 90
 42 l 90 55.234 100.766 66 114 66 c 120 66 l 129.926 66 138 74.074 138 84
 c 138 120 l 138 136.184 128.777 150.234 115.332 157.246 c 117.906 162.395
 l 131.293 163.883 l 134.809 164.273 138.18 165.078 141.414 166.172 c 146.969
 157.352 149.992 146.988 149.992 136.547 c 149.992 78 l 149.992 44.914 123.078
 18 89.992 18 c 56.91 18 30 44.914 30 78 c 30 136.547 l 30 146.988 33.023
 157.344 38.578 166.172 c h
18 234 m 30 234 l 30 210 l 42 210 l 42 234 l 54 234 l 54 210 l 54 203.383
 59.383 198 66 198 c 69.68 198 l 61.844 174.504 l 50.023 175.816 l 31.766
 177.848 18 193.223 18 211.598 c h
24 258 m 60 258 l 63.312 258 66 255.312 66 252 c 66 248.688 63.312 246 
60 246 c 18 246 l 18 252 l 18 255.312 20.688 258 24 258 c h
84 317.953 m 75.102 317.855 67.477 317.551 61.039 317.113 c 63.301 342 
l 84 342 l h
84 356.25 m 84 354 l 64.391 354 l 64.688 357.266 l 65.137 362.242 69.246
 366 74.25 366 c 79.625 366 84 361.625 84 356.25 c h
115.312 357.266 m 115.609 354 l 96 354 l 96 356.25 l 96 361.625 100.375
 366 105.75 366 c 110.746 366 114.863 362.242 115.312 357.266 c h
118.961 317.113 m 112.523 317.551 104.898 317.852 96 317.953 c 96 342 l
 116.699 342 l h
138.793 270 m 126 270 l 126 282 l 126 288.617 120.617 294 114 294 c 66 
294 l 59.383 294 54 288.617 54 282 c 54 270 l 41.207 270 l 36.66 301.812
 l 43.195 303.383 58.727 306 90 306 c 121.207 306 136.738 303.395 143.34
 301.801 c h
162 246 m 120 246 l 116.688 246 114 248.688 114 252 c 114 255.312 116.688
 258 120 258 c 156 258 l 159.312 258 162 255.312 162 252 c h
159.293 198 m 134.484 198 l 126 206.484 l 126 234 l 138 234 l 138 210 l
 150 210 l 150 234 l 162 234 l 162 211.598 l 162 206.789 161.016 202.211
 159.293 198 c h
366.012 330 m 366 66 l 210 66 l 210 330 l h
198 354 m 198 366 l 210 366 l 210 354 l h
222 354 m 222 366 l 234 366 l 234 354 l h
258 354 m 246 354 l 246 366 l 258 366 l h
174 354 m 174 366 l 186 366 l 186 354 l h
258 282 m 222 282 l 222 294 l 258 294 l h
270 294 m 354 294 l 354 282 l 270 282 l h
222 318 m 354 318 l 354 306 l 222 306 l h
222 318 m W n
[6 0 0 6 0 0] concat
/CairoFunction
   << /FunctionType 2
      /Domain [ 0 1 ]
      /C0 [ 0.623529 0.184314 1 ]
      /C1 [ 0.0431373 0.694118 0.827451 ]
      /N 1
   >>
def
   << /ShadingType 2
      /ColorSpace /DeviceRGB
      /Coords [ 32 63 32 1 ]
      /Extend [ true true ]
      /Function CairoFunction
   >>
shfill
Q
Q Q
showpage
%%Trailer
end
%%EOF
