%!PS-Adobe-3.0 EPSF-3.0
%%Creator: cairo 1.16.0 (https://cairographics.org)
%%CreationDate: Mon May  4 07:13:15 2020
%%Pages: 1
%%DocumentData: Clean7Bit
%%LanguageLevel: 3
%%BoundingBox: 6 6 383 378
%%EndComments
%%BeginProlog
50 dict begin
/q { gsave } bind def
/Q { grestore } bind def
/cm { 6 array astore concat } bind def
/w { setlinewidth } bind def
/J { setlinecap } bind def
/j { setlinejoin } bind def
/M { setmiterlimit } bind def
/d { setdash } bind def
/m { moveto } bind def
/l { lineto } bind def
/c { curveto } bind def
/h { closepath } bind def
/re { exch dup neg 3 1 roll 5 3 roll moveto 0 rlineto
      0 exch rlineto 0 rlineto closepath } bind def
/S { stroke } bind def
/f { fill } bind def
/f* { eofill } bind def
/n { newpath } bind def
/W { clip } bind def
/W* { eoclip } bind def
/BT { } bind def
/ET { } bind def
/BDC { mark 3 1 roll /BDC pdfmark } bind def
/EMC { mark /EMC pdfmark } bind def
/cairo_store_point { /cairo_point_y exch def /cairo_point_x exch def } def
/Tj { show currentpoint cairo_store_point } bind def
/TJ {
  {
    dup
    type /stringtype eq
    { show } { -0.001 mul 0 cairo_font_matrix dtransform rmoveto } ifelse
  } forall
  currentpoint cairo_store_point
} bind def
/cairo_selectfont { cairo_font_matrix aload pop pop pop 0 0 6 array astore
    cairo_font exch selectfont cairo_point_x cairo_point_y moveto } bind def
/Tf { pop /cairo_font exch def /cairo_font_matrix where
      { pop cairo_selectfont } if } bind def
/Td { matrix translate cairo_font_matrix matrix concatmatrix dup
      /cairo_font_matrix exch def dup 4 get exch 5 get cairo_store_point
      /cairo_font where { pop cairo_selectfont } if } bind def
/Tm { 2 copy 8 2 roll 6 array astore /cairo_font_matrix exch def
      cairo_store_point /cairo_font where { pop cairo_selectfont } if } bind def
/g { setgray } bind def
/rg { setrgbcolor } bind def
/d1 { setcachedevice } bind def
/cairo_data_source {
  CairoDataIndex CairoData length lt
    { CairoData CairoDataIndex get /CairoDataIndex CairoDataIndex 1 add def }
    { () } ifelse
} def
/cairo_flush_ascii85_file { cairo_ascii85_file status { cairo_ascii85_file flushfile } if } def
/cairo_image { image cairo_flush_ascii85_file } def
/cairo_imagemask { imagemask cairo_flush_ascii85_file } def
%%EndProlog
%%BeginSetup
%%EndSetup
%%Page: 1 1
%%BeginPageSetup
%%PageBoundingBox: 6 6 383 378
%%EndPageSetup
q 6 6 377 372 rectclip
1 0 0 -1 0 384 cm q
q
275.688 289.266 m 382.598 222.449 l 351.602 199.199 l 344.398 208.801 l
 361.398 221.551 l 276.305 274.734 l 252.199 256.648 l 183.961 302.148 l
 177.559 266.23 156.121 235.355 126 216.574 c 126 185.992 l 132 185.992 
l 132 186 l 132.031 186 132.059 185.992 132.086 185.992 c 348 185.992 l 
357.926 185.992 366 177.918 366 167.992 c 366 165.625 365.516 163.375 364.68
 161.305 c 372.328 159.227 378 152.293 378 144 c 378 139.375 376.195 135.191
 373.32 132 c 376.199 128.809 378 124.625 378 120 c 378 115.375 376.195 
111.191 373.32 108 c 376.199 104.809 378 100.625 378 96 c 378 86.074 369.926
 78 360.008 78 c 330 78 l 323.383 78 318 72.613 318 66 c 318 36 l 318 27.984
 314.875 20.453 309.211 14.785 c 303.547 9.121 296.016 6 288.008 6 c 288
 6 l 278.074 6 270 14.074 270 24 c 270 38.832 l 270 49.789 264.16 60.102
 254.766 65.742 c 245.891 71.07 239.203 79.41 235.938 89.219 c 235.855 89.473
 l 161.844 80.766 l 161.551 74.543 160.055 68.477 157.391 62.867 c 167.609
 53.035 174 39.258 174 24 c 174 14.074 165.926 6 156 6 c 93.582 6 l 45.289
 6 6 45.289 6 93.582 c 6 126.965 24.551 156.984 54.406 171.918 c 66 177.707
 l 66 200.438 l 43.711 213.07 30 236.398 30 262.246 c 30 378 l 378 378 l
 378 270 l 342 270 l 342 366 l 330 366 l 330 294 l 294 294 l 294 366 l 282
 366 l 282 318 l 246 318 l 246 366 l 234 366 l 234 342 l 198 342 l 198 366
 l 186 366 l 186 324.66 l 186 321.57 185.789 318.535 185.574 315.492 c 251.797
 271.344 l h
354 282 m 366 282 l 366 366 l 354 366 l h
306 306 m 318 306 l 318 366 l 306 366 l h
258 330 m 270 330 l 270 366 l 258 366 l h
210 354 m 222 354 l 222 366 l 210 366 l h
170.965 298.766 m 117.414 263.07 l 130.414 250.066 l 73.039 224.566 l 76.488
 210.762 l 123.703 218.148 160.59 253.531 170.965 298.766 c h
260.941 76.031 m 273.93 68.238 282 53.98 282 38.832 c 282 24 l 282 20.688
 284.688 18 288 18 c 288.008 18 l 292.812 18 297.328 19.871 300.727 23.27
 c 304.121 26.672 306 31.188 306 36 c 306 66 l 306 79.23 316.766 90 330 
90 c 360.008 90 l 363.312 90 366 92.688 366 96 c 366 99.312 363.312 102 
360 102 c 318 102 l 318 114 l 360 114 l 363.312 114 366 116.688 366 120 
c 366 123.312 363.312 126 360 126 c 318 126 l 318 138 l 360 138 l 363.312
 138 366 140.688 366 144 c 366 147.312 363.312 150 360 150 c 318 150 l 318
 162 l 348 162 l 351.312 162 354 164.688 354 168 c 354 171.312 351.312 174
 348 174 c 246 174 l 246 96.973 l 247.324 93.012 l 249.684 85.914 254.52
 79.883 260.941 76.031 c h
234 173.992 m 155.855 173.992 l 159.66 168.965 162 162.773 162 156 c 162
 129.707 l 163.48 128.965 l 169.969 125.723 174 119.203 174 111.949 c 174
 108.176 172.891 104.527 170.801 101.387 c 165.383 93.266 l 234 101.336 
l h
150 82.973 m 150 86.371 l 150 89.93 151.043 93.379 153.023 96.355 c 160.816
 108.047 l 161.594 109.207 162 110.555 162 111.949 c 162 114.629 160.512
 117.035 158.117 118.234 c 156.637 118.98 l 152.543 121.02 150 125.129 150
 129.707 c 150 156 l 150 165.895 141.973 173.941 132.086 173.992 c 102 173.992
 l 102 185.992 l 114 185.992 l 114 210.023 l 102.848 204.641 90.77 200.852
 78 198.887 c 78 141 l 59.605 127.199 l 56.094 124.57 54 120.383 54 115.996
 c 54 108.281 60.281 102 67.996 102 c 78 102 l 78 90.738 l 78 83.395 82.445
 76.922 89.07 74.16 c 92.812 76.566 97.23 78 102 78 c 120 78 l 130.078 78
 139.48 75.176 147.562 70.352 c 149.125 74.363 150 78.625 150 82.973 c h
59.777 161.18 m 34.008 148.297 18 122.395 18 93.582 c 18 51.906 51.898 
18 93.582 18 c 156 18 l 159.312 18 162 20.695 162 24 c 162 47.16 143.152
 66 120 66 c 102 66 l 95.383 66 90 60.617 90 54 c 90 47.383 95.383 42 102
 42 c 102 30 l 88.766 30 78 40.766 78 54 c 78 57.973 79.062 61.668 80.777
 64.973 c 72 70.156 66.234 79.523 66.008 90.078 c 52.602 91.098 42 102.336
 42 115.996 c 42 124.133 45.883 131.91 52.398 136.793 c 66 147 l 66 164.293
 l h
174 366 m 90 366 l 90 280.969 l 90 268.602 84.984 256.5 76.242 247.758 
c 67.758 256.242 l 74.27 262.754 78 271.766 78 280.969 c 78 366 l 42 366
 l 42 262.246 l 42 244.777 49.613 228.762 62.387 217.711 c 58.957 231.438
 l 109.586 253.938 l 98.586 264.938 l 173.551 314.914 l 173.82 318.133 174
 321.379 174 324.66 c h
186 234 m 186 222 l 198 222 l 198 234 l h
210 234 m 210 222 l 222 222 l 222 234 l h
234 234 m 234 222 l 246 222 l 246 234 l h
234 234 m W n
[6 0 0 6 0 0] concat
/CairoFunction
   << /FunctionType 2
      /Domain [ 0 1 ]
      /C0 [ 0.623529 0.184314 1 ]
      /C1 [ 0.0431373 0.694118 0.827451 ]
      /N 1
   >>
def
   << /ShadingType 2
      /ColorSpace /DeviceRGB
      /Coords [ 32.382999 63 32.382999 1 ]
      /Extend [ true true ]
      /Function CairoFunction
   >>
shfill
Q
Q Q
showpage
%%Trailer
end
%%EOF
