%!PS-Adobe-3.0 EPSF-3.0
%%Creator: cairo 1.16.0 (https://cairographics.org)
%%CreationDate: Mon May  4 07:13:09 2020
%%Pages: 1
%%DocumentData: Clean7Bit
%%LanguageLevel: 3
%%BoundingBox: 6 6 378 378
%%EndComments
%%BeginProlog
50 dict begin
/q { gsave } bind def
/Q { grestore } bind def
/cm { 6 array astore concat } bind def
/w { setlinewidth } bind def
/J { setlinecap } bind def
/j { setlinejoin } bind def
/M { setmiterlimit } bind def
/d { setdash } bind def
/m { moveto } bind def
/l { lineto } bind def
/c { curveto } bind def
/h { closepath } bind def
/re { exch dup neg 3 1 roll 5 3 roll moveto 0 rlineto
      0 exch rlineto 0 rlineto closepath } bind def
/S { stroke } bind def
/f { fill } bind def
/f* { eofill } bind def
/n { newpath } bind def
/W { clip } bind def
/W* { eoclip } bind def
/BT { } bind def
/ET { } bind def
/BDC { mark 3 1 roll /BDC pdfmark } bind def
/EMC { mark /EMC pdfmark } bind def
/cairo_store_point { /cairo_point_y exch def /cairo_point_x exch def } def
/Tj { show currentpoint cairo_store_point } bind def
/TJ {
  {
    dup
    type /stringtype eq
    { show } { -0.001 mul 0 cairo_font_matrix dtransform rmoveto } ifelse
  } forall
  currentpoint cairo_store_point
} bind def
/cairo_selectfont { cairo_font_matrix aload pop pop pop 0 0 6 array astore
    cairo_font exch selectfont cairo_point_x cairo_point_y moveto } bind def
/Tf { pop /cairo_font exch def /cairo_font_matrix where
      { pop cairo_selectfont } if } bind def
/Td { matrix translate cairo_font_matrix matrix concatmatrix dup
      /cairo_font_matrix exch def dup 4 get exch 5 get cairo_store_point
      /cairo_font where { pop cairo_selectfont } if } bind def
/Tm { 2 copy 8 2 roll 6 array astore /cairo_font_matrix exch def
      cairo_store_point /cairo_font where { pop cairo_selectfont } if } bind def
/g { setgray } bind def
/rg { setrgbcolor } bind def
/d1 { setcachedevice } bind def
/cairo_data_source {
  CairoDataIndex CairoData length lt
    { CairoData CairoDataIndex get /CairoDataIndex CairoDataIndex 1 add def }
    { () } ifelse
} def
/cairo_flush_ascii85_file { cairo_ascii85_file status { cairo_ascii85_file flushfile } if } def
/cairo_image { image cairo_flush_ascii85_file } def
/cairo_imagemask { imagemask cairo_flush_ascii85_file } def
%%EndProlog
%%BeginSetup
%%EndSetup
%%Page: 1 1
%%BeginPageSetup
%%PageBoundingBox: 6 6 378 378
%%EndPageSetup
q 6 6 372 372 rectclip
1 0 0 -1 0 384 cm q
q
206.879 310.109 m 208.848 307.223 210 303.742 210 300 c 210 290.074 201.926
 282 192 282 c 182.074 282 174 290.074 174 300 c 174 303.742 175.152 307.223
 177.121 310.109 c 168.133 315.293 162 324.898 162 336 c 162 354 l 222 354
 l 222 336 l 222 324.898 215.867 315.293 206.879 310.109 c h
186 300 m 186 296.695 188.695 294 192 294 c 195.305 294 198 296.695 198
 300 c 198 303.305 195.305 306 192 306 c 188.695 306 186 303.305 186 300
 c h
210 342 m 174 342 l 174 336 l 174 326.074 182.074 318 192 318 c 201.926
 318 210 326.074 210 336 c h
366 258 m 354 258 l 354 168 l 354 160.781 349.703 154.59 343.566 151.723
 c 357.125 141.906 366 125.988 366 108 c 366 78.227 341.773 54 312 54 c 
294.227 54 278.484 62.672 268.637 75.953 c 269.43 70.391 l 269.809 67.754
 270 65.074 270 62.375 c 270 31.289 244.711 6 213.625 6 c 170.719 6 l 155.594
 6 141.383 11.91 130.715 22.645 c 120.055 33.379 114.234 47.621 114.336 
62.754 c 114.355 65.191 114.527 67.648 114.863 70.074 c 118.934 99.59 l 
115.883 103.613 114 108.57 114 114 c 114 127.234 124.766 138 138 138 c 138.48
 138 l 140.699 153.402 151.277 166.098 165.473 171.355 c 163.145 180.672
 l 154.59 181.984 l 115.121 188.059 84.68 218.945 78.75 257.992 c 18 257.992
 l 11.383 257.992 6 263.375 6 269.992 c 6 365.992 l 6 372.613 11.383 377.992
 18 377.992 c 102 377.992 l 108.617 377.992 114 372.613 114 365.992 c 114
 306 l 138 306 l 138 366 l 138 372.617 143.383 378 150 378 c 234 378 l 240.617
 378 246 372.617 246 366 c 246 306 l 270 306 l 270 366 l 270 372.617 275.383
 378 282 378 c 366 378 l 372.617 378 378 372.617 378 366 c 378 270 l 378
 263.383 372.617 258 366 258 c h
301.422 258 m 309.199 221.719 l 310.117 221.863 311.039 222 312 222 c 320.297
 222 327.234 216.328 329.305 208.68 c 331.379 209.516 333.629 210 336 210
 c 338.113 210 340.117 209.566 342 208.895 c 342 258 l h
179.855 202.391 m 165.344 208.199 l 159.422 193.387 l 166.414 192.312 l
 h
190.324 234 m 193.68 234 l 201.68 258 l 182.328 258 l h
193.844 222 m 190.156 222 l 186.637 212.609 l 192 210.461 l 197.363 212.605
 l h
204.145 202.391 m 217.586 192.312 l 224.578 193.387 l 218.656 208.199 l
 h
229.41 181.992 m 220.855 180.68 l 218.527 171.359 l 232.723 166.098 243.305
 153.402 245.52 138.008 c 246 138.008 l 252.703 138.008 258.75 135.234 263.113
 130.789 c 267.031 139.164 273.02 146.359 280.441 151.727 c 274.297 154.59
 270 160.781 270 168 c 270 177.926 278.074 186 288 186 c 290.113 186 292.117
 185.566 294 184.895 c 294 204 l 294 208.387 295.637 212.359 298.262 215.488
 c 295.453 228.59 l 282.125 203.941 257.824 186.367 229.41 181.992 c h
246 102 m 252.617 102 258 107.383 258 114 c 258 120.617 252.617 126 246
 126 c h
318 204 m 318 207.305 315.305 210 312 210 c 308.695 210 306 207.305 306
 204 c 306 161.645 l 307.973 161.867 309.973 162 312 162 c 314.027 162 316.027
 161.867 318 161.645 c h
288 162 m 291.305 162 294 164.695 294 168 c 294 171.305 291.305 174 288
 174 c 284.695 174 282 171.305 282 168 c 282 164.695 284.695 162 288 162
 c h
336 198 m 332.695 198 330 195.305 330 192 c 330 168 l 330 164.695 332.695
 162 336 162 c 339.305 162 342 164.695 342 168 c 342 192 l 342 195.305 339.305
 198 336 198 c h
312 66 m 335.16 66 354 84.84 354 108 c 354 131.16 335.16 150 312 150 c 
288.84 150 270 131.16 270 108 c 270 84.84 288.84 66 312 66 c h
126 114 m 126 107.383 131.383 102 138 102 c 138 126 l 131.383 126 126 120.617
 126 114 c h
138 84 m 138 90 l 135.156 90 132.469 90.582 129.93 91.492 c 126.75 68.438
 l 126.484 66.527 126.348 64.59 126.336 62.676 c 126.258 50.766 130.836 
39.551 139.23 31.105 c 147.625 22.656 158.809 18 170.719 18 c 213.625 18
 l 238.094 18 258 37.906 258 62.418 c 258 64.508 257.852 66.617 257.555 
68.695 c 254.293 91.559 l 251.695 90.602 248.922 90 246 90 c 246 79.414 
l 246 70.008 241.324 61.469 233.633 56.375 c 231.949 48.18 224.684 42 216
 42 c 210 42 l 210 54 l 216 54 l 219.305 54 222 56.695 222 60 c 222 63.305
 219.305 66 216 66 c 198 66 l 184.766 66 174 55.234 174 42 c 162 42 l 162
 46.355 162.816 50.516 164.238 54.379 c 149.484 56.258 138 68.746 138 84
 c h
150 132 m 150 84 l 150 74.074 158.074 66 168 66 c 171.238 66 l 177.836 
73.344 187.367 78 198 78 c 216 78 l 222.156 78 227.594 74.887 230.844 70.152
 c 232.801 72.797 234 75.973 234 79.414 c 234 132 l 234 148.543 220.543 
162 204 162 c 180 162 l 163.457 162 150 148.543 150 132 c h
180 174 m 204 174 l 204.938 174 205.859 173.922 206.777 173.863 c 209.207
 183.594 l 192 196.5 l 174.785 183.59 l 177.215 173.855 l 178.141 173.922
 179.062 174 180 174 c h
18 366 m 18 270 l 102 270 l 102.008 366 l h
138 270 m 138 294 l 114 294 l 114 270 l 114 263.383 108.617 258 102 258
 c 90.852 258 l 96.113 227.969 118.219 203.855 147.469 195.828 c 158.656
 223.801 l 175.492 217.066 l 179.641 228.121 l 169.676 258 l 150 258 l 143.383
 258 138 263.383 138 270 c h
150 366 m 150 270 l 234 270 l 234.008 366 l h
270 270 m 270 294 l 246 294 l 246 270 l 246 263.383 240.617 258 234 258
 c 214.324 258 l 204.367 228.121 l 208.512 217.066 l 225.348 223.801 l 236.539
 195.82 l 262.488 202.992 283.266 223.086 291.043 249.191 c 289.145 258 
l 282 258 l 275.383 258 270 263.383 270 270 c h
282 366 m 282 270 l 366 270 l 366.008 366 l h
338.879 310.109 m 340.848 307.223 342 303.742 342 300 c 342 290.074 333.926
 282 324 282 c 314.074 282 306 290.074 306 300 c 306 303.742 307.152 307.223
 309.121 310.109 c 300.133 315.293 294 324.898 294 336 c 294 354 l 354 354
 l 354 336 l 354 324.898 347.867 315.293 338.879 310.109 c h
318 300 m 318 296.695 320.695 294 324 294 c 327.305 294 330 296.695 330
 300 c 330 303.305 327.305 306 324 306 c 320.695 306 318 303.305 318 300
 c h
342 342 m 306 342 l 306 336 l 306 326.074 314.074 318 324 318 c 333.926
 318 342 326.074 342 336 c h
74.879 310.109 m 76.848 307.223 78 303.742 78 300 c 78 290.074 69.926 282
 60 282 c 50.074 282 42 290.074 42 300 c 42 303.742 43.152 307.223 45.121
 310.109 c 36.133 315.293 30 324.898 30 336 c 30 354 l 90 354 l 90 336 l
 90 324.898 83.867 315.293 74.879 310.109 c h
54 300 m 54 296.695 56.695 294 60 294 c 63.305 294 66 296.695 66 300 c 
66 303.305 63.305 306 60 306 c 56.695 306 54 303.305 54 300 c h
78 342 m 42 342 l 42 336 l 42 326.074 50.074 318 60 318 c 69.926 318 78
 326.074 78 336 c h
174 96 m 174 99.312 171.312 102 168 102 c 164.688 102 162 99.312 162 96
 c 162 92.688 164.688 90 168 90 c 171.312 90 174 92.688 174 96 c h
210 96 m 210 92.688 212.688 90 216 90 c 219.312 90 222 92.688 222 96 c 
222 99.312 219.312 102 216 102 c 212.688 102 210 99.312 210 96 c h
198 150 m 174 150 l 174 138 l 198 138 l 204.617 138 210 132.617 210 126
 c 222 126 l 222 139.234 211.234 150 198 150 c h
312 138 m 328.543 138 342 124.543 342 108 c 342 91.457 328.543 78 312 78
 c 295.457 78 282 91.457 282 108 c 282 124.543 295.457 138 312 138 c h
312 90 m 321.926 90 330 98.074 330 108 c 330 117.926 321.926 126 312 126
 c 302.074 126 294 117.926 294 108 c 294 98.074 302.074 90 312 90 c h
312 90 m W n
[6 0 0 6 0 0] concat
/CairoFunction
   << /FunctionType 2
      /Domain [ 0 1 ]
      /C0 [ 0.623529 0.184314 1 ]
      /C1 [ 0.0431373 0.694118 0.827451 ]
      /N 1
   >>
def
   << /ShadingType 2
      /ColorSpace /DeviceRGB
      /Coords [ 32 63 32 1 ]
      /Extend [ true true ]
      /Function CairoFunction
   >>
shfill
Q
Q Q
showpage
%%Trailer
end
%%EOF
