%!PS-Adobe-3.0 EPSF-3.0
%%Creator: cairo 1.16.0 (https://cairographics.org)
%%CreationDate: Mon May  4 07:13:10 2020
%%Pages: 1
%%DocumentData: Clean7Bit
%%LanguageLevel: 3
%%BoundingBox: 6 6 378 378
%%EndComments
%%BeginProlog
50 dict begin
/q { gsave } bind def
/Q { grestore } bind def
/cm { 6 array astore concat } bind def
/w { setlinewidth } bind def
/J { setlinecap } bind def
/j { setlinejoin } bind def
/M { setmiterlimit } bind def
/d { setdash } bind def
/m { moveto } bind def
/l { lineto } bind def
/c { curveto } bind def
/h { closepath } bind def
/re { exch dup neg 3 1 roll 5 3 roll moveto 0 rlineto
      0 exch rlineto 0 rlineto closepath } bind def
/S { stroke } bind def
/f { fill } bind def
/f* { eofill } bind def
/n { newpath } bind def
/W { clip } bind def
/W* { eoclip } bind def
/BT { } bind def
/ET { } bind def
/BDC { mark 3 1 roll /BDC pdfmark } bind def
/EMC { mark /EMC pdfmark } bind def
/cairo_store_point { /cairo_point_y exch def /cairo_point_x exch def } def
/Tj { show currentpoint cairo_store_point } bind def
/TJ {
  {
    dup
    type /stringtype eq
    { show } { -0.001 mul 0 cairo_font_matrix dtransform rmoveto } ifelse
  } forall
  currentpoint cairo_store_point
} bind def
/cairo_selectfont { cairo_font_matrix aload pop pop pop 0 0 6 array astore
    cairo_font exch selectfont cairo_point_x cairo_point_y moveto } bind def
/Tf { pop /cairo_font exch def /cairo_font_matrix where
      { pop cairo_selectfont } if } bind def
/Td { matrix translate cairo_font_matrix matrix concatmatrix dup
      /cairo_font_matrix exch def dup 4 get exch 5 get cairo_store_point
      /cairo_font where { pop cairo_selectfont } if } bind def
/Tm { 2 copy 8 2 roll 6 array astore /cairo_font_matrix exch def
      cairo_store_point /cairo_font where { pop cairo_selectfont } if } bind def
/g { setgray } bind def
/rg { setrgbcolor } bind def
/d1 { setcachedevice } bind def
/cairo_data_source {
  CairoDataIndex CairoData length lt
    { CairoData CairoDataIndex get /CairoDataIndex CairoDataIndex 1 add def }
    { () } ifelse
} def
/cairo_flush_ascii85_file { cairo_ascii85_file status { cairo_ascii85_file flushfile } if } def
/cairo_image { image cairo_flush_ascii85_file } def
/cairo_imagemask { imagemask cairo_flush_ascii85_file } def
%%EndProlog
%%BeginSetup
%%EndSetup
%%Page: 1 1
%%BeginPageSetup
%%PageBoundingBox: 6 6 378 378
%%EndPageSetup
q 6 6 372 372 rectclip
1 0 0 -1 0 384 cm q
q
36 378 m 313.414 378 l 369.312 350.051 l 374.672 347.375 378 341.988 378
 336 c 378 330.012 374.672 324.625 369.316 321.949 c 313.414 294 l 282 294
 l 282 270 l 354 270 l 354 258 l 282 258 l 282 234 l 318 234 l 318 222 l
 282 222 l 282 198 l 342 198 l 342 186 l 282 186 l 282 152.676 l 282.031
 152.652 282.055 152.633 282.09 152.609 c 285.762 150.145 290.676 150.617
 293.777 153.715 c 306.551 166.488 l 340.492 132.547 l 327.715 119.773 l
 324.613 116.672 324.148 111.758 326.762 107.867 c 329.207 104.195 333.926
 102.758 337.961 104.438 c 354.652 111.348 l 373.027 67.004 l 356.527 60.16
 l 352.379 58.445 349.996 54 350.875 49.598 c 351.75 45.199 355.645 42 360.133
 42 c 378 42 l 378 6 l 6 6 l 6 42 l 23.867 42 l 28.355 42 32.25 45.199 33.133
 49.609 c 34.008 54.012 31.625 58.457 27.48 60.176 c 10.98 67.016 l 29.352
 111.359 l 46.043 104.449 l 50.062 102.773 54.781 104.195 57.391 108.09 
c 59.855 111.77 59.371 116.707 56.242 119.832 c 43.52 132.559 l 77.461 166.5
 l 90.234 153.727 l 93.301 150.652 98.148 150.191 102.012 152.707 c 102.012
 186 l 42 186 l 42 198 l 102 198 l 102 222 l 66 222 l 66 234 l 102 234 l
 102 258 l 30 258 l 30 270 l 102 270 l 102 294 l 36 294 l 19.457 294 6 307.457
 6 324 c 6 348 l 6 364.543 19.457 378 36 378 c h
90 342 m 306 342 l 306 366 l 90 366 l h
318 309.707 m 342 321.707 l 342 350.293 l 318 362.293 l h
306 330 m 90 330 l 90 306 l 306 306 l h
78 366 m 66 366 l 66 306 l 78 306 l h
366 336 m 366 337.414 365.215 338.684 363.949 339.316 c 354 344.293 l 354
 327.707 l 363.949 332.684 l 365.215 333.316 366 334.586 366 336 c h
234 66 m 234 126 l 150 126 l 150 54 l 222 54 l 222 66 l h
234 54 m 234 26.484 l 261.516 54 l h
366 30 m 360.133 30 l 349.934 30 341.09 37.262 339.102 47.27 c 337.117 
57.27 342.512 67.355 351.93 71.258 c 357.344 73.5 l 348.16 95.672 l 342.551
 93.348 l 333.246 89.488 322.41 92.797 316.648 101.395 c 311.004 109.812
 312.086 121.105 319.23 128.258 c 323.527 132.547 l 306.551 149.52 l 302.262
 145.223 l 296.887 139.855 289.164 137.91 282 139.734 c 282 122.543 l 312.523
 96.258 330 58.344 330 17.992 c 366 17.992 l h
282 106.164 m 282 57.516 l 242.484 18 l 318 18 l 318 51.246 305.016 82.699
 282 106.164 c h
102 106.172 m 78.984 82.711 66 51.266 66 18 c 102 18 l h
81.738 145.23 m 77.449 149.52 l 60.473 132.547 l 64.715 128.305 l 71.887
 121.141 72.996 109.816 67.172 101.129 c 61.566 92.766 50.754 89.496 41.441
 93.348 c 35.832 95.672 l 26.652 73.5 l 32.062 71.258 l 41.477 67.355 46.879
 57.27 44.891 47.27 c 42.906 37.262 34.066 30 23.867 30 c 18 30 l 18 18 
l 54 18 l 54 58.363 71.477 96.258 102 122.543 c 102 139.715 l 94.895 137.91
 87.137 139.844 81.738 145.23 c h
114 18 m 222 18 l 222 42 l 138 42 l 138 138 l 246 138 l 246 66 l 270 66
 l 270 294 l 114 294 l h
18 324 m 18 314.074 26.074 306 36 306 c 54 306 l 54 366 l 36 366 l 26.074
 366 18 357.926 18 348 c h
138 222 m 246 222 l 246 234 l 138 234 l h
138 198 m 246 198 l 246 210 l 138 210 l h
138 174 m 246 174 l 246 186 l 138 186 l h
162 162 m 138 162 l 138 150 l 162 150 l h
174 150 m 246 150 l 246 162 l 174 162 l h
138 258 m 150 258 l 150 270 l 138 270 l h
162 258 m 174 258 l 174 270 l 162 270 l h
186 258 m 198 258 l 198 270 l 186 270 l h
210 258 m 222 258 l 222 270 l 210 270 l h
234 258 m 246 258 l 246 270 l 234 270 l h
18 270 m 6 270 l 6 258 l 18 258 l h
54 222 m 54 234 l 42 234 l 42 222 l h
30 198 m 18 198 l 18 186 l 30 186 l h
378 270 m 366 270 l 366 258 l 378 258 l h
330 234 m 330 222 l 342 222 l 342 234 l h
366 198 m 354 198 l 354 186 l 366 186 l h
366 198 m W n
[6 0 0 6 0 0] concat
/CairoFunction
   << /FunctionType 2
      /Domain [ 0 1 ]
      /C0 [ 0.623529 0.184314 1 ]
      /C1 [ 0.0431373 0.694118 0.827451 ]
      /N 1
   >>
def
   << /ShadingType 2
      /ColorSpace /DeviceRGB
      /Coords [ 32 63 32 1 ]
      /Extend [ true true ]
      /Function CairoFunction
   >>
shfill
Q
Q Q
showpage
%%Trailer
end
%%EOF
