%!PS-Adobe-3.0 EPSF-3.0
%%Creator: cairo 1.16.0 (https://cairographics.org)
%%CreationDate: Mon May  4 07:13:29 2020
%%Pages: 1
%%DocumentData: Clean7Bit
%%LanguageLevel: 3
%%BoundingBox: 6 6 383 378
%%EndComments
%%BeginProlog
50 dict begin
/q { gsave } bind def
/Q { grestore } bind def
/cm { 6 array astore concat } bind def
/w { setlinewidth } bind def
/J { setlinecap } bind def
/j { setlinejoin } bind def
/M { setmiterlimit } bind def
/d { setdash } bind def
/m { moveto } bind def
/l { lineto } bind def
/c { curveto } bind def
/h { closepath } bind def
/re { exch dup neg 3 1 roll 5 3 roll moveto 0 rlineto
      0 exch rlineto 0 rlineto closepath } bind def
/S { stroke } bind def
/f { fill } bind def
/f* { eofill } bind def
/n { newpath } bind def
/W { clip } bind def
/W* { eoclip } bind def
/BT { } bind def
/ET { } bind def
/BDC { mark 3 1 roll /BDC pdfmark } bind def
/EMC { mark /EMC pdfmark } bind def
/cairo_store_point { /cairo_point_y exch def /cairo_point_x exch def } def
/Tj { show currentpoint cairo_store_point } bind def
/TJ {
  {
    dup
    type /stringtype eq
    { show } { -0.001 mul 0 cairo_font_matrix dtransform rmoveto } ifelse
  } forall
  currentpoint cairo_store_point
} bind def
/cairo_selectfont { cairo_font_matrix aload pop pop pop 0 0 6 array astore
    cairo_font exch selectfont cairo_point_x cairo_point_y moveto } bind def
/Tf { pop /cairo_font exch def /cairo_font_matrix where
      { pop cairo_selectfont } if } bind def
/Td { matrix translate cairo_font_matrix matrix concatmatrix dup
      /cairo_font_matrix exch def dup 4 get exch 5 get cairo_store_point
      /cairo_font where { pop cairo_selectfont } if } bind def
/Tm { 2 copy 8 2 roll 6 array astore /cairo_font_matrix exch def
      cairo_store_point /cairo_font where { pop cairo_selectfont } if } bind def
/g { setgray } bind def
/rg { setrgbcolor } bind def
/d1 { setcachedevice } bind def
/cairo_data_source {
  CairoDataIndex CairoData length lt
    { CairoData CairoDataIndex get /CairoDataIndex CairoDataIndex 1 add def }
    { () } ifelse
} def
/cairo_flush_ascii85_file { cairo_ascii85_file status { cairo_ascii85_file flushfile } if } def
/cairo_image { image cairo_flush_ascii85_file } def
/cairo_imagemask { imagemask cairo_flush_ascii85_file } def
%%EndProlog
%%BeginSetup
%%EndSetup
%%Page: 1 1
%%BeginPageSetup
%%PageBoundingBox: 6 6 383 378
%%EndPageSetup
q 6 6 377 372 rectclip
1 0 0 -1 0 384 cm q
q
78 120 m 78 116.688 80.688 114 84 114 c 87.312 114 90 116.688 90 120 c 
90 123.312 87.312 126 84 126 c 80.688 126 78 123.312 78 120 c h
132 114 m 128.688 114 126 116.688 126 120 c 126 123.312 128.688 126 132
 126 c 135.312 126 138 123.312 138 120 c 138 116.688 135.312 114 132 114
 c h
78 138 m 138 138 l 138 144 l 138 160.543 124.543 174 108 174 c 91.457 174
 78 160.543 78 144 c h
91.027 150 m 93.504 156.984 100.176 162 108 162 c 115.824 162 122.496 156.984
 124.973 150 c h
115.758 76.242 m 122.363 82.848 126 91.625 126 100.973 c 126 102 l 138 
102 l 138 100.973 l 138 88.43 133.117 76.633 124.242 67.758 c h
306 113.527 m 306 90 l 185.652 90 l 185.406 92.707 185.039 95.398 184.508
 98.062 c 182.898 106.117 l 191.875 111.305 198 120.906 198 132 c 198 138.781
 195.652 144.973 191.844 150 c 306 150 l 306 126.473 l 382.465 180 l 306
 233.527 l 306 210 l 136.922 210 l 137.184 211.324 l 162.227 218.633 183.492
 235.363 196.492 258 c 222 258 l 222.086 273.188 l 222.484 273.684 l 233.699
 262.836 l 240.871 270 l 306 270 l 306 246.473 l 382.465 300 l 306 353.527
 l 306 330 l 264 330 l 264 336 l 248.844 336 l 248.348 336.434 l 248.297
 336.625 248.305 336.84 248.438 336.973 c 259.164 347.699 l 233.699 373.164
 l 222.973 362.441 l 222.895 362.477 l 222.324 362.387 l 222 378 l 186 378
 l 185.914 362.812 l 185.516 362.316 l 174.301 373.164 l 167.137 366 l 6
 366 l 6 308.215 l 6 272.215 24.953 239.965 54.445 222 c 48 222 l 31.457
 222 18 208.543 18 192 c 18 132 l 18 120.719 24.336 110.988 33.562 105.871
 c 30.73 88.883 l 30.246 85.98 30 83.004 30 80.051 c 30 74.309 l 30 52.625
 42.762 33.367 62.629 24.898 c 75.355 12.605 91.688 6 109.027 6 c 130.938
 6 150.695 15.254 164.73 30 c 306 30 l 306 6.473 l 382.465 60 l h
30 132 m 30 141.926 38.074 150 48 150 c 54 150 l 54 114 l 48 114 l 38.074
 114 30 122.074 30 132 c h
60 186 m 66.66 186 l 60.215 179.695 55.824 171.344 54.473 162 c 48 162 
l 41.219 162 35.027 159.652 30 155.844 c 30 192 l 30 200.113 35.387 206.98
 42.773 209.227 c 42.27 207.57 42 205.816 42 204 c 42 194.074 50.074 186
 60 186 c h
77.875 224.129 m 85.723 237.211 l 96.629 229.027 l 83.336 222.379 l 81.48
 222.887 79.676 223.508 77.875 224.129 c h
90.703 354 m 125.297 354 l 114.629 258 l 101.371 258 l h
116.941 242.203 m 108 235.5 l 99.059 242.207 l 100.324 246 l 115.68 246
 l h
130.277 237.211 m 138.09 224.184 l 136.289 223.559 134.508 222.887 132.66
 222.379 c 119.363 229.027 l h
120 198 m 96 198 l 95.238 198 94.492 197.93 93.742 197.887 c 90.785 212.684
 l 108 221.293 l 125.219 212.684 l 122.262 197.887 l 121.508 197.93 120.762
 198 120 198 c h
54 204 m 54 207.305 56.695 210 60 210 c 72 210 l 75.305 210 78 207.305 
78 204 c 78 200.695 75.305 198 72 198 c 60 198 l 56.695 198 54 200.695 54
 204 c h
18 354 m 42 354 l 42 294 l 54 294 l 54 354 l 78.629 354 l 89.891 252.648
 l 88.938 249.793 l 82.273 254.789 l 66.727 228.875 l 37.312 243.793 18 
274.094 18 308.215 c h
252.871 282 m 259.172 288.301 l 248.441 299.027 l 248.477 299.105 l 248.387
 299.676 l 264 300 l 264 318 l 318 318 l 318 330.473 l 361.535 300 l 318
 269.527 l 318 282 l h
210 273.156 m 210 270 l 198 270 l 198 273.156 l 198 278.242 194.953 282.781
 190.23 284.719 c 185.473 286.68 180.121 285.617 176.543 282.047 c 174.301
 279.805 l 165.805 288.301 l 168.047 290.543 l 171.625 294.121 172.688 299.465
 170.746 304.164 c 168.781 308.953 164.242 312 159.156 312 c 156 312 l 156
 324 l 159.156 324 l 164.242 324 168.781 327.047 170.719 331.77 c 172.688
 336.527 171.625 341.879 168.047 345.457 c 165.805 347.699 l 174.301 356.195
 l 176.543 353.957 l 180.121 350.383 185.465 349.309 190.164 351.258 c 194.953
 353.219 198 357.758 198 362.844 c 198 366 l 210 366 l 210 362.844 l 210
 357.758 213.047 353.219 217.77 351.281 c 222.539 349.312 227.879 350.375
 231.457 353.953 c 233.699 356.191 l 242.195 347.695 l 239.953 345.449 l
 236.605 342.109 235.457 337.184 236.965 332.594 c 236.965 332.578 l 237.539
 330.852 238.535 329.426 238.727 329.152 c 241.086 325.926 244.867 324 248.844
 324 c 252 324 l 252 312 l 248.844 312 l 243.758 312 239.219 308.953 237.281
 304.23 c 235.312 299.465 236.375 294.121 239.953 290.543 c 242.195 288.301
 l 233.699 279.805 l 231.457 282.047 l 227.875 285.629 222.535 286.691 217.836
 284.746 c 213.047 282.781 210 278.242 210 273.156 c h
149.285 228.852 m 133.723 254.797 l 127.055 249.797 l 126.102 252.652 l
 137.371 354 l 155.137 354 l 148.836 347.699 l 159.562 336.973 l 159.527
 336.895 l 159.617 336.324 l 144 336 l 144 300 l 159.188 299.914 l 159.684
 299.516 l 148.836 288.301 l 174.301 262.836 l 185.027 273.562 l 185.105
 273.527 l 185.676 273.617 l 185.887 263.598 l 177.203 248.652 164.488 236.586
 149.285 228.852 c h
161.52 162 m 159.277 177.582 148.477 190.398 134.023 195.539 c 134.52 198
 l 318 198 l 318 210.473 l 361.535 180 l 318 149.527 l 318 162 l h
186 132 m 186 122.074 177.926 114 168 114 c 162 114 l 162 150 l 168 150
 l 177.926 150 186 141.926 186 132 c h
171.414 102.344 m 172.738 95.711 l 173.574 91.523 174 87.234 174 82.969
 c 174 47.148 144.852 18 109.027 18 c 94.488 18 80.82 23.656 70.543 33.941
 c 69.672 34.812 l 68.227 35.574 l 52.297 41.945 42 57.148 42 74.309 c 42
 80.051 l 42 82.344 42.191 84.652 42.57 86.91 c 45.133 102.293 l 46.094 
102.199 47.016 102 48 102 c 54.48 102 l 57.406 81.68 74.887 66 96 66 c 98.484
 66 l 100.242 67.758 l 109.117 76.625 114 88.422 114 100.973 c 114 102 l
 102 102 l 102 100.973 l 102 92.484 99 84.457 93.492 78.102 c 78.121 79.379
 66 92.305 66 108 c 66 156 l 66 172.543 79.457 186 96 186 c 120 186 l 136.543
 186 150 172.543 150 156 c 150 100.973 l 150 91.633 146.363 82.848 139.758
 76.242 c 148.242 67.758 l 157.117 76.625 162 88.422 162 100.973 c 162 102
 l 168 102 l 169.172 102 170.281 102.215 171.414 102.344 c h
318 78 m 318 90.473 l 361.535 60 l 318 29.527 l 318 42 l 174.07 42 l 180.742
 52.559 184.895 64.824 185.746 78 c h
204 294 m 217.234 294 228 304.766 228 318 c 228 331.234 217.234 342 204
 342 c 190.766 342 180 331.234 180 318 c 180 304.766 190.766 294 204 294
 c h
204 306 m 197.383 306 192 311.383 192 318 c 192 324.617 197.383 330 204
 330 c 210.617 330 216 324.617 216 318 c 216 311.383 210.617 306 204 306
 c h
204 306 m W n
[6 0 0 6 0 0] concat
/CairoFunction
   << /FunctionType 2
      /Domain [ 0 1 ]
      /C0 [ 0.623529 0.184314 1 ]
      /C1 [ 0.0431373 0.694118 0.827451 ]
      /N 1
   >>
def
   << /ShadingType 2
      /ColorSpace /DeviceRGB
      /Coords [ 32.372002 63 32.372002 1 ]
      /Extend [ true true ]
      /Function CairoFunction
   >>
shfill
Q
Q Q
showpage
%%Trailer
end
%%EOF
