%!PS-Adobe-3.0 EPSF-3.0
%%Creator: cairo 1.16.0 (https://cairographics.org)
%%CreationDate: Mon May  4 07:13:19 2020
%%Pages: 1
%%DocumentData: Clean7Bit
%%LanguageLevel: 3
%%BoundingBox: 6 6 378 378
%%EndComments
%%BeginProlog
50 dict begin
/q { gsave } bind def
/Q { grestore } bind def
/cm { 6 array astore concat } bind def
/w { setlinewidth } bind def
/J { setlinecap } bind def
/j { setlinejoin } bind def
/M { setmiterlimit } bind def
/d { setdash } bind def
/m { moveto } bind def
/l { lineto } bind def
/c { curveto } bind def
/h { closepath } bind def
/re { exch dup neg 3 1 roll 5 3 roll moveto 0 rlineto
      0 exch rlineto 0 rlineto closepath } bind def
/S { stroke } bind def
/f { fill } bind def
/f* { eofill } bind def
/n { newpath } bind def
/W { clip } bind def
/W* { eoclip } bind def
/BT { } bind def
/ET { } bind def
/BDC { mark 3 1 roll /BDC pdfmark } bind def
/EMC { mark /EMC pdfmark } bind def
/cairo_store_point { /cairo_point_y exch def /cairo_point_x exch def } def
/Tj { show currentpoint cairo_store_point } bind def
/TJ {
  {
    dup
    type /stringtype eq
    { show } { -0.001 mul 0 cairo_font_matrix dtransform rmoveto } ifelse
  } forall
  currentpoint cairo_store_point
} bind def
/cairo_selectfont { cairo_font_matrix aload pop pop pop 0 0 6 array astore
    cairo_font exch selectfont cairo_point_x cairo_point_y moveto } bind def
/Tf { pop /cairo_font exch def /cairo_font_matrix where
      { pop cairo_selectfont } if } bind def
/Td { matrix translate cairo_font_matrix matrix concatmatrix dup
      /cairo_font_matrix exch def dup 4 get exch 5 get cairo_store_point
      /cairo_font where { pop cairo_selectfont } if } bind def
/Tm { 2 copy 8 2 roll 6 array astore /cairo_font_matrix exch def
      cairo_store_point /cairo_font where { pop cairo_selectfont } if } bind def
/g { setgray } bind def
/rg { setrgbcolor } bind def
/d1 { setcachedevice } bind def
/cairo_data_source {
  CairoDataIndex CairoData length lt
    { CairoData CairoDataIndex get /CairoDataIndex CairoDataIndex 1 add def }
    { () } ifelse
} def
/cairo_flush_ascii85_file { cairo_ascii85_file status { cairo_ascii85_file flushfile } if } def
/cairo_image { image cairo_flush_ascii85_file } def
/cairo_imagemask { imagemask cairo_flush_ascii85_file } def
%%EndProlog
%%BeginSetup
%%EndSetup
%%Page: 1 1
%%BeginPageSetup
%%PageBoundingBox: 6 6 378 378
%%EndPageSetup
q 6 6 372 372 rectclip
1 0 0 -1 0 384 cm q
q
174 96 m 174 99.312 171.312 102 168 102 c 164.688 102 162 99.312 162 96
 c 162 92.688 164.688 90 168 90 c 171.312 90 174 92.688 174 96 c h
216 90 m 212.688 90 210 92.688 210 96 c 210 99.312 212.688 102 216 102 
c 219.312 102 222 99.312 222 96 c 222 92.688 219.312 90 216 90 c h
198 138 m 174 138 l 174 150 l 198 150 l 211.234 150 222 139.234 222 126
 c 210 126 l 210 132.617 204.617 138 198 138 c h
353.789 186 m 378 186 l 378 198 l 353.762 198 l 352.309 237.758 336.582
 274.402 310.723 302.238 c 328.242 319.758 l 319.758 328.242 l 302.238 310.723
 l 286.254 325.543 267.148 337.254 245.641 344.789 c 244.973 347.574 243.336
 349.969 241.098 351.625 c 244.133 355.645 246 360.59 246 366 c 246 372.617
 240.617 378 234 378 c 198 378 l 195.805 378 193.77 377.363 192 376.332 
c 190.23 377.363 188.195 378 186 378 c 150 378 l 143.383 378 138 372.617
 138 366 c 138 360.59 139.867 355.645 142.902 351.625 c 139.945 349.434 
138 345.953 138 342 c 126 342 l 120.941 342 116.629 338.844 114.863 334.41
 c 102.707 327.816 91.602 319.859 81.75 310.734 c 64.242 328.242 l 55.758
 319.758 l 73.234 302.281 l 47.152 274.234 31.648 237.457 30.203 198 c 6
 198 l 6 186 l 30.211 186 l 31.637 146.309 47.137 109.66 73.219 81.703 c
 55.758 64.242 l 64.242 55.758 l 81.715 73.23 l 92.855 62.945 105.562 54.109
 119.652 47.07 c 124.094 39.836 130.855 34.105 139.188 31.184 c 144.438 
16.195 158.598 6 174.738 6 c 209.262 6 l 225.402 6 239.562 16.195 244.812
 31.184 c 253.145 34.105 259.906 39.836 264.348 47.07 c 278.438 54.109 291.145
 62.945 302.285 73.23 c 319.758 55.758 l 328.242 64.242 l 310.781 81.703
 l 336.863 109.66 352.363 146.309 353.789 186 c h
246 126 m 252.617 126 258 120.617 258 114 c 258 107.383 252.617 102 246
 102 c h
126 66.738 m 126 69.371 l 126 70.789 126.121 72.211 126.348 73.59 c 129.359
 91.668 l 132.047 90.629 134.945 90 138 90 c 138.098 90 l 138.602 80.023
 144.293 71.148 153.312 66.629 c 158.672 63.953 162 58.57 162 52.586 c 162
 42 l 174 42 l 174 55.727 184.715 67.375 198.395 68.516 c 223.992 70.645
 l 234.785 71.539 243.523 79.691 245.555 90 c 246 90 l 249.055 90 251.953
 90.629 254.641 91.676 c 257.652 73.602 l 257.879 72.211 258 70.793 258 
69.379 c 258 66.742 l 258 54.938 250.004 44.688 238.543 41.824 c 235.051
 40.949 l 234.18 37.453 l 231.312 25.996 221.07 18 209.262 18 c 174.738 
18 l 162.93 18 152.688 25.996 149.82 37.453 c 148.945 40.945 l 145.457 41.82
 l 133.996 44.684 126 54.93 126 66.738 c h
186 342 m 186 282 l 150 282 l 150 342 l h
203.262 256.254 m 193.477 222 l 190.523 222 l 180.738 256.254 l 192 267.516
 l h
198.527 204.395 m 192 199.5 l 185.473 204.395 l 189.211 210 l 194.789 210
 l h
211.984 199.488 m 214.379 187.52 l 203.371 193.027 l h
180.637 193.027 m 169.625 187.52 l 172.02 199.488 l h
126 234.379 m 126 258 l 138 258 l 138 234 l 150 234 l 150 270 l 177.516
 270 l 167.262 259.746 l 179.473 217.02 l 175.859 211.602 l 163.984 220.512
 l 157.633 188.746 l 139.016 195.77 126 213.727 126 234.379 c h
127.105 270 m 128.914 275.082 132.918 279.086 138 280.895 c 138 270 l h
234 342 m 234 282 l 198 282 l 198 342 l h
246 280.895 m 251.082 279.086 255.086 275.082 256.895 270 c 246 270 l h
258 234.379 m 258 213.73 244.984 195.773 226.367 188.754 c 220.016 220.52
 l 208.141 211.609 l 204.527 217.027 l 216.738 259.754 l 206.484 270 l 234
 270 l 234 234 l 246 234 l 246 258 l 258 258 l h
206.23 173.887 m 205.488 173.93 204.758 174 204 174 c 180 174 l 179.242
 174 178.512 173.93 177.77 173.887 c 176.051 177.316 l 192 185.293 l 207.949
 177.316 l h
234 132 m 234 94.566 l 234 88.375 229.164 83.117 222.996 82.602 c 197.398
 80.465 l 186.539 79.566 176.969 74.094 170.527 66.07 c 167.875 70.848 163.805
 74.809 158.684 77.371 c 153.328 80.047 150 85.43 150 91.414 c 150 132 l
 150 148.543 163.457 162 180 162 c 204 162 l 220.543 162 234 148.543 234
 132 c h
138 102 m 131.383 102 126 107.383 126 114 c 126 120.617 131.383 126 138
 126 c h
106.242 286.242 m 90.254 302.23 l 97.488 308.898 105.406 314.922 114 320.141
 c 114 294 l 114 289.152 116.902 284.988 121.055 283.094 c 116.719 277.891
 114 271.289 114 264 c 114 234.371 l 114 204.887 135.277 179.801 163.984
 174.605 c 165.594 171.395 l 151.34 166.164 140.707 153.438 138.48 137.992
 c 138 137.992 l 124.766 137.992 114 127.23 114 113.992 c 114 108.762 115.727
 103.949 118.586 100.004 c 114.512 75.562 l 114.176 73.543 114 71.453 114
 69.379 c 114 66.742 l 114 65.734 114.156 64.77 114.234 63.781 c 105.551
 69.031 97.508 75.031 90.203 81.727 c 106.242 97.766 l 97.758 106.246 l 
81.719 90.211 l 57.848 115.945 43.625 149.574 42.211 186 c 66 186 l 66 198
 l 42.203 198 l 43.637 234.211 57.863 267.961 81.738 293.777 c 97.758 277.758
 l h
138 330 m 138 294 l 126 294 l 126 330 l h
186 366 m 186 359.383 180.617 354 174 354 c 162 354 l 155.383 354 150 359.383
 150 366 c h
234 366 m 234 359.383 228.617 354 222 354 c 210 354 l 203.383 354 198 359.383
 198 366 c h
341.762 198 m 318 198 l 318 186 l 341.789 186 l 340.375 149.574 326.148
 115.949 302.281 90.203 c 286.242 106.242 l 277.758 97.758 l 293.797 81.719
 l 286.492 75.02 278.453 69.02 269.766 63.773 c 269.844 64.766 270 65.73
 270 66.738 c 270 69.371 l 270 71.453 269.824 73.535 269.488 75.57 c 265.414
 100.004 l 268.266 103.957 270 108.77 270 114 c 270 127.234 259.234 138 
246 138 c 245.52 138 l 243.293 153.445 232.668 166.164 218.406 171.402 c
 220.016 174.613 l 248.723 179.801 270 204.895 270 234.379 c 270 264 l 270
 278.484 259.676 290.605 246 293.395 c 246 331.883 l 264.012 324.949 280.098
 314.812 293.746 302.23 c 277.758 286.242 l 286.242 277.758 l 302.23 293.746
 l 325.902 268.117 340.32 234.484 341.762 198 c h
341.762 198 m W n
[6 0 0 6 0 0] concat
/CairoFunction
   << /FunctionType 2
      /Domain [ 0 1 ]
      /C0 [ 0.623529 0.184314 1 ]
      /C1 [ 0.0431373 0.694118 0.827451 ]
      /N 1
   >>
def
   << /ShadingType 2
      /ColorSpace /DeviceRGB
      /Coords [ 32 63 32 1 ]
      /Extend [ true true ]
      /Function CairoFunction
   >>
shfill
Q
Q Q
showpage
%%Trailer
end
%%EOF
