%!PS-Adobe-3.0 EPSF-3.0
%%Creator: cairo 1.16.0 (https://cairographics.org)
%%CreationDate: Mon May  4 07:13:22 2020
%%Pages: 1
%%DocumentData: Clean7Bit
%%LanguageLevel: 3
%%BoundingBox: 6 6 378 378
%%EndComments
%%BeginProlog
50 dict begin
/q { gsave } bind def
/Q { grestore } bind def
/cm { 6 array astore concat } bind def
/w { setlinewidth } bind def
/J { setlinecap } bind def
/j { setlinejoin } bind def
/M { setmiterlimit } bind def
/d { setdash } bind def
/m { moveto } bind def
/l { lineto } bind def
/c { curveto } bind def
/h { closepath } bind def
/re { exch dup neg 3 1 roll 5 3 roll moveto 0 rlineto
      0 exch rlineto 0 rlineto closepath } bind def
/S { stroke } bind def
/f { fill } bind def
/f* { eofill } bind def
/n { newpath } bind def
/W { clip } bind def
/W* { eoclip } bind def
/BT { } bind def
/ET { } bind def
/BDC { mark 3 1 roll /BDC pdfmark } bind def
/EMC { mark /EMC pdfmark } bind def
/cairo_store_point { /cairo_point_y exch def /cairo_point_x exch def } def
/Tj { show currentpoint cairo_store_point } bind def
/TJ {
  {
    dup
    type /stringtype eq
    { show } { -0.001 mul 0 cairo_font_matrix dtransform rmoveto } ifelse
  } forall
  currentpoint cairo_store_point
} bind def
/cairo_selectfont { cairo_font_matrix aload pop pop pop 0 0 6 array astore
    cairo_font exch selectfont cairo_point_x cairo_point_y moveto } bind def
/Tf { pop /cairo_font exch def /cairo_font_matrix where
      { pop cairo_selectfont } if } bind def
/Td { matrix translate cairo_font_matrix matrix concatmatrix dup
      /cairo_font_matrix exch def dup 4 get exch 5 get cairo_store_point
      /cairo_font where { pop cairo_selectfont } if } bind def
/Tm { 2 copy 8 2 roll 6 array astore /cairo_font_matrix exch def
      cairo_store_point /cairo_font where { pop cairo_selectfont } if } bind def
/g { setgray } bind def
/rg { setrgbcolor } bind def
/d1 { setcachedevice } bind def
/cairo_data_source {
  CairoDataIndex CairoData length lt
    { CairoData CairoDataIndex get /CairoDataIndex CairoDataIndex 1 add def }
    { () } ifelse
} def
/cairo_flush_ascii85_file { cairo_ascii85_file status { cairo_ascii85_file flushfile } if } def
/cairo_image { image cairo_flush_ascii85_file } def
/cairo_imagemask { imagemask cairo_flush_ascii85_file } def
%%EndProlog
%%BeginSetup
%%EndSetup
%%Page: 1 1
%%BeginPageSetup
%%PageBoundingBox: 6 6 378 378
%%EndPageSetup
q 6 6 372 372 rectclip
1 0 0 -1 0 384 cm q
q
258 96 m 258 92.688 260.688 90 264 90 c 267.312 90 270 92.688 270 96 c 
270 99.312 267.312 102 264 102 c 260.688 102 258 99.312 258 96 c h
306 96 m 306 99.312 308.688 102 312 102 c 315.312 102 318 99.312 318 96
 c 318 92.688 315.312 90 312 90 c 308.688 90 306 92.688 306 96 c h
270 150 m 294 150 l 307.234 150 318 139.234 318 126 c 306 126 l 306 132.617
 300.617 138 294 138 c 270 138 l h
378 252 m 378 378 l 30 378 l 23.383 378 18 372.617 18 366 c 18 236.711 
l 10.41 223.52 6 208.277 6 192 c 6 175.723 10.41 160.48 18 147.289 c 18 
42 l 18 35.383 23.383 30 30 30 c 225.156 30 l 237.281 15.348 255.594 6 276.055
 6 c 299.945 6 l 336.371 6 366 35.629 366 72.055 c 366 76.398 365.566 80.754
 364.715 85.008 c 361.656 100.301 l 364.379 104.191 366 108.898 366 114 
c 366 127.234 355.234 138 342 138 c 341.52 138 l 339.344 153.102 329.129
 165.617 315.344 171.055 c 316.625 174.91 l 352.312 183.16 378 215.164 378
 252 c h
327.828 191.449 m 322.211 219.527 l 302.992 207.996 l 300.324 216 l 310.324
 246 l 365.73 246 l 363.594 222.254 348.895 201.574 327.828 191.449 c h
297.672 246 m 289.676 222 l 286.324 222 l 278.328 246 l h
263.207 186.312 m 261.977 186.574 260.762 186.871 259.559 187.199 c 262.211
 200.473 l 275.539 192.48 l h
300.461 192.48 m 313.789 200.473 l 316.441 187.211 l 315.234 186.883 314.023
 186.574 312.793 186.312 c h
292.453 201.664 m 288 198.996 l 283.547 201.664 l 286.324 210 l 289.676
 210 l h
210.27 246 m 265.676 246 l 275.676 216 l 273.008 207.996 l 253.789 219.527
 l 248.164 191.426 l 227.094 201.559 212.406 222.254 210.27 246 c h
303.613 173.812 m 302.418 173.922 301.219 174 300 174 c 276 174 l 274.781
 174 273.582 173.922 272.387 173.812 c 271.34 176.957 l 288 185.293 l 304.66
 176.957 l h
354 114 m 354 107.383 348.617 102 342 102 c 342 126 l 348.617 126 354 120.617
 354 114 c h
222 72.055 m 222 75.613 222.355 79.176 223.051 82.656 c 224.887 91.824 
l 227.699 90.66 230.773 90 234 90 c 234 78 l 234 64.766 244.766 54 258 54
 c 258 66 l 251.383 66 246 71.383 246 78 c 246 132 l 246 148.543 259.457
 162 276 162 c 300 162 l 316.543 162 330 148.543 330 132 c 330 78 l 342 
78 l 342 90 l 345.227 90 348.301 90.66 351.121 91.824 c 352.957 82.656 l
 353.645 79.172 354 75.613 354 72.055 c 354 42.246 329.746 18 299.945 18
 c 276.055 18 l 246.254 18 222 42.246 222 72.055 c h
234 102 m 227.383 102 222 107.383 222 114 c 222 120.617 227.383 126 234
 126 c h
30 42 m 30 78 l 210.293 78 l 210.113 76.02 210 74.035 210 72.055 c 210 
61.223 212.672 51.031 217.309 42 c h
18 192 m 18 204.055 20.832 215.438 25.734 225.637 c 90 188.531 l 90 114.305
 l 49.793 117.391 18 151.02 18 192 c h
31.691 236.051 m 45.77 256.531 69.328 270 96 270 c 122.672 270 146.23 256.531
 160.309 236.051 c 96 198.93 l h
174 192 m 174 151.02 142.207 117.391 102 114.305 c 102 188.539 l 166.266
 225.641 l 171.168 215.438 174 204.055 174 192 c h
366 366 m 366 258 l 294 258 l 294 270 l 342 270 l 342 306 l 234 306 l 234
 270 l 282 270 l 282 258 l 198 258 l 198 252 l 198 215.172 223.688 183.16
 259.367 174.918 c 260.652 171.059 l 246.863 165.625 236.652 153.109 234.473
 138.008 c 234 138.008 l 220.766 138.008 210 127.242 210 114.008 c 210 108.906
 211.621 104.195 214.344 100.309 c 212.281 90 l 30 90 l 30 131.016 l 46.453
 113.227 69.91 102 96 102 c 145.625 102 186 142.375 186 192 c 186 241.625
 145.625 282 96 282 c 69.91 282 46.453 270.773 30 252.984 c 30 366 l h
246 282 m 246 294 l 330 294 l 330 282 l h
293.371 75.316 m 275.371 39.316 l 264.637 44.688 l 282.637 80.688 l h
323.371 75.316 m 305.371 39.316 l 294.637 44.688 l 312.637 80.688 l h
54 54 m 42 54 l 42 66 l 54 66 l h
78 54 m 66 54 l 66 66 l 78 66 l h
102 54 m 90 54 l 90 66 l 102 66 l h
234 318 m 342 318 l 342 354 l 234 354 l h
246 342 m 330 342 l 330 330 l 246 330 l h
54 354 m 66 354 l 66 342 l 54 342 l h
78 354 m 174 354 l 174 342 l 78 342 l h
54 330 m 66 330 l 66 318 l 54 318 l h
78 330 m 198 330 l 198 318 l 78 318 l h
54 306 m 66 306 l 66 294 l 54 294 l h
114 294 m 78 294 l 78 306 l 114 306 l h
162 294 m 126 294 l 126 306 l 162 306 l h
162 294 m W n
[6 0 0 6 0 0] concat
/CairoFunction
   << /FunctionType 2
      /Domain [ 0 1 ]
      /C0 [ 0.623529 0.184314 1 ]
      /C1 [ 0.0431373 0.694118 0.827451 ]
      /N 1
   >>
def
   << /ShadingType 2
      /ColorSpace /DeviceRGB
      /Coords [ 32 63 32 1 ]
      /Extend [ true true ]
      /Function CairoFunction
   >>
shfill
Q
Q Q
showpage
%%Trailer
end
%%EOF
