%!PS-Adobe-3.0 EPSF-3.0
%%Creator: cairo 1.16.0 (https://cairographics.org)
%%CreationDate: Mon May  4 07:13:30 2020
%%Pages: 1
%%DocumentData: Clean7Bit
%%LanguageLevel: 3
%%BoundingBox: 6 6 378 378
%%EndComments
%%BeginProlog
50 dict begin
/q { gsave } bind def
/Q { grestore } bind def
/cm { 6 array astore concat } bind def
/w { setlinewidth } bind def
/J { setlinecap } bind def
/j { setlinejoin } bind def
/M { setmiterlimit } bind def
/d { setdash } bind def
/m { moveto } bind def
/l { lineto } bind def
/c { curveto } bind def
/h { closepath } bind def
/re { exch dup neg 3 1 roll 5 3 roll moveto 0 rlineto
      0 exch rlineto 0 rlineto closepath } bind def
/S { stroke } bind def
/f { fill } bind def
/f* { eofill } bind def
/n { newpath } bind def
/W { clip } bind def
/W* { eoclip } bind def
/BT { } bind def
/ET { } bind def
/BDC { mark 3 1 roll /BDC pdfmark } bind def
/EMC { mark /EMC pdfmark } bind def
/cairo_store_point { /cairo_point_y exch def /cairo_point_x exch def } def
/Tj { show currentpoint cairo_store_point } bind def
/TJ {
  {
    dup
    type /stringtype eq
    { show } { -0.001 mul 0 cairo_font_matrix dtransform rmoveto } ifelse
  } forall
  currentpoint cairo_store_point
} bind def
/cairo_selectfont { cairo_font_matrix aload pop pop pop 0 0 6 array astore
    cairo_font exch selectfont cairo_point_x cairo_point_y moveto } bind def
/Tf { pop /cairo_font exch def /cairo_font_matrix where
      { pop cairo_selectfont } if } bind def
/Td { matrix translate cairo_font_matrix matrix concatmatrix dup
      /cairo_font_matrix exch def dup 4 get exch 5 get cairo_store_point
      /cairo_font where { pop cairo_selectfont } if } bind def
/Tm { 2 copy 8 2 roll 6 array astore /cairo_font_matrix exch def
      cairo_store_point /cairo_font where { pop cairo_selectfont } if } bind def
/g { setgray } bind def
/rg { setrgbcolor } bind def
/d1 { setcachedevice } bind def
/cairo_data_source {
  CairoDataIndex CairoData length lt
    { CairoData CairoDataIndex get /CairoDataIndex CairoDataIndex 1 add def }
    { () } ifelse
} def
/cairo_flush_ascii85_file { cairo_ascii85_file status { cairo_ascii85_file flushfile } if } def
/cairo_image { image cairo_flush_ascii85_file } def
/cairo_imagemask { imagemask cairo_flush_ascii85_file } def
%%EndProlog
%%BeginSetup
%%EndSetup
%%Page: 1 1
%%BeginPageSetup
%%PageBoundingBox: 6 6 378 378
%%EndPageSetup
q 6 6 372 372 rectclip
1 0 0 -1 0 384 cm q
q
306 84 m 306 90 l 294 90 l 294 84 l 294 80.688 291.305 78 288 78 c 282 
78 l 282 84 l 282 87.312 284.695 90 288 90 c 297.926 90 306 98.074 306 108
 c 306 126 l 294 126 l 294 138 l 282 138 l 282 124.895 l 275.035 122.41 
270 115.812 270 108 c 270 102 l 282 102 l 282 108 l 282 111.312 284.695 
114 288 114 c 294 114 l 294 108 l 294 104.688 291.305 102 288 102 c 278.074
 102 270 93.926 270 84 c 270 66 l 282 66 l 282 54 l 294 54 l 294 67.105 
l 300.965 69.59 306 76.188 306 84 c h
354 96 m 354 132.391 324.391 162 288 162 c 251.609 162 222 132.391 222 
96 c 222 59.609 251.609 30 288 30 c 324.391 30 354 59.609 354 96 c h
342 96 m 342 66.223 317.773 42 288 42 c 258.227 42 234 66.223 234 96 c 
234 125.777 258.227 150 288 150 c 317.773 150 342 125.777 342 96 c h
378 96 m 378 139.465 347.027 175.824 306 184.188 c 306 198 l 312.617 198
 318 203.383 318 210 c 318 300 l 318 309.762 313.242 318.367 306 323.844
 c 306 342 l 306 361.855 289.855 378 270 378 c 42 378 l 22.145 378 6 361.855
 6 342 c 6 330 l 6 323.383 11.383 318 18 318 c 18 120 l 18 110.074 26.074
 102 36 102 c 198.305 102 l 198.176 100.008 198 98.027 198 96 c 198 46.375
 238.375 6 288 6 c 337.625 6 378 46.375 378 96 c h
270 198 m 270 184.188 l 243.289 178.738 220.871 161.41 208.465 138 c 54
 138 l 54 318 l 66 318 l 66 312.426 l 66 286.648 84.266 264.281 109.117 
258.793 c 110.438 253.52 l 104.52 249.895 100.02 244.312 97.734 237.652 
c 94.184 234.27 l 88.031 228.402 83.359 221.051 80.676 213 c 78.898 207.664
 78 202.129 78 196.512 c 78 192 l 78 182.965 80.988 174.02 86.398 166.801
 c 94.277 156.281 106.844 150 120 150 c 144 150 l 157.152 150 169.715 156.281
 177.602 166.805 c 183.012 174.02 186 182.965 186 192 c 186 196.512 l 186
 202.129 185.102 207.664 183.324 213 c 180.641 221.051 175.969 228.402 169.824
 234.266 c 166.266 237.652 l 163.98 244.312 159.48 249.898 153.562 253.52
 c 154.883 258.793 l 179.734 264.281 198 286.648 198 312.426 c 198 318 l
 264.156 318 l 260.348 312.973 258 306.781 258 300 c 258 210 l 258 203.383
 263.383 198 270 198 c h
109.363 185.879 m 121.668 177.68 l 124.996 182.672 l 131.852 192.941 142.285
 199.934 154.398 202.355 c 161.887 203.855 167.359 210.234 167.898 217.746
 c 169.57 215.062 170.945 212.203 171.941 209.195 c 173.305 205.105 174 
200.832 174 196.512 c 174 192 l 174 185.551 171.871 179.152 168 174.008 
c 162.367 166.488 153.395 162 144 162 c 120 162 l 110.605 162 101.633 166.488
 96 174 c 92.125 179.152 90 185.551 90 192 c 90 196.512 l 90 200.832 90.695
 205.105 92.059 209.203 c 93.035 212.137 94.379 214.934 96 217.559 c 96 
210.848 l 96 200.797 100.996 191.461 109.363 185.879 c h
108 228 m 108 237.926 116.074 246 126 246 c 138 246 l 147.926 246 156 237.926
 156 228 c 156 218.953 l 156 216.613 154.34 214.586 152.039 214.121 c 138.77
 211.469 127.078 204.457 118.586 194.148 c 116.012 195.863 l 111 199.211
 108 204.816 108 210.848 c h
186 312.426 m 186 297.926 178.598 284.809 167.203 276.996 c 151.195 303.68
 l 145.645 298.129 l 144.359 300.695 l 148.688 318 l 186 318 l h
127.301 289.184 m 129.707 294 l 134.293 294 l 136.699 289.184 l 132 284.484
 l h
127.688 318 m 136.312 318 l 133.312 306 l 130.688 306 l h
156.406 271.656 m 154.754 271.109 153.035 270.691 151.289 270.348 c 141.414
 276.93 l 148.805 284.316 l h
121.793 257.574 m 120.852 261.355 l 132 268.789 l 143.152 261.355 l 142.211
 257.574 l 140.82 257.773 139.441 258 138 258 c 126 258 l 124.559 258 123.18
 257.773 121.793 257.574 c h
107.594 271.656 m 115.195 284.328 l 122.586 276.938 l 112.711 270.355 l
 110.965 270.691 109.246 271.109 107.594 271.656 c h
78 312.426 m 78 318 l 115.312 318 l 119.641 300.703 l 118.355 298.129 l
 112.812 303.672 l 96.805 276.996 l 85.402 284.809 78 297.926 78 312.426
 c h
126 342 m 186 342 l 186 330 l 126 330 l h
30 318 m 42 318 l 42 126 l 203.25 126 l 201.863 122.102 200.652 118.121
 199.812 114 c 36 114 l 32.695 114 30 116.688 30 120 c h
198 330 m 198 342 l 198 348.617 192.617 354 186 354 c 126 354 l 119.383
 354 114 348.617 114 342 c 114 330 l 17.992 330 l 18 342 l 18 355.234 28.766
 366 42 366 c 270 366 l 283.234 366 294 355.234 294 342 c 294 330 l h
306 210 m 269.992 210 l 270 300 l 270 309.926 278.074 318 288 318 c 297.926
 318 306 309.926 306 300 c h
294 185.695 m 292.008 185.824 290.027 186 288 186 c 285.973 186 283.992
 185.824 282 185.695 c 282 198 l 294 198 l h
366 96 m 366 52.992 331.008 18 288 18 c 244.992 18 210 52.992 210 96 c 
210 139.008 244.992 174 288 174 c 331.008 174 366 139.008 366 96 c h
30 42 m 42 42 l 42 30 l 30 30 l h
66 30 m 54 30 l 54 42 l 66 42 l h
90 30 m 78 30 l 78 42 l 90 42 l h
6 54 m 6 18 l 6 11.383 11.383 6 18 6 c 102 6 l 108.617 6 114 11.383 114
 18 c 114 54 l 114 60.617 108.617 66 102 66 c 90 66 l 90 75.516 l 90 83.504
 83.504 90 75.516 90 c 71.707 90 67.973 88.453 65.273 85.766 c 45.516 66
 l 18 66 l 11.383 66 6 60.617 6 54 c h
18 54 m 50.484 54 l 73.758 77.273 l 75.191 78.703 78 77.539 78 75.516 c
 78 54 l 102.008 54 l 102 18 l 18 18 l h
222 354 m 222 342 l 210 342 l 210 354 l h
246 342 m 234 342 l 234 354 l 246 354 l h
270 342 m 258 342 l 258 354 l 270 354 l h
210 306 m 222 306 l 222 294 l 210 294 l h
234 306 m 246 306 l 246 294 l 234 294 l h
198 282 m 246 282 l 246 270 l 198 270 l h
198 258 m 246 258 l 246 246 l 198 246 l h
198 234 m 246 234 l 246 222 l 198 222 l h
198 210 m 246 210 l 246 198 l 198 198 l h
198 210 m W n
[6 0 0 6 0 0] concat
/CairoFunction
   << /FunctionType 2
      /Domain [ 0 1 ]
      /C0 [ 0.623529 0.184314 1 ]
      /C1 [ 0.0431373 0.694118 0.827451 ]
      /N 1
   >>
def
   << /ShadingType 2
      /ColorSpace /DeviceRGB
      /Coords [ 32 63 32 1 ]
      /Extend [ true true ]
      /Function CairoFunction
   >>
shfill
Q
Q Q
showpage
%%Trailer
end
%%EOF
