%!PS-Adobe-3.0 EPSF-3.0
%%Creator: cairo 1.16.0 (https://cairographics.org)
%%CreationDate: Mon May  4 07:13:14 2020
%%Pages: 1
%%DocumentData: Clean7Bit
%%LanguageLevel: 3
%%BoundingBox: 6 6 378 378
%%EndComments
%%BeginProlog
50 dict begin
/q { gsave } bind def
/Q { grestore } bind def
/cm { 6 array astore concat } bind def
/w { setlinewidth } bind def
/J { setlinecap } bind def
/j { setlinejoin } bind def
/M { setmiterlimit } bind def
/d { setdash } bind def
/m { moveto } bind def
/l { lineto } bind def
/c { curveto } bind def
/h { closepath } bind def
/re { exch dup neg 3 1 roll 5 3 roll moveto 0 rlineto
      0 exch rlineto 0 rlineto closepath } bind def
/S { stroke } bind def
/f { fill } bind def
/f* { eofill } bind def
/n { newpath } bind def
/W { clip } bind def
/W* { eoclip } bind def
/BT { } bind def
/ET { } bind def
/BDC { mark 3 1 roll /BDC pdfmark } bind def
/EMC { mark /EMC pdfmark } bind def
/cairo_store_point { /cairo_point_y exch def /cairo_point_x exch def } def
/Tj { show currentpoint cairo_store_point } bind def
/TJ {
  {
    dup
    type /stringtype eq
    { show } { -0.001 mul 0 cairo_font_matrix dtransform rmoveto } ifelse
  } forall
  currentpoint cairo_store_point
} bind def
/cairo_selectfont { cairo_font_matrix aload pop pop pop 0 0 6 array astore
    cairo_font exch selectfont cairo_point_x cairo_point_y moveto } bind def
/Tf { pop /cairo_font exch def /cairo_font_matrix where
      { pop cairo_selectfont } if } bind def
/Td { matrix translate cairo_font_matrix matrix concatmatrix dup
      /cairo_font_matrix exch def dup 4 get exch 5 get cairo_store_point
      /cairo_font where { pop cairo_selectfont } if } bind def
/Tm { 2 copy 8 2 roll 6 array astore /cairo_font_matrix exch def
      cairo_store_point /cairo_font where { pop cairo_selectfont } if } bind def
/g { setgray } bind def
/rg { setrgbcolor } bind def
/d1 { setcachedevice } bind def
/cairo_data_source {
  CairoDataIndex CairoData length lt
    { CairoData CairoDataIndex get /CairoDataIndex CairoDataIndex 1 add def }
    { () } ifelse
} def
/cairo_flush_ascii85_file { cairo_ascii85_file status { cairo_ascii85_file flushfile } if } def
/cairo_image { image cairo_flush_ascii85_file } def
/cairo_imagemask { imagemask cairo_flush_ascii85_file } def
%%EndProlog
%%BeginSetup
%%EndSetup
%%Page: 1 1
%%BeginPageSetup
%%PageBoundingBox: 6 6 378 378
%%EndPageSetup
q 6 6 372 372 rectclip
1 0 0 -1 0 384 cm q
q
24 378 m 372.629 378 l 366.168 313.41 l 373.883 301.078 378 286.949 378
 272.371 c 378 216 l 378 206.074 369.926 198 360 198 c 357.629 198 355.379
 198.484 353.305 199.32 c 351.234 191.672 344.297 186 336 186 c 331.375 
186 327.191 187.805 324 190.68 c 320.809 187.801 316.625 186 312 186 c 309.887
 186 307.883 186.434 306 187.105 c 306 156 l 306 146.074 297.926 138 288
 138 c 278.074 138 270 146.074 270 156 c 270 226.184 l 270 230.496 266.496
 234 262.184 234 c 260.633 234 259.133 233.543 257.844 232.688 c 250.715
 227.934 l 244.895 224.051 238.117 222 231.109 222 c 227.832 222 224.766
 222.816 221.992 224.152 c 221.992 174 l 54 174 l 54 282 l 222 282 l 222
 258.484 l 236.082 269.746 l 239.309 272.336 241.828 275.73 243.371 279.582
 c 244.398 282.145 l 246.066 286.301 248.113 290.25 250.445 294 c 42 294
 l 42 42 l 258 42 l 258 57.695 l 257.418 57.047 256.867 56.383 256.242 55.758
 c 252 51.512 l 247.758 55.758 l 238.883 64.633 234 76.43 234 88.973 c 234
 122.371 l 234 137.707 238.5 152.562 247.008 165.328 c 256.992 158.676 l
 249.805 147.883 246 135.328 246 122.371 c 246 88.973 l 246 81.883 248.102
 75.109 252 69.367 c 255.898 75.109 258 81.875 258 88.973 c 258 126 l 270
 126 l 270 111.941 l 270 104.852 272.102 98.074 276 92.34 c 279.898 98.082
 282 104.852 282 111.941 c 282 126 l 294 126 l 294 100.973 l 294 93.883 
296.102 87.109 300 81.367 c 303.898 87.109 306 93.875 306 100.973 c 306 
110.371 l 306 125.707 310.5 140.562 319.008 153.328 c 324 160.816 l 328.992
 153.324 l 332.609 147.895 335.453 142.074 337.586 136.02 c 344.18 144.512
 354.445 150 366 150 c 366 138 l 352.766 138 342 127.234 342 114 c 342 78
 l 330 78 l 330 110.371 l 330 119.898 327.941 129.211 324 137.754 c 320.059
 129.203 318 119.891 318 110.371 c 318 100.973 l 318 88.43 313.117 76.633
 304.242 67.758 c 300 63.512 l 295.758 67.758 l 295.133 68.383 294.582 69.047
 294 69.695 c 294 24 l 294 14.074 285.926 6 276 6 c 24 6 l 14.074 6 6 14.074
 6 24 c 6 360 l 6 369.926 14.074 378 24 378 c h
276.629 366 m 281.43 318 l 354.57 318 l 359.371 366 l h
210 270 m 66 270 l 66 186 l 210 186 l h
243.574 260.375 m 222 243.113 l 222 238.086 226.094 234 231.121 234 c 235.746
 234 240.223 235.355 244.062 237.918 c 251.191 242.672 l 254.453 244.848
 258.258 246 262.184 246 c 273.113 246 282 237.113 282 226.184 c 282 156
 l 282 152.695 284.688 150 288 150 c 291.312 150 294 152.695 294 156 c 294
 246 l 306 246 l 306 204 l 306 200.695 308.688 198 312 198 c 315.312 198
 318 200.695 318 204 c 318 246 l 330 246 l 330 204 l 330 200.695 332.688
 198 336 198 c 339.312 198 342 200.695 342 204 c 342 246 l 354 246 l 354
 216 l 354 212.695 356.688 210 360 210 c 363.312 210 366 212.695 366 216
 c 366 272.371 l 366 284.273 362.797 295.836 356.695 306 c 277.867 306 l
 267.82 298.895 260.125 289.141 255.535 277.68 c 254.508 275.125 l 252.203
 269.352 248.426 264.254 243.574 260.375 c h
18 24 m 18 20.695 20.688 18 24 18 c 276 18 l 279.312 18 282 20.695 282 
24 c 282 80.672 l 281.418 80.023 280.867 79.355 280.242 78.73 c 276 74.488
 l 271.758 78.73 l 271.133 79.355 270.582 80.023 270 80.672 c 270 42 l 270
 35.383 264.617 30 258 30 c 42 30 l 35.383 30 30 35.383 30 42 c 30 294 l
 30 300.617 35.383 306 42 306 c 259.625 306 l 262.68 309.234 266.062 312.16
 269.684 314.84 c 264.57 366 l 24 366 l 20.688 366 18 363.305 18 360 c h
126 354 m 174 354 l 180.617 354 186 348.617 186 342 c 186 330 l 186 323.383
 180.617 318 174 318 c 126 318 l 119.383 318 114 323.383 114 330 c 114 342
 l 114 348.617 119.383 354 126 354 c h
126 330 m 174 330 l 174.008 342 l 126 342 l h
78 222 m 90 222 l 90 234 l 78 234 l h
102 222 m 198 222 l 198 234 l 102 234 l h
78 198 m 90 198 l 90 210 l 78 210 l h
102 198 m 198 198 l 198 210 l 102 210 l h
78 246 m 90 246 l 90 258 l 78 258 l h
102 246 m 198 246 l 198 258 l 102 258 l h
222 54 m 54 54 l 54 102 l 222 102 l h
210 90 m 66 90 l 66 66 l 210 66 l h
114 114 m 114 126 l 54 126 l 54 114 l h
222 126 m 126 126 l 126 114 l 222 114 l h
54 138 m 198 138 l 198 150 l 54 150 l h
210 150 m 210 138 l 222 138 l 222 150 l h
210 150 m W n
[6 0 0 6 0 0] concat
/CairoFunction
   << /FunctionType 2
      /Domain [ 0 1 ]
      /C0 [ 0.623529 0.184314 1 ]
      /C1 [ 0.0431373 0.694118 0.827451 ]
      /N 1
   >>
def
   << /ShadingType 2
      /ColorSpace /DeviceRGB
      /Coords [ 32 63 32 1 ]
      /Extend [ true true ]
      /Function CairoFunction
   >>
shfill
Q
Q Q
showpage
%%Trailer
end
%%EOF
