%!PS-Adobe-3.0 EPSF-3.0
%%Creator: cairo 1.16.0 (https://cairographics.org)
%%CreationDate: Mon May  4 07:13:26 2020
%%Pages: 1
%%DocumentData: Clean7Bit
%%LanguageLevel: 3
%%BoundingBox: 6 6 378 378
%%EndComments
%%BeginProlog
50 dict begin
/q { gsave } bind def
/Q { grestore } bind def
/cm { 6 array astore concat } bind def
/w { setlinewidth } bind def
/J { setlinecap } bind def
/j { setlinejoin } bind def
/M { setmiterlimit } bind def
/d { setdash } bind def
/m { moveto } bind def
/l { lineto } bind def
/c { curveto } bind def
/h { closepath } bind def
/re { exch dup neg 3 1 roll 5 3 roll moveto 0 rlineto
      0 exch rlineto 0 rlineto closepath } bind def
/S { stroke } bind def
/f { fill } bind def
/f* { eofill } bind def
/n { newpath } bind def
/W { clip } bind def
/W* { eoclip } bind def
/BT { } bind def
/ET { } bind def
/BDC { mark 3 1 roll /BDC pdfmark } bind def
/EMC { mark /EMC pdfmark } bind def
/cairo_store_point { /cairo_point_y exch def /cairo_point_x exch def } def
/Tj { show currentpoint cairo_store_point } bind def
/TJ {
  {
    dup
    type /stringtype eq
    { show } { -0.001 mul 0 cairo_font_matrix dtransform rmoveto } ifelse
  } forall
  currentpoint cairo_store_point
} bind def
/cairo_selectfont { cairo_font_matrix aload pop pop pop 0 0 6 array astore
    cairo_font exch selectfont cairo_point_x cairo_point_y moveto } bind def
/Tf { pop /cairo_font exch def /cairo_font_matrix where
      { pop cairo_selectfont } if } bind def
/Td { matrix translate cairo_font_matrix matrix concatmatrix dup
      /cairo_font_matrix exch def dup 4 get exch 5 get cairo_store_point
      /cairo_font where { pop cairo_selectfont } if } bind def
/Tm { 2 copy 8 2 roll 6 array astore /cairo_font_matrix exch def
      cairo_store_point /cairo_font where { pop cairo_selectfont } if } bind def
/g { setgray } bind def
/rg { setrgbcolor } bind def
/d1 { setcachedevice } bind def
/cairo_data_source {
  CairoDataIndex CairoData length lt
    { CairoData CairoDataIndex get /CairoDataIndex CairoDataIndex 1 add def }
    { () } ifelse
} def
/cairo_flush_ascii85_file { cairo_ascii85_file status { cairo_ascii85_file flushfile } if } def
/cairo_image { image cairo_flush_ascii85_file } def
/cairo_imagemask { imagemask cairo_flush_ascii85_file } def
%%EndProlog
%%BeginSetup
%%EndSetup
%%Page: 1 1
%%BeginPageSetup
%%PageBoundingBox: 6 6 378 378
%%EndPageSetup
q 6 6 372 372 rectclip
1 0 0 -1 0 384 cm q
q
174 102 m 192 102 l 197.117 102 201.715 99.156 204 94.586 c 204.629 93.316
 l 215.363 98.688 l 214.734 99.953 l 210.402 108.617 201.691 114 192 114
 c 174 114 l h
66 174 m 84 174 l 93.691 174 102.402 168.617 106.734 159.949 c 107.363 
158.684 l 96.629 153.312 l 96 154.586 l 93.715 159.156 89.117 162 84 162
 c 66 162 l h
83.371 123.316 m 71.371 99.316 l 60.637 104.688 l 72.637 128.688 l h
107.371 123.316 m 95.371 99.316 l 84.637 104.688 l 96.637 128.688 l h
288.629 92.684 m 300.629 116.684 l 311.363 111.312 l 299.363 87.312 l h
312.629 92.684 m 324.629 116.684 l 335.363 111.312 l 323.363 87.312 l h
378 108 m 378 164.371 l 378 174.863 374.508 184.812 368.125 192.941 c 374.348
 201.199 378 211.445 378 222.496 c 378 312.629 l 313.801 306.211 l 294.066
 321.305 269.73 329.664 244.879 329.945 c 245.562 331.848 246 333.863 246
 336 c 246 345.926 237.926 354 228 354 c 220.895 354 l 221.566 355.883 222
 357.887 222 360 c 222 369.926 213.926 378 204 378 c 140.418 378 l 115.117
 378 90.281 369.57 70.199 354.211 c 6 360.629 l 6 265.477 l 6 234.707 26.117
 207.863 55.32 199.066 c 57.059 193.859 l 49.766 189.625 44.34 182.516 42.605
 174 c 42 174 l 28.766 174 18 163.234 18 150 c 18 145.453 19.344 141.238
 21.547 137.617 c 19.934 132.773 l 18.648 128.93 18 124.922 18 120.859 c
 18 104.734 28.027 90.68 42.816 85.32 c 44.258 78.121 l 47.051 64.141 59.426
 54 73.676 54 c 87.168 54 l 102.301 54 116.824 59.531 128.125 69.215 c 127.457
 66.551 l 126.492 62.707 126 58.727 126 54.738 c 126 27.863 147.863 6 174.738
 6 c 209.262 6 l 236.137 6 258 27.863 258 54.738 c 258 58.727 257.508 62.707
 256.543 66.562 c 254.09 76.387 l 265.309 55.914 287.059 42 312 42 c 348.391
 42 378 71.609 378 108 c h
297.348 170.93 m 294 180.977 l 294 186 l 330 186 l 330 180.977 l 326.652
 170.934 l 326.359 171.059 326.102 171.234 325.801 171.348 c 321.383 173.113
 316.746 174 312 174 c 307.254 174 302.617 173.113 298.199 171.348 c 297.906
 171.227 297.641 171.055 297.348 170.93 c h
342 187.836 m 342 189.176 l 342 200.695 338.051 211.469 331.156 220.055
 c 365.477 216.625 l 363.391 203.441 354.426 192.492 342 187.836 c h
258 312 m 258 313.746 257.672 315.402 257.207 316.996 c 274.859 314.633
 291.73 307.746 306 296.965 c 306 231.035 l 288.09 217.492 266.062 210 243.582
 210 c 210 210 l 210 216.617 215.375 222 221.977 222 c 228.977 222 l 238.098
 222 246.281 227.074 250.352 235.234 c 253.668 241.895 260.297 246 267.68
 246 c 270 246 l 270 258 l 267.68 258 l 258.965 258 250.926 254.438 245.125
 248.383 c 238.734 254.297 234.816 262.391 234.16 271.152 c 241.051 273.684
 246 280.246 246 288 c 246 290.371 245.516 292.621 244.68 294.695 c 252.328
 296.766 258 303.703 258 312 c h
126 162 m 132.617 162 138 156.617 138 150 c 138 143.383 132.617 138 126
 138 c h
150 78 m 143.383 78 138 83.383 138 90 c 138 96.617 143.383 102 150 102 
c h
149.875 113.988 m 149.914 114.938 150 115.883 150 116.832 c 150 118.586
 l 150 125.297 148.879 131.879 146.785 138.227 c 147.977 140.328 148.938
 142.57 149.461 144.996 c 153.84 142.535 158.453 140.531 163.324 139.066
 c 165.059 133.859 l 157.766 129.629 152.348 122.52 150.613 114 c 150 114
 l 149.957 114 149.914 113.988 149.875 113.988 c h
234 102 m 240.617 102 246 96.617 246 90 c 246 83.383 240.617 78 234 78 
c h
218.945 133.855 m 220.68 139.062 l 230.047 141.895 238.66 146.688 246 153.031
 c 246 110.656 l 242.453 112.727 238.391 114 234 114 c 233.395 114 l 231.66
 122.516 226.234 129.625 218.945 133.855 c h
176.449 137.641 m 175.062 141.793 l 192 154.5 l 208.945 141.793 l 207.559
 137.641 l 206.375 137.785 205.219 138 204 138 c 180 138 l 178.781 138 177.625
 137.785 176.449 137.641 c h
158.988 153.617 m 165.293 175.68 l 182.203 162.148 l 166.844 150.629 l 
164.137 151.445 161.516 152.43 158.988 153.617 c h
181.957 222 m 201.336 222 l 199.273 218.453 198 214.391 198 210 c 198 209.453
 198.09 208.934 198.16 208.402 c 193.477 192 l 190.523 192 l h
198.305 174.727 m 192 169.688 l 185.695 174.727 l 189.211 180 l 194.789
 180 l h
218.707 175.68 m 225.02 153.59 l 222.496 152.398 219.875 151.414 217.188
 150.605 c 201.793 162.148 l h
222 77.43 m 191.281 74.359 l 181.531 73.379 173.184 68.23 167.922 60.77
 c 164.25 62.922 162 66.82 162 71.125 c 162 108 l 162 117.926 170.074 126
 180 126 c 204 126 l 213.926 126 222 117.926 222 108 c h
110.945 193.855 m 112.68 199.062 l 126.941 203.352 139.273 211.996 148.145
 223.879 c 150.527 222.715 153.176 222 156 222 c 169.477 222 l 179.473 187.02
 l 176.293 182.25 l 158.707 196.312 l 148.367 160.121 l 147.984 160.414 
147.59 160.68 147.211 160.984 c 143.207 168.684 135.254 174 126 174 c 125.395
 174 l 123.66 182.516 118.234 189.625 110.945 193.855 c h
93.797 222.148 m 110.707 235.68 l 117.035 213.539 l 114.523 212.363 111.883
 211.422 109.184 210.613 c h
77.695 234.727 m 81.211 240 l 86.789 240 l 90.305 234.727 l 84 229.688 
l h
79.207 263.621 m 81.895 261.941 84.648 260.383 87.457 258.938 c 85.477 
252 l 82.523 252 l h
109.723 250.262 m 99.715 242.25 l 96.535 247.02 l 98.527 253.992 l 102.191
 252.562 105.926 251.309 109.723 250.262 c h
119.684 247.957 m 126.078 246.781 132.574 246.125 139.121 246.055 c 138.438
 244.152 138 242.137 138 240 c 138 237.379 138.594 234.898 139.609 232.656
 c 136.242 227.824 132.223 223.598 127.648 220.066 c h
156 246 m 231.211 246 l 233.238 243.27 235.531 240.715 238.145 238.457 
c 235.902 235.68 232.613 234 228.977 234 c 156 234 l 152.695 234 150 236.688
 150 240 c 150 243.312 152.695 246 156 246 c h
185.977 258 m 185.977 262.391 184.703 266.461 182.641 270.008 c 222.234
 270.008 l 222.562 265.867 223.414 261.84 224.789 258.008 c 185.977 258.008
 l h
305.238 215.879 m 307.688 217.422 310.066 219.078 312.402 220.812 c 320.773
 215.594 326.609 207.434 328.879 198 c 295.109 198 l 296.766 204.738 300.238
 210.977 305.238 215.879 c h
282 189.168 m 282 187.867 l 275.438 190.344 269.723 194.605 265.508 200.203
 c 272.152 201.492 278.656 203.371 284.969 205.793 c 283.062 200.488 282
 194.875 282 189.168 c h
255.895 192.965 m 250.895 186.605 247.711 179.137 246.547 171.156 c 243.406
 166.961 239.734 163.254 235.637 160.094 c 225.289 196.312 l 207.703 182.25
 l 204.523 187.02 l 207.727 198.227 l 208.469 198.09 209.227 198 210 198
 c 243.582 198 l 246.535 198 249.473 198.137 252.402 198.367 c 253.465 196.488
 254.609 194.672 255.895 192.965 c h
138 54.738 m 138 57.742 138.371 60.742 139.098 63.641 c 140.219 68.129 
l 143.215 66.785 146.508 66 150 66 c 150.602 66 l 152.094 59.105 156.504
 53.164 162.941 49.824 c 162.324 47.316 162 44.695 162 42 c 174 42 l 174
 52.59 181.945 61.367 192.48 62.418 c 228.312 66 l 234 66 l 237.492 66 240.785
 66.785 243.781 68.129 c 244.902 63.648 l 245.629 60.742 246 57.742 246 
54.738 c 246 34.48 229.52 18 209.262 18 c 174.738 18 l 154.48 18 138 34.48
 138 54.738 c h
42 162 m 42 138 l 35.383 138 30 143.383 30 150 c 30 156.617 35.383 162 
42 162 c h
54 114 m 54 168 l 54 177.926 62.074 186 72 186 c 96 186 l 105.926 186 114
 177.926 114 168 c 114 114 l 126 114 l 126 126 l 129.961 126 133.645 127.055
 136.938 128.762 c 137.621 125.426 138 122.023 138 118.586 c 138 116.832
 l 138 114.684 137.812 112.543 137.551 110.418 c 130.656 106.195 126 98.664
 126 90 c 126 88.234 126.215 86.531 126.582 84.875 c 116.965 73.051 102.473
 66 87.168 66 c 73.676 66 l 65.125 66 57.703 72.09 56.023 80.473 c 53.137
 94.895 l 49.457 95.82 l 37.996 98.684 30 108.93 30 120.738 c 30 123.516
 30.434 126.137 31.242 128.664 c 34.492 127.016 38.113 126 42 126 c 42 114
 l h
68.449 197.641 m 67.062 201.793 l 84 214.5 l 100.945 201.793 l 99.559 197.641
 l 98.375 197.785 97.219 198 96 198 c 72 198 l 70.781 198 69.625 197.785
 68.449 197.641 c h
50.977 213.582 m 57.293 235.68 l 74.203 222.148 l 58.805 210.602 l 56.094
 211.414 53.484 212.41 50.977 213.582 c h
18.035 264.574 m 65.105 269.281 l 71.465 247.02 l 68.285 242.25 l 50.707
 256.32 l 40.34 220.039 l 26.809 230.461 18.316 246.672 18.035 264.574 c
 h
18 347.371 m 66 342.574 l 66 281.43 l 18 276.629 l h
234 336 m 234 332.688 231.305 330 228 330 c 150 330 l 150 318 l 240 318
 l 243.305 318 246 315.312 246 312 c 246 308.688 243.305 306 240 306 c 150
 306 l 150 294 l 228 294 l 231.305 294 234 291.312 234 288 c 234 284.688
 231.305 282 228 282 c 150 282.008 l 150 270.008 l 162 270.008 l 162 270
 l 168.605 270 173.977 264.617 173.977 258 c 140.418 258 l 117.938 258 95.91
 265.492 78 279.035 c 78 344.957 l 95.91 358.508 117.938 366 140.418 366
 c 204 366 l 207.305 366 210 363.312 210 360 c 210 356.688 207.305 354 204
 354 c 150 354 l 150 342 l 228 342 l 231.305 342 234 339.312 234 336 c h
366 299.371 m 366 228.629 l 318 233.43 l 318 294.574 l h
366 108 m 366 78.223 341.773 54 312 54 c 282.227 54 258 78.223 258 108 
c 258 164.371 l 258 171.602 260.293 178.445 264.402 184.223 c 269.922 179.801
 276.371 176.551 283.402 174.828 c 286.781 164.688 l 276.316 156.328 270
 143.617 270 129.691 c 270 102 l 282 102 l 282 129.691 l 282 143.203 290.113
 155.18 302.656 160.199 c 308.629 162.59 315.371 162.59 321.348 160.199 
c 333.887 155.18 342 143.203 342 129.691 c 342 102 l 354 102 l 354 129.691
 l 354 143.617 347.684 156.328 337.219 164.684 c 340.598 174.816 l 347.723
 176.551 354.16 179.812 359.621 184.184 c 363.719 178.422 366 171.582 366
 164.371 c h
366 108 m W n
[6 0 0 6 0 0] concat
/CairoFunction
   << /FunctionType 2
      /Domain [ 0 1 ]
      /C0 [ 0.623529 0.184314 1 ]
      /C1 [ 0.0431373 0.694118 0.827451 ]
      /N 1
   >>
def
   << /ShadingType 2
      /ColorSpace /DeviceRGB
      /Coords [ 32 63 32 1 ]
      /Extend [ true true ]
      /Function CairoFunction
   >>
shfill
Q
Q Q
showpage
%%Trailer
end
%%EOF
