%!PS-Adobe-3.0 EPSF-3.0
%%Creator: cairo 1.16.0 (https://cairographics.org)
%%CreationDate: Mon May  4 07:13:29 2020
%%Pages: 1
%%DocumentData: Clean7Bit
%%LanguageLevel: 3
%%BoundingBox: 6 6 378 378
%%EndComments
%%BeginProlog
50 dict begin
/q { gsave } bind def
/Q { grestore } bind def
/cm { 6 array astore concat } bind def
/w { setlinewidth } bind def
/J { setlinecap } bind def
/j { setlinejoin } bind def
/M { setmiterlimit } bind def
/d { setdash } bind def
/m { moveto } bind def
/l { lineto } bind def
/c { curveto } bind def
/h { closepath } bind def
/re { exch dup neg 3 1 roll 5 3 roll moveto 0 rlineto
      0 exch rlineto 0 rlineto closepath } bind def
/S { stroke } bind def
/f { fill } bind def
/f* { eofill } bind def
/n { newpath } bind def
/W { clip } bind def
/W* { eoclip } bind def
/BT { } bind def
/ET { } bind def
/BDC { mark 3 1 roll /BDC pdfmark } bind def
/EMC { mark /EMC pdfmark } bind def
/cairo_store_point { /cairo_point_y exch def /cairo_point_x exch def } def
/Tj { show currentpoint cairo_store_point } bind def
/TJ {
  {
    dup
    type /stringtype eq
    { show } { -0.001 mul 0 cairo_font_matrix dtransform rmoveto } ifelse
  } forall
  currentpoint cairo_store_point
} bind def
/cairo_selectfont { cairo_font_matrix aload pop pop pop 0 0 6 array astore
    cairo_font exch selectfont cairo_point_x cairo_point_y moveto } bind def
/Tf { pop /cairo_font exch def /cairo_font_matrix where
      { pop cairo_selectfont } if } bind def
/Td { matrix translate cairo_font_matrix matrix concatmatrix dup
      /cairo_font_matrix exch def dup 4 get exch 5 get cairo_store_point
      /cairo_font where { pop cairo_selectfont } if } bind def
/Tm { 2 copy 8 2 roll 6 array astore /cairo_font_matrix exch def
      cairo_store_point /cairo_font where { pop cairo_selectfont } if } bind def
/g { setgray } bind def
/rg { setrgbcolor } bind def
/d1 { setcachedevice } bind def
/cairo_data_source {
  CairoDataIndex CairoData length lt
    { CairoData CairoDataIndex get /CairoDataIndex CairoDataIndex 1 add def }
    { () } ifelse
} def
/cairo_flush_ascii85_file { cairo_ascii85_file status { cairo_ascii85_file flushfile } if } def
/cairo_image { image cairo_flush_ascii85_file } def
/cairo_imagemask { imagemask cairo_flush_ascii85_file } def
%%EndProlog
%%BeginSetup
%%EndSetup
%%Page: 1 1
%%BeginPageSetup
%%PageBoundingBox: 6 6 378 378
%%EndPageSetup
q 6 6 372 372 rectclip
1 0 0 -1 0 384 cm q
q
324.629 93.316 m 335.363 98.688 l 334.734 99.953 l 330.402 108.617 321.691
 114 312 114 c 294 114 l 294 102 l 312 102 l 317.117 102 321.715 99.156 
324 94.586 c h
376.543 66.562 m 373.992 76.766 l 376.512 80.562 378 85.109 378 90 c 378
 103.234 367.234 114 354 114 c 353.395 114 l 351.211 124.715 343.242 133.234
 332.953 136.48 c 334.254 139.094 l 360.133 147.719 378 172.219 378 199.68
 c 378 288 l 378 301.234 367.234 312 354 312 c 354 378 l 270 378 l 270 306
 l 256.895 306 l 257.566 307.883 258 309.887 258 312 c 258 316.625 256.195
 320.809 253.32 324 c 256.199 327.191 258 331.375 258 336 c 258 344.297 
252.328 351.227 244.68 353.305 c 245.516 355.379 246 357.629 246 360 c 246
 369.926 237.926 378 228 378 c 171.629 378 l 156.938 378 142.703 373.828
 130.309 366 c 6 366 l 6 199.68 l 6 172.219 23.867 147.719 49.746 139.094
 c 51.047 136.48 l 40.758 133.234 32.789 124.715 30.605 114 c 30 114 l 16.766
 114 6 103.234 6 90 c 6 85.109 7.488 80.562 10.008 76.766 c 7.457 66.559
 l 6.492 62.707 6 58.727 6 54.738 c 6 27.863 27.863 6 54.738 6 c 89.262 
6 l 110.465 6 128.504 19.633 135.188 38.574 c 146.684 19.117 167.812 6 192
 6 c 215.398 6 235.938 18.277 247.66 36.684 c 250.523 28.59 256.934 22.027
 265.414 19.199 c 265.902 19.043 l 270.941 10.934 279.73 6 289.414 6 c 329.262
 6 l 356.137 6 378 27.863 378 54.738 c 378 58.727 377.508 62.707 376.543
 66.562 c h
303.707 138 m 301.734 141.941 l 312 148.789 l 322.266 141.941 l 320.293
 138 l h
321.422 156.938 m 328.812 164.328 l 335.855 152.586 l 334.254 151.844 332.594
 151.199 330.898 150.617 c h
288.145 152.578 m 295.188 164.32 l 302.578 156.93 l 293.102 150.613 l 291.406
 151.195 289.746 151.836 288.145 152.578 c h
300.461 243.977 m 312 255.516 l 323.539 243.977 l 312.996 186 l 311.004
 186 l h
316.699 169.184 m 312 164.484 l 307.301 169.184 l 309.707 174 l 314.293
 174 l h
291.047 136.48 m 280.758 133.234 272.789 124.711 270.605 114 c 270 114 
l 265.609 114 261.547 112.727 258 110.664 c 258 112.547 l 258 126.887 253.434
 140.773 245.059 152.27 c 249.383 155.879 253.23 160.043 256.586 164.633
 c 264.328 152.875 275.887 143.719 289.746 139.094 c h
246 270 m 246 199.68 l 246 191.73 247.543 184.051 250.289 176.902 c 243.848
 165.727 233.879 157.086 222 152.305 c 222 164.051 l 222 181.094 217.129
 197.359 208.145 211.363 c 216.203 214.344 222 222.031 222 231.113 c 222
 238.117 219.949 244.895 216.066 250.723 c 211.312 257.852 l 210.449 259.133
 210 260.633 210 262.184 c 210 266.496 213.504 270 217.816 270 c h
114 198 m 114 268.172 l 126 269.371 l 126 199.68 l 126 183.469 118.324 
168.527 106.074 158.875 c 91.195 183.672 l 85.648 178.129 l 84.266 180.898
 l 96.469 248.023 l 79.746 264.742 l 102 266.969 l 102 198 l h
53.102 150.613 m 51.406 151.195 49.746 151.836 48.145 152.578 c 55.188 
164.32 l 62.578 156.93 l h
61.734 141.941 m 72 148.789 l 82.266 141.941 l 80.293 138 l 63.707 138 
l h
114 102 m 120.617 102 126 96.617 126 90 c 126 83.383 120.617 78 114 78 
c h
92.953 136.48 m 94.254 139.094 l 108.113 143.711 119.676 152.875 127.414
 164.633 c 130.77 160.043 134.617 155.879 138.941 152.27 c 130.566 140.766
 126 126.887 126 112.547 c 126 110.664 l 122.453 112.727 118.391 114 114
 114 c 113.395 114 l 111.211 124.715 103.242 133.234 92.953 136.48 c h
95.855 152.578 m 94.254 151.836 92.594 151.195 90.898 150.613 c 81.422 
156.93 l 88.812 164.32 l h
67.301 169.184 m 69.707 174 l 74.293 174 l 76.699 169.184 l 72 164.484 
l h
60.461 243.977 m 72 255.516 l 83.539 243.977 l 72.996 186 l 71.004 186 
l h
138 199.68 m 138 259.625 l 144.871 253.129 152.93 247.961 161.863 244.391
 c 164.43 243.367 l 168.281 241.824 171.68 239.305 174.258 236.074 c 184.77
 222.938 l 170.105 206.746 162 186.047 162 164.059 c 162 152.309 l 150.121
 157.094 140.148 165.727 133.711 176.91 c 136.457 184.051 138 191.734 138
 199.68 c h
209.285 174 m 174.715 174 l 176.598 188.465 182.504 201.984 192 213.156
 c 201.496 201.984 207.402 188.465 209.285 174 c h
222 96 m 222 76.848 l 204.535 72.77 187.793 65.219 173.172 54.828 c 166.387
 58.242 162 65.207 162 72.973 c 162 96 l 162 112.543 175.457 126 192 126
 c 208.543 126 222 112.543 222 96 c h
181.094 136.512 m 179.051 139.969 176.699 143.207 174 146.18 c 174 162 
l 210 162 l 210 146.18 l 207.293 143.207 204.941 139.969 202.902 136.512
 c 199.422 137.453 195.773 138 192 138 c 188.227 138 184.578 137.453 181.094
 136.512 c h
270 78 m 263.383 78 258 83.383 258 90 c 258 96.617 263.383 102 270 102 
c h
138 72 m 138 112.547 l 138 124.441 141.809 135.941 148.812 145.441 c 153.828
 142.547 159.18 140.203 164.852 138.629 c 166.824 136.52 168.504 134.18 
170.047 131.742 c 158.047 124.34 150 111.109 150 96 c 150 72.973 l 150 59.039
 158.879 46.715 172.105 42.312 c 175.086 41.316 l 177.602 43.199 l 192.59
 54.438 210.227 62.328 228.602 66 c 234 67.094 l 234 96 l 234 111.109 225.953
 124.34 213.949 131.734 c 215.488 134.172 217.172 136.512 219.145 138.625
 c 224.812 140.195 230.164 142.547 235.184 145.434 c 242.191 135.941 246
 124.441 246 112.547 c 246 72 l 246 42.223 221.777 18 192 18 c 162.223 18
 138 42.223 138 72 c h
30 102 m 30 78 l 23.383 78 18 83.383 18 90 c 18 96.617 23.383 102 30 102
 c h
60 126 m 84 126 l 93.926 126 102 117.926 102 108 c 102 54 l 114 54 l 114
 66 l 117.492 66 120.785 66.785 123.785 68.137 c 124.906 63.652 l 125.629
 60.742 126 57.742 126 54.738 c 126 34.48 109.52 18 89.262 18 c 54.738 18
 l 34.48 18 18 34.48 18 54.738 c 18 57.742 18.371 60.742 19.098 63.641 c
 20.219 68.129 l 23.215 66.785 26.508 66 30 66 c 30.098 66 l 30.602 56.023
 36.301 47.148 45.316 42.629 c 50.688 53.363 l 45.328 56.047 42 61.43 42
 67.414 c 42 108 l 42 117.926 50.074 126 60 126 c h
18 199.68 m 18 258.57 l 30 259.77 l 30 198 l 42 198 l 42 260.969 l 62.539
 263.023 l 47.539 248.023 l 59.742 180.898 l 58.355 178.129 l 52.812 183.672
 l 37.934 158.875 l 25.676 168.527 18 183.469 18 199.68 c h
18 354 m 126 354 l 126 281.43 l 18 270.629 l h
240 306 m 198 306 l 198 294 l 276 294 l 279.312 294 282 291.312 282 288
 c 282 284.688 279.312 282 276 282 c 217.816 282 l 206.887 282 198 273.113
 198 262.184 c 198 258.258 199.145 254.453 201.328 251.191 c 206.082 244.062
 l 208.645 240.211 210 235.738 210 231.121 c 210 226.094 205.906 222 200.887
 222 c 183.625 243.574 l 179.746 248.426 174.652 252.203 168.883 254.508
 c 166.312 255.535 l 154.812 260.137 145.105 267.941 137.992 278.039 c 137.992
 356.699 l 148.164 362.797 159.727 366 171.629 366 c 228 366 l 231.312 366
 234 363.312 234 360 c 234 356.688 231.312 354 228 354 c 198 354 l 198 342
 l 240 342 l 243.312 342 246 339.312 246 336 c 246 332.688 243.312 330 240
 330 c 198 330 l 198 318 l 240 318 l 243.312 318 246 315.312 246 312 c 246
 308.688 243.312 306 240 306 c h
282 366 m 306 366 l 306 294 l 292.895 294 l 291.086 299.082 287.082 303.086
 282 304.895 c h
342 366 m 342 294 l 318 294 l 318 366 l h
366 288 m 366 276 l 354 276 l 354 300 l 360.617 300 366 294.617 366 288
 c h
346.074 158.875 m 331.195 183.672 l 325.648 178.129 l 324.266 180.898 l
 336.469 248.023 l 312 272.484 l 287.539 248.023 l 299.742 180.898 l 298.355
 178.129 l 292.812 183.672 l 277.934 158.875 l 265.676 168.527 258 183.469
 258 199.68 c 258 270 l 270 270 l 270 198 l 282 198 l 282 271.105 l 287.082
 272.914 291.086 276.918 292.895 282 c 342 282 l 342 198 l 354 198 l 354
 264 l 366 264 l 366 199.68 l 366 183.469 358.324 168.527 346.074 158.875
 c h
342 72 m 342 62.074 333.926 54 324 54 c 300 54 l 290.074 54 282 62.074 
282 72 c 282 108 l 282 117.926 290.074 126 300 126 c 324 126 l 333.926 126
 342 117.926 342 108 c h
353.395 66 m 354 66 l 357.492 66 360.785 66.785 363.785 68.137 c 364.906
 63.652 l 365.629 60.742 366 57.742 366 54.738 c 366 34.48 349.52 18 329.262
 18 c 289.414 18 l 283.43 18 278.039 21.328 275.363 26.684 c 274.246 28.902
 l 269.207 30.582 l 262.508 32.824 258 39.078 258 46.145 c 258 47.039 258.07
 47.941 258.223 48.828 c 261.359 67.668 l 264.047 66.629 266.945 66 270 
66 c 270.605 66 l 273.395 52.324 285.516 42 300 42 c 324 42 l 338.484 42
 350.605 52.324 353.395 66 c h
366 90 m 366 83.383 360.617 78 354 78 c 354 102 l 360.617 102 366 96.617
 366 90 c h
94.734 99.949 m 95.363 98.684 l 84.629 93.312 l 84 94.586 l 81.715 99.156
 77.117 102 72 102 c 54 102 l 54 114 l 72 114 l 81.691 114 90.402 108.617
 94.734 99.949 c h
71.82 64.547 m 65.82 40.547 l 54.18 43.453 l 60.18 67.453 l h
95.82 64.547 m 89.82 40.547 l 78.18 43.453 l 84.18 67.453 l h
204 94.586 m 201.715 99.156 197.117 102 192 102 c 174 102 l 174 114 l 192
 114 l 201.691 114 210.402 108.617 214.734 99.949 c 215.363 98.684 l 204.629
 93.312 l h
204 94.586 m W n
[6 0 0 6 0 0] concat
/CairoFunction
   << /FunctionType 2
      /Domain [ 0 1 ]
      /C0 [ 0.623529 0.184314 1 ]
      /C1 [ 0.0431373 0.694118 0.827451 ]
      /N 1
   >>
def
   << /ShadingType 2
      /ColorSpace /DeviceRGB
      /Coords [ 32 63 32 1 ]
      /Extend [ true true ]
      /Function CairoFunction
   >>
shfill
Q
Q Q
showpage
%%Trailer
end
%%EOF
