%!PS-Adobe-3.0 EPSF-3.0
%%Creator: cairo 1.16.0 (https://cairographics.org)
%%CreationDate: Mon May  4 07:13:10 2020
%%Pages: 1
%%DocumentData: Clean7Bit
%%LanguageLevel: 3
%%BoundingBox: 6 6 378 378
%%EndComments
%%BeginProlog
50 dict begin
/q { gsave } bind def
/Q { grestore } bind def
/cm { 6 array astore concat } bind def
/w { setlinewidth } bind def
/J { setlinecap } bind def
/j { setlinejoin } bind def
/M { setmiterlimit } bind def
/d { setdash } bind def
/m { moveto } bind def
/l { lineto } bind def
/c { curveto } bind def
/h { closepath } bind def
/re { exch dup neg 3 1 roll 5 3 roll moveto 0 rlineto
      0 exch rlineto 0 rlineto closepath } bind def
/S { stroke } bind def
/f { fill } bind def
/f* { eofill } bind def
/n { newpath } bind def
/W { clip } bind def
/W* { eoclip } bind def
/BT { } bind def
/ET { } bind def
/BDC { mark 3 1 roll /BDC pdfmark } bind def
/EMC { mark /EMC pdfmark } bind def
/cairo_store_point { /cairo_point_y exch def /cairo_point_x exch def } def
/Tj { show currentpoint cairo_store_point } bind def
/TJ {
  {
    dup
    type /stringtype eq
    { show } { -0.001 mul 0 cairo_font_matrix dtransform rmoveto } ifelse
  } forall
  currentpoint cairo_store_point
} bind def
/cairo_selectfont { cairo_font_matrix aload pop pop pop 0 0 6 array astore
    cairo_font exch selectfont cairo_point_x cairo_point_y moveto } bind def
/Tf { pop /cairo_font exch def /cairo_font_matrix where
      { pop cairo_selectfont } if } bind def
/Td { matrix translate cairo_font_matrix matrix concatmatrix dup
      /cairo_font_matrix exch def dup 4 get exch 5 get cairo_store_point
      /cairo_font where { pop cairo_selectfont } if } bind def
/Tm { 2 copy 8 2 roll 6 array astore /cairo_font_matrix exch def
      cairo_store_point /cairo_font where { pop cairo_selectfont } if } bind def
/g { setgray } bind def
/rg { setrgbcolor } bind def
/d1 { setcachedevice } bind def
/cairo_data_source {
  CairoDataIndex CairoData length lt
    { CairoData CairoDataIndex get /CairoDataIndex CairoDataIndex 1 add def }
    { () } ifelse
} def
/cairo_flush_ascii85_file { cairo_ascii85_file status { cairo_ascii85_file flushfile } if } def
/cairo_image { image cairo_flush_ascii85_file } def
/cairo_imagemask { imagemask cairo_flush_ascii85_file } def
%%EndProlog
%%BeginSetup
%%EndSetup
%%Page: 1 1
%%BeginPageSetup
%%PageBoundingBox: 6 6 378 378
%%EndPageSetup
q 6 6 372 372 rectclip
1 0 0 -1 0 384 cm q
q
114 126 m 126 126 l 126 138 l 114 138 l h
138 138 m 150 138 l 150 126 l 138 126 l h
162 138 m 174 138 l 174 126 l 162 126 l h
378 156 m 378 240 l 378 256.543 364.543 270 348 270 c 329.852 270 l 344.473
 280.949 354 298.363 354 318 c 354 351.086 327.086 378 294 378 c 280.555
 378 268.172 373.5 258.148 366 c 108 366 l 98.074 366 90 357.926 90 348 
c 90 270 l 36 270 l 19.457 270 6 256.543 6 240 c 6 156 l 6 141.516 16.324
 129.395 30 126.605 c 30 84 l 30 40.992 64.992 6 108 6 c 276 6 l 319.008
 6 354 40.992 354 84 c 354 126.605 l 367.676 129.395 378 141.516 378 156
 c h
42 84 m 42 126 l 66 126 l 66 84 l 66 60.84 84.84 42 108 42 c 276 42 l 299.16
 42 318 60.84 318 84 c 318 126 l 342 126 l 342 84 l 342 47.609 312.391 18
 276 18 c 108 18 l 71.609 18 42 47.609 42 84 c h
306 258 m 306 138 l 294 138 l 294 258 l h
282 120 m 282 116.695 279.305 114 276 114 c 108 114 l 104.695 114 102 116.695
 102 120 c 102 150 l 282 150 l h
306 126 m 306 84 l 306 67.457 292.543 54 276 54 c 108 54 l 91.457 54 78
 67.457 78 84 c 78 126 l 90 126 l 90 120 l 90 110.074 98.074 102 108 102
 c 276 102 l 285.926 102 294 110.074 294 120 c 294 126 l h
36 258 m 66 258 l 66 138 l 36 138 l 26.074 138 18 146.074 18 156 c 18 240
 l 18 249.926 26.074 258 36 258 c h
90 258 m 90 138 l 78 138 l 78 258 l h
108 354 m 246.113 354 l 240.848 347.012 237.02 338.879 235.211 330 c 148.895
 330 l 146.41 336.965 139.812 342 132 342 c 122.074 342 114 333.926 114 
324 c 114 314.074 122.074 306 132 306 c 139.812 306 146.41 311.035 148.895
 318 c 234 318 l 234 309.469 235.816 301.355 239.047 294 c 114 294 l 114
 174 l 270 174 l 270 263.047 l 273.816 261.371 277.824 260.062 282 259.211
 c 282 162 l 102 162 l 102 348 l 102 351.305 104.695 354 108 354 c h
192 186 m 182.074 186 174 194.074 174 204 c 174 213.926 182.074 222 192
 222 c 201.926 222 210 213.926 210 204 c 210 194.074 201.926 186 192 186
 c h
162 204 m 162 197.219 164.348 191.027 168.156 186 c 126 186 l 126 282 l
 138 282 l 138 276 l 138 253.391 151.98 234.012 171.738 225.977 c 165.793
 220.492 162 212.707 162 204 c h
150 282 m 234 282 l 234 276 l 234 252.84 215.16 234 192 234 c 168.84 234
 150 252.84 150 276 c h
258 270.113 m 258 186 l 215.844 186 l 219.652 191.027 222 197.219 222 204
 c 222 212.707 218.207 220.492 212.262 225.977 c 232.02 234.012 246 253.391
 246 276 c 246 282 l 246.113 282 l 249.504 277.5 253.5 273.504 258 270.113
 c h
132 318 m 128.695 318 126 320.695 126 324 c 126 327.305 128.695 330 132
 330 c 135.305 330 138 327.305 138 324 c 138 320.695 135.305 318 132 318
 c h
294 270 m 267.535 270 246 291.535 246 318 c 246 344.465 267.535 366 294
 366 c 320.465 366 342 344.465 342 318 c 342 291.535 320.465 270 294 270
 c h
366 156 m 366 146.074 357.926 138 348 138 c 318 138 l 318 258 l 348 258
 l 357.926 258 366 249.926 366 240 c h
337.414 318 m 270 351.707 l 270 284.293 l h
282 332.293 m 310.586 318 l 282 303.707 l h
282 332.293 m W n
[6 0 0 6 0 0] concat
/CairoFunction
   << /FunctionType 2
      /Domain [ 0 1 ]
      /C0 [ 0.623529 0.184314 1 ]
      /C1 [ 0.0431373 0.694118 0.827451 ]
      /N 1
   >>
def
   << /ShadingType 2
      /ColorSpace /DeviceRGB
      /Coords [ 32 63 32 1 ]
      /Extend [ true true ]
      /Function CairoFunction
   >>
shfill
Q
Q Q
showpage
%%Trailer
end
%%EOF
