%!PS-Adobe-3.0 EPSF-3.0
%%Creator: cairo 1.16.0 (https://cairographics.org)
%%CreationDate: Mon May  4 07:13:28 2020
%%Pages: 1
%%DocumentData: Clean7Bit
%%LanguageLevel: 3
%%BoundingBox: 5 6 379 378
%%EndComments
%%BeginProlog
50 dict begin
/q { gsave } bind def
/Q { grestore } bind def
/cm { 6 array astore concat } bind def
/w { setlinewidth } bind def
/J { setlinecap } bind def
/j { setlinejoin } bind def
/M { setmiterlimit } bind def
/d { setdash } bind def
/m { moveto } bind def
/l { lineto } bind def
/c { curveto } bind def
/h { closepath } bind def
/re { exch dup neg 3 1 roll 5 3 roll moveto 0 rlineto
      0 exch rlineto 0 rlineto closepath } bind def
/S { stroke } bind def
/f { fill } bind def
/f* { eofill } bind def
/n { newpath } bind def
/W { clip } bind def
/W* { eoclip } bind def
/BT { } bind def
/ET { } bind def
/BDC { mark 3 1 roll /BDC pdfmark } bind def
/EMC { mark /EMC pdfmark } bind def
/cairo_store_point { /cairo_point_y exch def /cairo_point_x exch def } def
/Tj { show currentpoint cairo_store_point } bind def
/TJ {
  {
    dup
    type /stringtype eq
    { show } { -0.001 mul 0 cairo_font_matrix dtransform rmoveto } ifelse
  } forall
  currentpoint cairo_store_point
} bind def
/cairo_selectfont { cairo_font_matrix aload pop pop pop 0 0 6 array astore
    cairo_font exch selectfont cairo_point_x cairo_point_y moveto } bind def
/Tf { pop /cairo_font exch def /cairo_font_matrix where
      { pop cairo_selectfont } if } bind def
/Td { matrix translate cairo_font_matrix matrix concatmatrix dup
      /cairo_font_matrix exch def dup 4 get exch 5 get cairo_store_point
      /cairo_font where { pop cairo_selectfont } if } bind def
/Tm { 2 copy 8 2 roll 6 array astore /cairo_font_matrix exch def
      cairo_store_point /cairo_font where { pop cairo_selectfont } if } bind def
/g { setgray } bind def
/rg { setrgbcolor } bind def
/d1 { setcachedevice } bind def
/cairo_data_source {
  CairoDataIndex CairoData length lt
    { CairoData CairoDataIndex get /CairoDataIndex CairoDataIndex 1 add def }
    { () } ifelse
} def
/cairo_flush_ascii85_file { cairo_ascii85_file status { cairo_ascii85_file flushfile } if } def
/cairo_image { image cairo_flush_ascii85_file } def
/cairo_imagemask { imagemask cairo_flush_ascii85_file } def
%%EndProlog
%%BeginSetup
%%EndSetup
%%Page: 1 1
%%BeginPageSetup
%%PageBoundingBox: 5 6 379 378
%%EndPageSetup
q 5 6 374 372 rectclip
1 0 0 -1 0 384 cm q
q
174 102 m 192 102 l 197.117 102 201.715 99.156 204 94.586 c 204.629 93.316
 l 215.363 98.688 l 214.734 99.953 l 210.402 108.617 201.691 114 192 114
 c 174 114 l h
210 342 m 174 342 l 174 354 l 210 354 l h
210 318 m 174 318 l 174 330 l 210 330 l h
210 294 m 174 294 l 174 306 l 210 306 l h
378 282 m 378 366 l 378 372.617 372.617 378 366 378 c 306 378 l 299.383
 378 294 372.617 294 366 c 294 282 l 294 275.383 299.383 270 306 270 c 321.516
 270 l 278.656 227.141 l 253.625 238.5 226.285 244.984 198 245.797 c 198
 270 l 222 270 l 228.617 270 234 275.383 234 282 c 234 366 l 234 372.617
 228.617 378 222 378 c 162 378 l 155.383 378 150 372.617 150 366 c 150 282
 l 150 275.383 155.383 270 162 270 c 186 270 l 186 245.797 l 157.715 244.984
 130.375 238.5 105.344 227.141 c 62.484 270 l 78 270 l 84.617 270 90 275.383
 90 282 c 90 366 l 90 372.617 84.617 378 78 378 c 18 378 l 11.383 378 6 
372.617 6 366 c 6 282 l 6 275.383 11.383 270 18 270 c 45.516 270 l 93.949
 221.566 l 58.57 202.859 28.586 174.203 8.477 138.012 c 5.129 132 l 8.477
 125.988 l 35.609 77.152 81.887 40.738 135.652 25.738 c 144.547 13.789 158.73
 6 174.738 6 c 209.262 6 l 225.27 6 239.453 13.789 248.348 25.738 c 302.113
 40.738 348.391 77.148 375.523 125.988 c 378.871 132 l 375.523 138.012 l
 355.414 174.203 325.43 202.859 290.051 221.566 c 338.484 270 l 366 270 
l 372.617 270 378 275.383 378 282 c h
78 282 m 18 282 l 18 366 l 78.012 366 l h
222 282 m 162 282 l 162 366 l 222.012 366 l h
264.012 43.621 m 290.516 65.164 306 97.297 306 132 c 306 167.605 289.57
 199.422 263.93 220.344 c 306.18 203.84 342.301 173.113 365.035 132.188 
c 365.129 132 l 365.027 131.812 l 342.691 91.602 306.57 60.328 264.012 43.621
 c h
150 78 m 143.383 78 138 83.383 138 90 c 138 96.617 143.383 102 150 102 
c h
126 54.738 m 126 54.562 126.023 54.395 126.023 54.227 c 103.262 73.48 90
 101.641 90 132 c 90 157.207 99.234 180.258 114.438 198.078 c 117.371 170.484
 136.488 147.156 163.312 139.066 c 165.055 133.859 l 157.766 129.629 152.34
 122.52 150.605 114 c 150 114 l 136.766 114 126 103.234 126 90 c 126 85.109
 127.488 80.562 130.008 76.766 c 127.457 66.559 l 126.492 62.707 126 58.727
 126 54.738 c h
234 102 m 240.617 102 246 96.617 246 90 c 246 83.383 240.617 78 234 78 
c h
218.941 133.859 m 220.68 139.066 l 247.512 147.156 266.621 170.477 269.555
 198.078 c 284.766 180.258 294 157.207 294 132 c 294 101.633 280.738 73.477
 257.977 54.223 c 257.977 54.395 258 54.562 258 54.738 c 258 58.727 257.508
 62.707 256.543 66.562 c 253.992 76.766 l 256.512 80.562 258 85.109 258 
90 c 258 103.234 247.234 114 234 114 c 233.395 114 l 231.66 122.516 226.234
 129.625 218.941 133.859 c h
176.441 137.641 m 175.34 140.957 l 192 149.293 l 208.66 140.965 l 207.559
 137.645 l 206.375 137.785 205.219 138 204 138 c 180 138 l 178.781 138 177.625
 137.785 176.441 137.641 c h
219.168 165.305 m 224.297 153.234 l 221.824 152.117 219.238 151.195 216.582
 150.422 c 204.461 156.48 l h
159.703 153.234 m 164.832 165.305 l 179.543 156.48 l 167.426 150.422 l 
164.762 151.188 162.176 152.113 159.703 153.234 c h
126 205.477 m 126 209.629 l 136.699 218.734 149.281 225.672 163.094 229.766
 c 179.566 180.328 l 176.062 172.555 l 159.168 182.688 l 149.27 159.367 
l 134.977 169.938 126 186.816 126 205.477 c h
194.125 174 m 197.574 166.34 l 192 162.996 l 186.426 166.34 l 189.875 174
 l h
204.434 180.328 m 220.906 229.766 l 234.719 225.672 247.301 218.734 258
 209.629 c 258 205.477 l 258 186.816 249.023 169.938 234.73 159.371 c 224.832
 182.695 l 207.938 172.559 l h
222 77.43 m 191.285 74.359 l 181.535 73.379 173.184 68.23 167.922 60.77
 c 164.25 62.922 162 66.82 162 71.125 c 162 108 l 162 117.926 170.074 126
 180 126 c 204 126 l 213.926 126 222 117.926 222 108 c h
192 234 m 197.855 234 203.566 233.395 209.152 232.441 c 193.68 186 l 190.32
 186 l 174.84 232.441 l 180.434 233.395 186.145 234 192 234 c h
138 54.738 m 138 57.742 138.371 60.742 139.098 63.641 c 140.219 68.129 
l 143.215 66.785 146.508 66 150 66 c 150.602 66 l 152.094 59.102 156.496
 53.16 162.938 49.824 c 162.324 47.316 162 44.695 162 42 c 174 42 l 174 
52.59 181.945 61.367 192.48 62.418 c 228.312 66 l 234 66 l 237.492 66 240.785
 66.785 243.785 68.137 c 244.906 63.652 l 245.629 60.742 246 57.742 246 
54.738 c 246 34.48 229.52 18 209.262 18 c 174.738 18 l 154.48 18 138 34.48
 138 54.738 c h
120.07 220.344 m 94.43 199.422 78 167.605 78 132 c 78 97.289 93.492 65.16
 120.008 43.613 c 77.438 60.316 41.309 91.598 18.965 131.812 c 18.871 132
 l 18.973 132.188 l 41.707 173.113 77.82 203.84 120.07 220.344 c h
366.012 366 m 366 282 l 306 282 l 306 366 l h
66 342 m 30 342 l 30 354 l 66 354 l h
66 318 m 30 318 l 30 330 l 66 330 l h
66 294 m 30 294 l 30 306 l 66 306 l h
329.07 332.586 m 322.242 325.758 l 313.758 334.242 l 330.93 351.414 l 358.992
 309.324 l 349.008 302.672 l h
329.07 332.586 m W n
[6 0 0 6 0 0] concat
/CairoFunction
   << /FunctionType 2
      /Domain [ 0 1 ]
      /C0 [ 0.623529 0.184314 1 ]
      /C1 [ 0.0431373 0.694118 0.827451 ]
      /N 1
   >>
def
   << /ShadingType 2
      /ColorSpace /DeviceRGB
      /Coords [ 32 63 32 1 ]
      /Extend [ true true ]
      /Function CairoFunction
   >>
shfill
Q
Q Q
showpage
%%Trailer
end
%%EOF
