%!PS-Adobe-3.0 EPSF-3.0
%%Creator: cairo 1.16.0 (https://cairographics.org)
%%CreationDate: Mon May  4 07:13:08 2020
%%Pages: 1
%%DocumentData: Clean7Bit
%%LanguageLevel: 3
%%BoundingBox: 6 6 378 378
%%EndComments
%%BeginProlog
50 dict begin
/q { gsave } bind def
/Q { grestore } bind def
/cm { 6 array astore concat } bind def
/w { setlinewidth } bind def
/J { setlinecap } bind def
/j { setlinejoin } bind def
/M { setmiterlimit } bind def
/d { setdash } bind def
/m { moveto } bind def
/l { lineto } bind def
/c { curveto } bind def
/h { closepath } bind def
/re { exch dup neg 3 1 roll 5 3 roll moveto 0 rlineto
      0 exch rlineto 0 rlineto closepath } bind def
/S { stroke } bind def
/f { fill } bind def
/f* { eofill } bind def
/n { newpath } bind def
/W { clip } bind def
/W* { eoclip } bind def
/BT { } bind def
/ET { } bind def
/BDC { mark 3 1 roll /BDC pdfmark } bind def
/EMC { mark /EMC pdfmark } bind def
/cairo_store_point { /cairo_point_y exch def /cairo_point_x exch def } def
/Tj { show currentpoint cairo_store_point } bind def
/TJ {
  {
    dup
    type /stringtype eq
    { show } { -0.001 mul 0 cairo_font_matrix dtransform rmoveto } ifelse
  } forall
  currentpoint cairo_store_point
} bind def
/cairo_selectfont { cairo_font_matrix aload pop pop pop 0 0 6 array astore
    cairo_font exch selectfont cairo_point_x cairo_point_y moveto } bind def
/Tf { pop /cairo_font exch def /cairo_font_matrix where
      { pop cairo_selectfont } if } bind def
/Td { matrix translate cairo_font_matrix matrix concatmatrix dup
      /cairo_font_matrix exch def dup 4 get exch 5 get cairo_store_point
      /cairo_font where { pop cairo_selectfont } if } bind def
/Tm { 2 copy 8 2 roll 6 array astore /cairo_font_matrix exch def
      cairo_store_point /cairo_font where { pop cairo_selectfont } if } bind def
/g { setgray } bind def
/rg { setrgbcolor } bind def
/d1 { setcachedevice } bind def
/cairo_data_source {
  CairoDataIndex CairoData length lt
    { CairoData CairoDataIndex get /CairoDataIndex CairoDataIndex 1 add def }
    { () } ifelse
} def
/cairo_flush_ascii85_file { cairo_ascii85_file status { cairo_ascii85_file flushfile } if } def
/cairo_image { image cairo_flush_ascii85_file } def
/cairo_imagemask { imagemask cairo_flush_ascii85_file } def
%%EndProlog
%%BeginSetup
%%EndSetup
%%Page: 1 1
%%BeginPageSetup
%%PageBoundingBox: 6 6 378 378
%%EndPageSetup
q 6 6 372 372 rectclip
1 0 0 -1 0 384 cm q
q
366 78 m 225.918 78 l 208.77 34.781 166.793 6 120 6 c 57.137 6 6 57.137
 6 120 c 6 173.059 42.492 217.637 91.656 230.285 c 90.594 233.387 90 236.652
 90 240 c 90 360 l 90 369.926 98.074 378 108 378 c 132 378 l 141.926 378
 150 369.926 150 360 c 150 240 l 150 236.672 149.418 233.426 148.363 230.336
 c 161.84 226.871 174.582 220.98 186 212.855 c 186 258 l 186 264.617 191.383
 270 198 270 c 366 270 l 372.617 270 378 264.617 378 258 c 378 198 l 378
 191.383 372.617 186 366 186 c 212.887 186 l 218.191 178.559 222.496 170.516
 225.871 162 c 366 162 l 372.617 162 378 156.617 378 150 c 378 90 l 378 
83.383 372.617 78 366 78 c h
150 150 m 150 90 l 222 90 l 222 150 l h
150 162 m 185.688 162 l 171.473 184.129 146.656 198 120 198 c 76.992 198
 42 163.008 42 120 c 42 76.992 76.992 42 120 42 c 146.656 42 171.473 55.871
 185.688 78 c 150 78 l 143.383 78 138 83.383 138 90 c 138 150 l 138 156.617
 143.383 162 150 162 c h
132 366 m 108 366 l 104.695 366 102 363.305 102 360 c 102 270 l 138 270
 l 138 360 l 138 363.305 135.305 366 132 366 c h
138 240 m 138 258 l 102 258 l 102 240 l 102 237.445 102.57 234.973 103.59
 232.68 c 108.965 233.461 114.414 234 120 234 c 125.539 234 131.004 233.484
 136.414 232.699 c 137.438 234.984 138 237.449 138 240 c h
198 198 m 282 198 l 282 258 l 198 258 l h
366 258 m 294 258 l 294 198 l 366 198 l h
197.621 186.035 m 191.309 186.238 186.238 191.309 186.043 197.629 c 167.609
 213.316 144.289 222 120 222 c 63.758 222 18 176.242 18 120 c 18 63.758 
63.758 18 120 18 c 160.266 18 196.59 41.789 212.957 78 c 199.555 78 l 184.055
 48.738 153.277 30 120 30 c 70.375 30 30 70.375 30 120 c 30 169.625 70.375
 210 120 210 c 153.277 210 184.055 191.262 199.555 162 c 212.922 162 l 209.004
 170.684 203.855 178.715 197.621 186.035 c h
234 150 m 234 90 l 366 90 l 366.008 150 l h
342 114 m 354 114 l 354 126 l 342 126 l h
318 114 m 330 114 l 330 126 l 318 126 l h
294 114 m 306 114 l 306 126 l 294 126 l h
270 114 m 282 114 l 282 126 l 270 126 l h
246 114 m 258 114 l 258 126 l 246 126 l h
214.242 106.242 m 174 146.484 l 157.758 130.242 l 166.242 121.758 l 174
 129.516 l 205.758 97.758 l h
342 378 m 348.617 378 354 372.617 354 366 c 354 306 l 354 299.383 348.617
 294 342 294 c 174 294 l 167.383 294 162 299.383 162 306 c 162 366 l 162
 372.617 167.383 378 174 378 c h
342.008 366 m 258 366 l 258 306 l 342 306 l h
174 306 m 246 306 l 246 366 l 174 366 l h
330 342 m 318 342 l 318 330 l 330 330 l h
306 342 m 294 342 l 294 330 l 306 330 l h
270 342 m 270 330 l 282 330 l 282 342 l h
210 222 m 222 222 l 222 234 l 210 234 l h
234 222 m 246 222 l 246 234 l 234 234 l h
270 222 m 270 234 l 258 234 l 258 222 l h
238.242 322.242 m 198 362.484 l 181.758 346.242 l 190.242 337.758 l 198
 345.516 l 229.758 313.758 l h
321.516 228 m 307.758 214.242 l 316.242 205.758 l 330 219.516 l 343.758
 205.758 l 352.242 214.242 l 338.484 228 l 352.242 241.758 l 343.758 250.242
 l 330 236.484 l 316.242 250.242 l 307.758 241.758 l h
321.516 228 m W n
[6 0 0 6 0 0] concat
/CairoFunction
   << /FunctionType 2
      /Domain [ 0 1 ]
      /C0 [ 0.623529 0.184314 1 ]
      /C1 [ 0.0431373 0.694118 0.827451 ]
      /N 1
   >>
def
   << /ShadingType 2
      /ColorSpace /DeviceRGB
      /Coords [ 32 63 32 1 ]
      /Extend [ true true ]
      /Function CairoFunction
   >>
shfill
Q
Q Q
showpage
%%Trailer
end
%%EOF
