%!PS-Adobe-3.0 EPSF-3.0
%%Creator: cairo 1.16.0 (https://cairographics.org)
%%CreationDate: Mon May  4 07:13:27 2020
%%Pages: 1
%%DocumentData: Clean7Bit
%%LanguageLevel: 3
%%BoundingBox: 6 6 378 378
%%EndComments
%%BeginProlog
50 dict begin
/q { gsave } bind def
/Q { grestore } bind def
/cm { 6 array astore concat } bind def
/w { setlinewidth } bind def
/J { setlinecap } bind def
/j { setlinejoin } bind def
/M { setmiterlimit } bind def
/d { setdash } bind def
/m { moveto } bind def
/l { lineto } bind def
/c { curveto } bind def
/h { closepath } bind def
/re { exch dup neg 3 1 roll 5 3 roll moveto 0 rlineto
      0 exch rlineto 0 rlineto closepath } bind def
/S { stroke } bind def
/f { fill } bind def
/f* { eofill } bind def
/n { newpath } bind def
/W { clip } bind def
/W* { eoclip } bind def
/BT { } bind def
/ET { } bind def
/BDC { mark 3 1 roll /BDC pdfmark } bind def
/EMC { mark /EMC pdfmark } bind def
/cairo_store_point { /cairo_point_y exch def /cairo_point_x exch def } def
/Tj { show currentpoint cairo_store_point } bind def
/TJ {
  {
    dup
    type /stringtype eq
    { show } { -0.001 mul 0 cairo_font_matrix dtransform rmoveto } ifelse
  } forall
  currentpoint cairo_store_point
} bind def
/cairo_selectfont { cairo_font_matrix aload pop pop pop 0 0 6 array astore
    cairo_font exch selectfont cairo_point_x cairo_point_y moveto } bind def
/Tf { pop /cairo_font exch def /cairo_font_matrix where
      { pop cairo_selectfont } if } bind def
/Td { matrix translate cairo_font_matrix matrix concatmatrix dup
      /cairo_font_matrix exch def dup 4 get exch 5 get cairo_store_point
      /cairo_font where { pop cairo_selectfont } if } bind def
/Tm { 2 copy 8 2 roll 6 array astore /cairo_font_matrix exch def
      cairo_store_point /cairo_font where { pop cairo_selectfont } if } bind def
/g { setgray } bind def
/rg { setrgbcolor } bind def
/d1 { setcachedevice } bind def
/cairo_data_source {
  CairoDataIndex CairoData length lt
    { CairoData CairoDataIndex get /CairoDataIndex CairoDataIndex 1 add def }
    { () } ifelse
} def
/cairo_flush_ascii85_file { cairo_ascii85_file status { cairo_ascii85_file flushfile } if } def
/cairo_image { image cairo_flush_ascii85_file } def
/cairo_imagemask { imagemask cairo_flush_ascii85_file } def
%%EndProlog
%%BeginSetup
%%EndSetup
%%Page: 1 1
%%BeginPageSetup
%%PageBoundingBox: 6 6 378 378
%%EndPageSetup
q 6 6 372 372 rectclip
1 0 0 -1 0 384 cm q
q
328.535 138.641 m 326.941 133.859 l 334.23 129.629 339.652 122.52 341.387
 114 c 342 114 l 355.234 114 366 103.234 366 90 c 366 85.109 364.512 80.566
 361.992 76.77 c 364.543 66.562 l 365.508 62.707 366 58.727 366 54.738 c
 366 27.863 344.137 6 317.262 6 c 292.973 6 l 281.297 6 270.289 10.266 261.664
 18 c 42 18 l 22.145 18 6 34.145 6 54 c 6 342 l 6 361.855 22.145 378 42 
378 c 360.797 378 l 354.355 326.465 l 369.176 314.004 378 295.453 378 276
 c 378 240 l 378 230.074 369.926 222 360 222 c 357.629 222 355.379 222.484
 353.305 223.32 c 351.234 215.672 344.297 210 336 210 c 333.629 210 331.379
 210.484 329.305 211.32 c 329.184 210.871 329.047 210.434 328.891 210 c 
378 210 l 378 198.371 l 378 169.066 356.992 144.035 328.535 138.641 c h
332.875 152.195 m 326.801 166.262 l 312.137 160.391 l 325.535 150.348 l
 328.055 150.785 330.512 151.391 332.875 152.195 c h
222.234 241.883 m 229.676 286.512 l 230.102 289.062 230.73 291.551 231.473
 293.992 c 42 293.992 l 42 54 l 234.059 54 l 234.055 54.254 234 54.484 234
 54.738 c 234 56.102 l 234 59.184 234.379 62.262 235.129 65.238 c 238.008
 76.77 l 235.488 80.566 234 85.109 234 90 c 234 103.234 244.766 114 258 
114 c 258.605 114 l 260.34 122.516 265.766 129.625 273.055 133.859 c 271.457
 138.641 l 243.008 144.035 222 169.066 222 198.379 c 222 210 l 270 210 l
 270 254.258 l 270 256.32 268.32 258 266.258 258 c 264.414 258 262.867 256.68
 262.559 254.875 c 260.039 239.746 l 258.324 229.465 249.512 222 239.082
 222 c 229.66 222 222 229.66 222 239.082 c 222 240.031 222.078 240.965 222.234
 241.883 c h
246.77 62.328 m 246.258 60.301 246 58.199 246 56.102 c 246 54.738 l 246
 44.82 251.684 36.07 260.273 31.801 c 268.277 55.805 l 264.012 57.852 260.707
 61.508 259.105 65.992 c 258 65.992 l 254.508 65.992 251.215 66.781 248.219
 68.125 c h
258 102 m 251.383 102 246 96.617 246 90 c 246 83.383 251.383 78 258 78 
c h
273.191 166.262 m 267.121 152.195 l 269.484 151.391 271.938 150.785 274.457
 150.348 c 287.855 160.391 l h
270 198 m 234 198 l 234.133 181.152 242.902 166.117 256.309 157.414 c 266.809
 181.738 l 270 180.461 l h
316.938 141.797 m 300 154.5 l 283.062 141.797 l 284.449 137.641 l 285.625
 137.785 286.781 138 288 138 c 312 138 l 313.219 138 314.375 137.785 315.559
 137.641 c h
330 108 m 330 117.926 321.926 126 312 126 c 288 126 l 278.074 126 270 117.926
 270 108 c 270 72 l 270 68.695 272.695 66 276 66 c 324 66 l 327.305 66 330
 68.695 330 72 c h
342 102 m 342 78 l 348.617 78 354 83.383 354 90 c 354 96.617 348.617 102
 342 102 c h
317.262 18 m 337.52 18 354 34.48 354 54.738 c 354 57.742 353.629 60.738
 352.902 63.648 c 351.781 68.129 l 348.785 66.785 345.492 66 342 66 c 340.895
 66 l 338.41 59.035 331.812 54 324 54 c 280.324 54 l 270.938 25.824 l 277.145
 20.762 284.844 18 292.973 18 c h
18 342 m 18 54 l 18 40.766 28.766 30 42 30 c 243.395 30 l 240.316 33.523
 237.863 37.547 236.262 42 c 42 42 l 35.383 42 30 47.383 30 54 c 30 294 
l 30 300.617 35.383 306 42 306 c 236.633 306 l 241.613 314.688 248.832 321.984
 257.555 327.191 c 252.703 366 l 42 366 l 28.766 366 18 355.234 18 342 c
 h
264.797 366 m 269.297 330 l 342.707 330 l 347.207 366 l h
318 216 m 318 270 l 330 270 l 330 228 l 330 224.688 332.695 222 336 222
 c 339.305 222 342 224.688 342 228 c 342 270 l 354 270 l 354 240 l 354 236.688
 356.695 234 360 234 c 363.305 234 366 236.688 366 240 c 366 276 l 366 292.254
 358.535 307.812 345.941 318 c 265.465 318 l 252.793 311.184 243.883 298.777
 241.508 284.551 c 234.066 239.922 l 234.023 239.641 234 239.363 234 239.082
 c 234 236.281 236.281 234 239.082 234 c 243.617 234 247.457 237.254 248.207
 241.723 c 250.727 256.844 l 251.992 264.469 258.527 270 266.258 270 c 274.938
 270 282 262.938 282 254.258 c 282 180 l 282 176.695 284.695 174 288 174
 c 291.305 174 294 176.695 294 180 c 294 270 l 306 270 l 306 216 l 306 212.688
 308.695 210 312 210 c 315.305 210 318 212.688 318 216 c h
306 198 m 306 180 l 306 176.062 304.691 172.445 302.539 169.48 c 333.191
 181.738 l 343.691 157.414 l 357.098 166.117 365.867 181.152 366 198 c h
312.629 93.316 m 323.363 98.688 l 322.734 99.953 l 318.402 108.617 309.691
 114 300 114 c 282 114 l 282 102 l 300 102 l 305.117 102 309.715 99.156 
312 94.586 c h
174 318 m 126 318 l 119.383 318 114 323.383 114 330 c 114 342 l 114 348.617
 119.383 354 126 354 c 174 354 l 180.617 354 186 348.617 186 342 c 186 330
 l 186 323.383 180.617 318 174 318 c h
126 342 m 126 330 l 174 330 l 174.008 342 l h
115.324 118.754 m 121.801 113.242 126 105.145 126 96 c 126 79.457 112.543
 66 96 66 c 79.457 66 66 79.457 66 96 c 66 105.145 70.199 113.242 76.676
 118.754 c 63.223 125.762 54 139.812 54 156 c 54 162 l 138 162 l 138 156
 l 138 139.812 128.777 125.762 115.324 118.754 c h
78 96 m 78 86.074 86.074 78 96 78 c 105.926 78 114 86.074 114 96 c 114 
105.926 105.926 114 96 114 c 86.074 114 78 105.926 78 96 c h
66.605 150 m 69.391 136.324 81.516 126 96 126 c 110.484 126 122.609 136.324
 125.395 150 c h
115.324 238.754 m 121.801 233.242 126 225.145 126 216 c 126 199.457 112.543
 186 96 186 c 79.457 186 66 199.457 66 216 c 66 225.145 70.199 233.242 76.676
 238.754 c 63.223 245.762 54 259.812 54 276 c 54 282 l 138 282 l 138 276
 l 138 259.812 128.777 245.762 115.324 238.754 c h
78 216 m 78 206.074 86.074 198 96 198 c 105.926 198 114 206.074 114 216
 c 114 225.926 105.926 234 96 234 c 86.074 234 78 225.926 78 216 c h
66.605 270 m 69.391 256.324 81.516 246 96 246 c 110.484 246 122.609 256.324
 125.395 270 c h
186 162 m 150 162 l 150 150 l 186 150 l h
150 126 m 210 126 l 210 138 l 150 138 l h
174 114 m 150 114 l 150 102 l 174 102 l h
186 102 m 210 102 l 210 114 l 186 114 l h
150 270 m 186 270 l 186 282 l 150 282 l h
150 246 m 210 246 l 210 258 l 150 258 l h
174 234 m 150 234 l 150 222 l 174 222 l h
186 222 m 210 222 l 210 234 l 186 234 l h
186 222 m W n
[6 0 0 6 0 0] concat
/CairoFunction
   << /FunctionType 2
      /Domain [ 0 1 ]
      /C0 [ 0.623529 0.184314 1 ]
      /C1 [ 0.0431373 0.694118 0.827451 ]
      /N 1
   >>
def
   << /ShadingType 2
      /ColorSpace /DeviceRGB
      /Coords [ 32 63 32 1 ]
      /Extend [ true true ]
      /Function CairoFunction
   >>
shfill
Q
Q Q
showpage
%%Trailer
end
%%EOF
