%!PS-Adobe-3.0 EPSF-3.0
%%Creator: cairo 1.16.0 (https://cairographics.org)
%%CreationDate: Mon May  4 07:13:23 2020
%%Pages: 1
%%DocumentData: Clean7Bit
%%LanguageLevel: 3
%%BoundingBox: 6 6 378 378
%%EndComments
%%BeginProlog
50 dict begin
/q { gsave } bind def
/Q { grestore } bind def
/cm { 6 array astore concat } bind def
/w { setlinewidth } bind def
/J { setlinecap } bind def
/j { setlinejoin } bind def
/M { setmiterlimit } bind def
/d { setdash } bind def
/m { moveto } bind def
/l { lineto } bind def
/c { curveto } bind def
/h { closepath } bind def
/re { exch dup neg 3 1 roll 5 3 roll moveto 0 rlineto
      0 exch rlineto 0 rlineto closepath } bind def
/S { stroke } bind def
/f { fill } bind def
/f* { eofill } bind def
/n { newpath } bind def
/W { clip } bind def
/W* { eoclip } bind def
/BT { } bind def
/ET { } bind def
/BDC { mark 3 1 roll /BDC pdfmark } bind def
/EMC { mark /EMC pdfmark } bind def
/cairo_store_point { /cairo_point_y exch def /cairo_point_x exch def } def
/Tj { show currentpoint cairo_store_point } bind def
/TJ {
  {
    dup
    type /stringtype eq
    { show } { -0.001 mul 0 cairo_font_matrix dtransform rmoveto } ifelse
  } forall
  currentpoint cairo_store_point
} bind def
/cairo_selectfont { cairo_font_matrix aload pop pop pop 0 0 6 array astore
    cairo_font exch selectfont cairo_point_x cairo_point_y moveto } bind def
/Tf { pop /cairo_font exch def /cairo_font_matrix where
      { pop cairo_selectfont } if } bind def
/Td { matrix translate cairo_font_matrix matrix concatmatrix dup
      /cairo_font_matrix exch def dup 4 get exch 5 get cairo_store_point
      /cairo_font where { pop cairo_selectfont } if } bind def
/Tm { 2 copy 8 2 roll 6 array astore /cairo_font_matrix exch def
      cairo_store_point /cairo_font where { pop cairo_selectfont } if } bind def
/g { setgray } bind def
/rg { setrgbcolor } bind def
/d1 { setcachedevice } bind def
/cairo_data_source {
  CairoDataIndex CairoData length lt
    { CairoData CairoDataIndex get /CairoDataIndex CairoDataIndex 1 add def }
    { () } ifelse
} def
/cairo_flush_ascii85_file { cairo_ascii85_file status { cairo_ascii85_file flushfile } if } def
/cairo_image { image cairo_flush_ascii85_file } def
/cairo_imagemask { imagemask cairo_flush_ascii85_file } def
%%EndProlog
%%BeginSetup
%%EndSetup
%%Page: 1 1
%%BeginPageSetup
%%PageBoundingBox: 6 6 378 378
%%EndPageSetup
q 6 6 372 372 rectclip
1 0 0 -1 0 384 cm q
q
150 84 m 150 87.312 147.312 90 144 90 c 140.688 90 138 87.312 138 84 c 
138 80.688 140.688 78 144 78 c 147.312 78 150 80.688 150 84 c h
318 30 m 354 30 l 354 114 l 222 114 l 222 54 l 258 54 l 258 102 l 270 102
 l 270 42 l 306 42 l 306 102 l 318 102 l h
246 66 m 234 66 l 234 102 l 246 102 l h
282 102 m 294 102 l 294 54 l 282 54 l h
330 102 m 342 102 l 342 42 l 330 42 l h
378 24 m 378 120 l 378 129.926 369.926 138 360 138 c 314.484 138 l 294.727
 157.758 l 292.031 160.453 288.301 162 284.484 162 c 276.496 162 270 155.504
 270 147.516 c 270 138 l 254.656 138 l 270 178.906 l 270 312 l 270 335.152
 251.152 354 228 354 c 216.695 354 205.844 349.332 198 341.34 c 198 378 
l 6 378 l 6 288.859 l 6 239.273 41.777 196.469 90 187.043 c 90 172.066 l
 53.023 157.277 l 39.035 151.676 30 138.328 30 123.27 c 30 118.277 31.031
 113.363 32.988 108.809 c 23.641 100.301 18 88.219 18 75 c 18 56.125 29.32
 39.402 46.844 32.398 c 49.727 31.246 l 58.469 15.617 74.777 6 92.832 6 
c 156 6 l 172.543 6 186 19.457 186 36 c 186 45.762 181.242 54.367 174 59.844
 c 174 74.363 l 174 75.551 174.348 76.703 175.008 77.695 c 182.801 89.387
 l 184.891 92.52 186 96.168 186 99.941 c 186 107.195 181.969 113.719 175.48
 116.969 c 173.988 117.715 l 174 144 l 174 158.484 163.676 170.605 150 173.395
 c 150 186.953 l 173.531 191.555 194.773 204.293 210 222.559 c 210 178.914
 l 225.336 138 l 216 138 l 206.074 138 198 129.926 198 120 c 198 24 l 198
 14.074 206.074 6 216 6 c 360 6 l 369.926 6 378 14.074 378 24 c h
255.344 174 m 250.844 162 l 229.156 162 l 224.656 174 l h
246.344 150 m 242.488 139.727 l 241.715 137.664 238.289 137.664 237.504
 139.727 c 233.652 150 l h
91.508 198.961 m 94.211 212.473 l 107.539 204.48 l 95.125 198.27 l 93.906
 198.469 92.707 198.715 91.508 198.961 c h
102.344 340.32 m 120 362.395 l 137.656 340.32 l 120.875 234 l 119.125 234
 l h
124.453 213.672 m 120 210.996 l 115.547 213.664 l 118.32 222 l 121.676 
222 l h
145.789 212.473 m 148.477 199.027 l 147.266 198.781 146.07 198.484 144.84
 198.281 c 132.457 204.473 l h
162 138 m 162 126 l 139.027 126 l 141.504 132.984 148.176 138 156 138 c
 h
162 74.371 m 162 65.395 l 160.062 65.789 158.051 66 156 66 c 126 66 l 121.23
 66 116.809 64.566 113.07 62.152 c 106.445 64.922 102 71.395 102 78.738 
c 102 102 l 91.996 102 l 84.281 102 78 108.281 78 115.996 c 78 120.379 80.094
 124.57 83.605 127.199 c 102 141 l 102 188.293 l 120 197.293 l 138 188.293
 l 138 174 l 114 174 l 114 162 l 144 162 l 151.812 162 158.41 156.965 160.895
 150 c 156 150 l 139.457 150 126 136.543 126 120 c 126 114 l 162.629 114
 l 163.602 110.992 165.695 108.438 168.637 106.973 c 170.125 106.23 l 172.512
 105.035 174 102.625 174 99.941 c 174 98.555 173.594 97.207 172.824 96.055
 c 165.023 84.355 l 163.043 81.383 162 77.93 162 74.371 c h
90 159.137 m 90 147 l 76.398 136.801 l 69.883 131.91 66 124.133 66 115.996
 c 66 102.336 76.598 91.105 90 90.078 c 90 78.738 l 90 67.914 95.824 58.273
 104.785 52.98 c 103.062 49.676 102 45.977 102 42 c 114 42 l 114 48.617 
119.383 54 126 54 c 156 54 l 165.926 54 174 45.926 174 36 c 174 26.074 165.926
 18 156 18 c 92.832 18 l 78.57 18 65.746 25.926 59.371 38.684 c 58.352 40.723
 l 51.301 43.547 l 38.359 48.715 30 61.066 30 75 c 30 88.934 38.359 101.285
 51.293 106.453 c 56.227 108.426 l 51.773 119.566 l 46.836 117.602 l 45.562
 117.09 44.398 116.426 43.199 115.816 c 42.434 118.219 42 120.727 42 123.27
 c 42 133.398 48.078 142.367 57.473 146.129 c h
18 366 m 42 366 l 42 270 l 54 270 l 54 366 l 107.516 366 l 89.656 343.68
 l 107.844 228.512 l 105.008 219.996 l 85.781 231.527 l 79.891 202.086 l
 43.648 214.688 18 249.367 18 288.859 c h
258 312 m 258 186 l 246 186 l 246 282 l 234 282 l 234 186 l 222 186 l 222
 306 l 210 306 l 210 243.602 l 198.93 224.105 180.996 209.473 160.078 202.207
 c 154.211 231.527 l 134.988 219.996 l 132.148 228.512 l 150.336 343.68 
l 132.484 366 l 186 366 l 186 270 l 198 270 l 198 321.996 l 204 329.992 
l 209.633 337.512 218.609 342 228 342 c 230.051 342 232.062 341.789 234 
341.395 c 234 294 l 246 294 l 246 335.844 l 253.242 330.367 258 321.762 
258 312 c h
366 24 m 366 20.688 363.312 18 360 18 c 216 18 l 212.688 18 210 20.688 
210 24 c 210 120 l 210 123.312 212.688 126 216 126 c 282 126 l 282 147.516
 l 282 149.543 284.812 150.703 286.242 149.273 c 309.516 126 l 360 126 l
 363.312 126 366 123.312 366 120 c h
282 282 m 294 282 l 294 270 l 282 270 l h
306 282 m 378 282 l 378 270 l 306 270 l h
282 258 m 294 258 l 294 246 l 282 246 l h
306 258 m 378 258 l 378 246 l 306 246 l h
282 234 m 294 234 l 294 222 l 282 222 l h
306 234 m 378 234 l 378 222 l 306 222 l h
294 198 m 282 198 l 282 210 l 294 210 l h
306 210 m 378 210 l 378 198 l 306 198 l h
306 210 m W n
[6 0 0 6 0 0] concat
/CairoFunction
   << /FunctionType 2
      /Domain [ 0 1 ]
      /C0 [ 0.623529 0.184314 1 ]
      /C1 [ 0.0431373 0.694118 0.827451 ]
      /N 1
   >>
def
   << /ShadingType 2
      /ColorSpace /DeviceRGB
      /Coords [ 32 63 32 1 ]
      /Extend [ true true ]
      /Function CairoFunction
   >>
shfill
Q
Q Q
showpage
%%Trailer
end
%%EOF
