%!PS-Adobe-3.0 EPSF-3.0
%%Creator: cairo 1.16.0 (https://cairographics.org)
%%CreationDate: Mon May  4 07:13:18 2020
%%Pages: 1
%%DocumentData: Clean7Bit
%%LanguageLevel: 3
%%BoundingBox: 6 6 378 378
%%EndComments
%%BeginProlog
50 dict begin
/q { gsave } bind def
/Q { grestore } bind def
/cm { 6 array astore concat } bind def
/w { setlinewidth } bind def
/J { setlinecap } bind def
/j { setlinejoin } bind def
/M { setmiterlimit } bind def
/d { setdash } bind def
/m { moveto } bind def
/l { lineto } bind def
/c { curveto } bind def
/h { closepath } bind def
/re { exch dup neg 3 1 roll 5 3 roll moveto 0 rlineto
      0 exch rlineto 0 rlineto closepath } bind def
/S { stroke } bind def
/f { fill } bind def
/f* { eofill } bind def
/n { newpath } bind def
/W { clip } bind def
/W* { eoclip } bind def
/BT { } bind def
/ET { } bind def
/BDC { mark 3 1 roll /BDC pdfmark } bind def
/EMC { mark /EMC pdfmark } bind def
/cairo_store_point { /cairo_point_y exch def /cairo_point_x exch def } def
/Tj { show currentpoint cairo_store_point } bind def
/TJ {
  {
    dup
    type /stringtype eq
    { show } { -0.001 mul 0 cairo_font_matrix dtransform rmoveto } ifelse
  } forall
  currentpoint cairo_store_point
} bind def
/cairo_selectfont { cairo_font_matrix aload pop pop pop 0 0 6 array astore
    cairo_font exch selectfont cairo_point_x cairo_point_y moveto } bind def
/Tf { pop /cairo_font exch def /cairo_font_matrix where
      { pop cairo_selectfont } if } bind def
/Td { matrix translate cairo_font_matrix matrix concatmatrix dup
      /cairo_font_matrix exch def dup 4 get exch 5 get cairo_store_point
      /cairo_font where { pop cairo_selectfont } if } bind def
/Tm { 2 copy 8 2 roll 6 array astore /cairo_font_matrix exch def
      cairo_store_point /cairo_font where { pop cairo_selectfont } if } bind def
/g { setgray } bind def
/rg { setrgbcolor } bind def
/d1 { setcachedevice } bind def
/cairo_data_source {
  CairoDataIndex CairoData length lt
    { CairoData CairoDataIndex get /CairoDataIndex CairoDataIndex 1 add def }
    { () } ifelse
} def
/cairo_flush_ascii85_file { cairo_ascii85_file status { cairo_ascii85_file flushfile } if } def
/cairo_image { image cairo_flush_ascii85_file } def
/cairo_imagemask { imagemask cairo_flush_ascii85_file } def
%%EndProlog
%%BeginSetup
%%EndSetup
%%Page: 1 1
%%BeginPageSetup
%%PageBoundingBox: 6 6 378 378
%%EndPageSetup
q 6 6 372 372 rectclip
1 0 0 -1 0 384 cm q
q
156.629 93.316 m 167.363 98.688 l 166.734 99.953 l 162.402 108.617 153.691
 114 144 114 c 126 114 l 126 102 l 144 102 l 149.117 102 153.715 99.156 
156 94.586 c h
177.09 48.859 m 147.09 30.859 l 140.914 41.148 l 170.914 59.148 l h
54 246 m 54 258 l 102 258 l 102 246 l h
114 246 m 114 258 l 162 258 l 162 246 l h
234 270 m 54 270 l 54 282 l 234 282 l h
234 294 m 54 294 l 54 306 l 234 306 l h
6 366 m 6 66 l 6 59.383 11.383 54 18 54 c 78.918 54 l 78.383 50.812 l 78.125
 49.277 78 47.711 78 46.145 c 78 33.898 85.805 23.074 97.414 19.199 c 97.906
 19.039 l 102.941 10.934 111.73 6 121.414 6 c 161.262 6 l 187.891 6 209.562
 27.469 209.965 54 c 270 54 l 276.617 54 282 59.383 282 66 c 282 108 l 304.922
 108 l 345.215 108 378 140.777 378 181.074 c 378 204.898 366.348 227.281
 346.828 240.941 c 323.117 257.543 l 319.906 259.781 318 263.461 318 267.371
 c 318 270 l 306 270 l 306 267.371 l 306 259.547 309.828 252.199 316.234
 247.711 c 339.949 231.109 l 356.262 219.695 366 200.988 366 181.074 c 366
 147.395 338.605 120 304.922 120 c 271.078 120 l 237.395 120 210 147.395
 210 181.074 c 210 200.988 219.738 219.695 236.051 231.109 c 259.766 247.711
 l 266.172 252.199 270 259.547 270 267.371 c 270 270 l 258 270 l 258 267.371
 l 258 263.461 256.094 259.781 252.883 257.543 c 229.172 240.941 l 226.176
 238.844 223.434 236.477 220.824 234 c 54 234 l 54 210 l 54 175.859 78.301
 146.219 111.773 139.523 c 115.402 138.797 l 117.047 133.855 l 109.758 129.617
 104.34 122.516 102.602 114 c 102 114 l 88.766 114 78 103.234 78 90 c 78
 84.77 79.727 79.957 82.586 76.008 c 80.914 66 l 18 66 l 18 366 l 270 366
 l 270 335.844 l 262.758 330.359 258 321.758 258 312 c 258 306 l 318 306
 l 318 312 l 318 328.543 304.543 342 288 342 c 285.949 342 283.938 341.789
 282 341.395 c 282 366 l 282 372.617 276.617 378 270 378 c 18 378 l 11.383
 378 6 372.617 6 366 c h
271.027 318 m 273.504 324.984 280.176 330 288 330 c 295.824 330 302.496
 324.984 304.973 318 c h
102 102 m 102 78 l 95.383 78 90 83.383 90 90 c 90 96.617 95.383 102 102
 102 c h
128.441 137.641 m 127.055 141.797 l 144 154.5 l 160.938 141.797 l 159.57
 137.684 l 158.387 137.824 157.219 138 156 138 c 132 138 l 130.781 138 129.625
 137.785 128.441 137.641 c h
133.957 222 m 154.043 222 l 145.469 192 l 142.531 192 l h
150.305 174.727 m 144 169.688 l 137.695 174.73 l 141.211 180 l 146.789 
180 l h
170.707 175.68 m 177.395 152.25 l 176.215 151.938 175.066 151.531 173.867
 151.289 c 169.445 150.406 l 153.793 162.148 l h
110.578 152.164 m 117.293 175.68 l 134.207 162.148 l 118.555 150.406 l 
114.133 151.289 l 112.926 151.531 111.758 151.855 110.578 152.164 c h
66 222 m 121.469 222 l 131.465 187.02 l 128.293 182.258 l 110.711 196.32
 l 99.301 156.367 l 79.344 166.289 66 186.906 66 210 c h
198 181.074 m 198 175.152 198.785 169.422 200.125 163.902 c 196.586 160.98
 192.793 158.418 188.699 156.391 c 177.293 196.312 l 159.715 182.25 l 156.539
 187.016 l 166.531 222 l 210.562 222 l 202.5 210.066 198 195.852 198 181.074
 c h
270 66 m 208.645 66 l 208.602 66.188 208.586 66.379 208.543 66.562 c 205.992
 76.766 l 208.512 80.562 210 85.109 210 90 c 210 103.234 199.234 114 186
 114 c 185.395 114 l 183.652 122.527 178.289 129.742 170.98 133.973 c 172.59
 138.797 l 176.219 139.523 l 186.359 141.551 195.852 145.789 204.16 151.789
 c 215.34 126.355 240.574 108.484 269.992 108.055 c 269.992 66 l h
186 78 m 186 102 l 192.617 102 198 96.617 198 90 c 198 83.383 192.617 78
 186 78 c h
90 46.145 m 90 47.047 90.07 47.945 90.223 48.828 c 93.359 67.676 l 96.047
 66.629 98.945 66 102 66 c 102.098 66 l 102.602 56.016 108.301 47.141 117.312
 42.629 c 120.258 41.152 l 153.086 60.852 l 146.91 71.141 l 120.043 55.02
 l 116.258 57.961 114 62.484 114 67.414 c 114 108 l 114 117.926 122.074 
126 132 126 c 156 126 l 165.926 126 174 117.926 174 108 c 174 66 l 186 66
 l 189.492 66 192.785 66.785 195.785 68.137 c 196.906 63.652 l 197.629 60.742
 198 57.742 198 54.738 c 198 34.48 181.52 18 161.262 18 c 121.414 18 l 115.43
 18 110.039 21.328 107.363 26.684 c 106.246 28.906 l 101.203 30.59 l 94.508
 32.82 90 39.078 90 46.145 c h
54 354 m 66 354 l 66 342 l 54 342 l h
90 354 m 90 342 l 78 342 l 78 354 l h
114 354 m 114 342 l 102 342 l 102 354 l h
234 318 m 54 318 l 54 330 l 234 330 l h
282 270 m 282 241.996 l 244.648 192.203 l 261.941 166.266 l 274.816 172.699
 l 288 159.516 l 301.184 172.699 l 314.059 166.266 l 331.352 192.203 l 294
 241.996 l 294 270 l h
282 222 m 282 198 l 294 198 l 294 222 l 316.648 191.797 l 309.941 181.734
 l 298.816 187.301 l 288 176.484 l 277.184 187.301 l 266.059 181.734 l 259.352
 191.797 l h
258 294 m 318 294 l 318 282 l 258 282 l h
258 294 m W n
[6 0 0 6 0 0] concat
/CairoFunction
   << /FunctionType 2
      /Domain [ 0 1 ]
      /C0 [ 0.623529 0.184314 1 ]
      /C1 [ 0.0431373 0.694118 0.827451 ]
      /N 1
   >>
def
   << /ShadingType 2
      /ColorSpace /DeviceRGB
      /Coords [ 32 63 32 1 ]
      /Extend [ true true ]
      /Function CairoFunction
   >>
shfill
Q
Q Q
showpage
%%Trailer
end
%%EOF
