%!PS-Adobe-3.0 EPSF-3.0
%%Creator: cairo 1.16.0 (https://cairographics.org)
%%CreationDate: Mon May  4 07:13:07 2020
%%Pages: 1
%%DocumentData: Clean7Bit
%%LanguageLevel: 3
%%BoundingBox: 6 6 377 378
%%EndComments
%%BeginProlog
50 dict begin
/q { gsave } bind def
/Q { grestore } bind def
/cm { 6 array astore concat } bind def
/w { setlinewidth } bind def
/J { setlinecap } bind def
/j { setlinejoin } bind def
/M { setmiterlimit } bind def
/d { setdash } bind def
/m { moveto } bind def
/l { lineto } bind def
/c { curveto } bind def
/h { closepath } bind def
/re { exch dup neg 3 1 roll 5 3 roll moveto 0 rlineto
      0 exch rlineto 0 rlineto closepath } bind def
/S { stroke } bind def
/f { fill } bind def
/f* { eofill } bind def
/n { newpath } bind def
/W { clip } bind def
/W* { eoclip } bind def
/BT { } bind def
/ET { } bind def
/BDC { mark 3 1 roll /BDC pdfmark } bind def
/EMC { mark /EMC pdfmark } bind def
/cairo_store_point { /cairo_point_y exch def /cairo_point_x exch def } def
/Tj { show currentpoint cairo_store_point } bind def
/TJ {
  {
    dup
    type /stringtype eq
    { show } { -0.001 mul 0 cairo_font_matrix dtransform rmoveto } ifelse
  } forall
  currentpoint cairo_store_point
} bind def
/cairo_selectfont { cairo_font_matrix aload pop pop pop 0 0 6 array astore
    cairo_font exch selectfont cairo_point_x cairo_point_y moveto } bind def
/Tf { pop /cairo_font exch def /cairo_font_matrix where
      { pop cairo_selectfont } if } bind def
/Td { matrix translate cairo_font_matrix matrix concatmatrix dup
      /cairo_font_matrix exch def dup 4 get exch 5 get cairo_store_point
      /cairo_font where { pop cairo_selectfont } if } bind def
/Tm { 2 copy 8 2 roll 6 array astore /cairo_font_matrix exch def
      cairo_store_point /cairo_font where { pop cairo_selectfont } if } bind def
/g { setgray } bind def
/rg { setrgbcolor } bind def
/d1 { setcachedevice } bind def
/cairo_data_source {
  CairoDataIndex CairoData length lt
    { CairoData CairoDataIndex get /CairoDataIndex CairoDataIndex 1 add def }
    { () } ifelse
} def
/cairo_flush_ascii85_file { cairo_ascii85_file status { cairo_ascii85_file flushfile } if } def
/cairo_image { image cairo_flush_ascii85_file } def
/cairo_imagemask { imagemask cairo_flush_ascii85_file } def
%%EndProlog
%%BeginSetup
%%EndSetup
%%Page: 1 1
%%BeginPageSetup
%%PageBoundingBox: 6 6 377 378
%%EndPageSetup
q 6 6 371 372 rectclip
1 0 0 -1 0 384 cm q
q
174 96 m 174 99.312 171.312 102 168 102 c 164.688 102 162 99.312 162 96
 c 162 92.688 164.688 90 168 90 c 171.312 90 174 92.688 174 96 c h
216 90 m 212.688 90 210 92.688 210 96 c 210 99.312 212.688 102 216 102 
c 219.312 102 222 99.312 222 96 c 222 92.688 219.312 90 216 90 c h
198 138 m 174 138 l 174 150 l 198 150 l 211.234 150 222 139.234 222 126
 c 210 126 l 210 132.617 204.617 138 198 138 c h
198 90 m 186 90 l 186 114 l 198 114 l h
6 354 m 6 246 l 6 239.383 11.383 234 18 234 c 67.273 234 l 54.637 212.172
 48 187.508 48 162 c 48 103.273 84.516 49.727 139.004 28.129 c 148.938 14.438
 164.785 6 182.309 6 c 203.945 6 l 226.164 6 245.809 17.059 257.789 33.926
 c 306.055 58.746 336 107.664 336 162 c 336 231.59 286.375 289.801 220.66
 303.125 c 221.539 305.977 222 308.957 222 312 c 222 318 l 282 318 l 282
 282 l 330 282 l 330 294 l 294 294 l 294 354 l 354 354 l 354 318 l 366 318
 l 366 366 l 282 366 l 282 330 l 222 330 l 222 360 l 222 369.926 213.926
 378 204 378 c 180 378 l 170.074 378 162 369.926 162 360 c 162 330 l 114
 330 l 114 354 l 114 360.617 108.617 366 102 366 c 18 366 l 11.383 366 6
 360.617 6 354 c h
138 102 m 131.383 102 126 107.383 126 114 c 126 120.617 131.383 126 138
 126 c h
84 162 m 84 186.652 92.395 209.336 106.355 227.531 c 115.277 203.051 137.062
 184.824 163.156 180.629 c 165.473 171.355 l 151.273 166.094 140.695 153.395
 138.48 137.992 c 138 137.992 l 124.766 137.992 114 127.23 114 113.992 c
 114 108.898 115.621 104.191 118.344 100.297 c 115.457 85.855 l 95.363 106.031
 84 133.195 84 162 c h
246 126 m 252.617 126 258 120.617 258 114 c 258 107.383 252.617 102 246
 102 c h
218.527 171.359 m 220.844 180.637 l 246.938 184.828 268.715 203.059 277.645
 227.539 c 291.605 209.336 300 186.652 300 162 c 300 133.188 288.637 106.031
 268.547 85.867 c 265.66 100.309 l 268.379 104.195 270 108.906 270 114 c
 270 127.234 259.234 138 246 138 c 245.52 138 l 243.301 153.402 232.723 
166.098 218.527 171.359 c h
177.215 173.863 m 174.773 183.625 l 191.711 196.508 l 209.203 183.57 l 
206.777 173.867 l 205.859 173.922 204.938 174 204 174 c 180 174 l 179.062
 174 178.141 173.922 177.215 173.863 c h
217.598 192.281 m 203.922 202.398 l 217.523 207.781 l 220.535 192.719 l
 219.57 192.535 218.578 192.422 217.598 192.281 c h
196.547 212.383 m 191.695 210.461 l 186.805 212.441 l 189.988 222 l 193.34
 222 l h
166.355 192.289 m 165.391 192.422 164.418 192.535 163.465 192.715 c 166.465
 207.719 l 179.641 202.387 l h
115.668 238.332 m 130.234 252.898 148.945 263.316 169.844 267.695 c 179.426
 228.266 l 175.648 216.953 l 157.531 224.281 l 151.906 196.172 l 134.012
 203.461 120.227 219.078 115.668 238.332 c h
181.758 269.484 m 185.137 269.801 188.543 270 192 270 c 195.422 270 198.793
 269.801 202.129 269.484 c 193.016 234 l 190.379 234 l h
268.332 238.332 m 263.773 219.078 249.988 203.461 232.086 196.164 c 226.477
 224.227 l 207.727 216.805 l 203.922 228.223 l 214.074 267.719 l 235.008
 263.352 253.738 252.926 268.332 238.332 c h
234 84 m 234 80.695 231.305 78 228 78 c 198 78 l 187.363 78 177.785 73.363
 171.191 66 c 168 66 l 158.074 66 150 74.074 150 84 c 150 132 l 150 148.543
 163.457 162 180 162 c 204 162 l 220.543 162 234 148.543 234 132 c h
162 318 m 162 312 l 162 308.934 162.473 305.93 163.367 303.059 c 145.836
 299.539 129.156 292.883 114 283.074 c 114 318 l h
210 330 m 174 330 l 174 360 l 174 363.305 176.695 366 180 366 c 204 366
 l 207.305 366 210 363.305 210 360 c h
208.555 305.023 m 203.117 305.645 197.598 306 192 306 c 186.426 306 180.926
 305.574 175.469 304.957 c 174.527 307.172 174 309.551 174 312 c 174 318
 l 210 318 l 210 312 l 210 309.57 209.477 307.219 208.555 305.023 c h
267.312 53.551 m 268.922 59.047 269.824 64.828 269.934 70.812 c 296.684
 93.68 312 126.73 312 162 c 312 228.168 258.168 282 192 282 c 162.223 282
 135 271.031 114 253.008 c 114 268.398 l 136.734 285.109 163.613 294 192
 294 c 264.785 294 324 234.785 324 162 c 324 118.086 302.684 78.02 267.312
 53.551 c h
143.574 44.23 m 142.879 45.961 l 140.18 47.762 l 131.297 53.676 126 63.582
 126 74.25 c 126 76.344 126.211 78.445 126.617 80.496 c 128.879 91.824 l
 131.699 90.66 134.773 90 138 90 c 138 84 l 138 68.766 149.418 56.141 164.141
 54.246 c 162.758 50.426 162 46.297 162 42 c 174 42 l 174 55.234 184.766
 66 198 66 c 228 66 l 237.926 66 246 74.074 246 84 c 246 90 l 249.227 90
 252.301 90.66 255.121 91.824 c 256.957 82.656 l 257.645 79.176 258 75.613
 258 72.055 c 258 42.254 233.746 18 203.945 18 c 182.309 18 l 165.148 18
 149.945 28.297 143.574 44.23 c h
81.445 234 m 96.234 234 l 81.09 213.918 72 189.031 72 162 c 72 126.66 87.379
 93.551 114.223 70.68 c 114.797 63.594 117.066 56.875 120.762 50.988 c 83.629
 74.977 60 116.797 60 162 c 60 187.766 67.453 212.566 81.445 234 c h
18 354 m 102.008 354 l 102 246 l 18 246 l h
42 258 m 30 258 l 30 270 l 42 270 l h
54 270 m 90 270 l 90 258 l 54 258 l h
30 294 m 90 294 l 90 282 l 30 282 l h
30 318 m 90 318 l 90 306 l 30 306 l h
310.242 313.758 m 301.758 322.242 l 324.496 344.98 l 376.688 279.742 l 
367.312 272.25 l 323.504 327.012 l h
30 342 m 90 342 l 90 330 l 30 330 l h
30 342 m W n
[6 0 0 6 0 0] concat
/CairoFunction
   << /FunctionType 2
      /Domain [ 0 1 ]
      /C0 [ 0.623529 0.184314 1 ]
      /C1 [ 0.0431373 0.694118 0.827451 ]
      /N 1
   >>
def
   << /ShadingType 2
      /ColorSpace /DeviceRGB
      /Coords [ 31.889999 63 31.889999 1 ]
      /Extend [ true true ]
      /Function CairoFunction
   >>
shfill
Q
Q Q
showpage
%%Trailer
end
%%EOF
