%!PS-Adobe-3.0 EPSF-3.0
%%Creator: cairo 1.16.0 (https://cairographics.org)
%%CreationDate: Mon May  4 07:13:16 2020
%%Pages: 1
%%DocumentData: Clean7Bit
%%LanguageLevel: 3
%%BoundingBox: 6 6 378 378
%%EndComments
%%BeginProlog
50 dict begin
/q { gsave } bind def
/Q { grestore } bind def
/cm { 6 array astore concat } bind def
/w { setlinewidth } bind def
/J { setlinecap } bind def
/j { setlinejoin } bind def
/M { setmiterlimit } bind def
/d { setdash } bind def
/m { moveto } bind def
/l { lineto } bind def
/c { curveto } bind def
/h { closepath } bind def
/re { exch dup neg 3 1 roll 5 3 roll moveto 0 rlineto
      0 exch rlineto 0 rlineto closepath } bind def
/S { stroke } bind def
/f { fill } bind def
/f* { eofill } bind def
/n { newpath } bind def
/W { clip } bind def
/W* { eoclip } bind def
/BT { } bind def
/ET { } bind def
/BDC { mark 3 1 roll /BDC pdfmark } bind def
/EMC { mark /EMC pdfmark } bind def
/cairo_store_point { /cairo_point_y exch def /cairo_point_x exch def } def
/Tj { show currentpoint cairo_store_point } bind def
/TJ {
  {
    dup
    type /stringtype eq
    { show } { -0.001 mul 0 cairo_font_matrix dtransform rmoveto } ifelse
  } forall
  currentpoint cairo_store_point
} bind def
/cairo_selectfont { cairo_font_matrix aload pop pop pop 0 0 6 array astore
    cairo_font exch selectfont cairo_point_x cairo_point_y moveto } bind def
/Tf { pop /cairo_font exch def /cairo_font_matrix where
      { pop cairo_selectfont } if } bind def
/Td { matrix translate cairo_font_matrix matrix concatmatrix dup
      /cairo_font_matrix exch def dup 4 get exch 5 get cairo_store_point
      /cairo_font where { pop cairo_selectfont } if } bind def
/Tm { 2 copy 8 2 roll 6 array astore /cairo_font_matrix exch def
      cairo_store_point /cairo_font where { pop cairo_selectfont } if } bind def
/g { setgray } bind def
/rg { setrgbcolor } bind def
/d1 { setcachedevice } bind def
/cairo_data_source {
  CairoDataIndex CairoData length lt
    { CairoData CairoDataIndex get /CairoDataIndex CairoDataIndex 1 add def }
    { () } ifelse
} def
/cairo_flush_ascii85_file { cairo_ascii85_file status { cairo_ascii85_file flushfile } if } def
/cairo_image { image cairo_flush_ascii85_file } def
/cairo_imagemask { imagemask cairo_flush_ascii85_file } def
%%EndProlog
%%BeginSetup
%%EndSetup
%%Page: 1 1
%%BeginPageSetup
%%PageBoundingBox: 6 6 378 378
%%EndPageSetup
q 6 6 372 372 rectclip
1 0 0 -1 0 384 cm q
q
264 138 m 246 138 l 246 126 l 264 126 l 269.117 126 273.715 123.156 276
 118.586 c 276.629 117.316 l 287.363 122.688 l 286.734 123.953 l 282.402
 132.617 273.691 138 264 138 c h
378 120 m 378 170.238 345.293 212.902 300.09 228.047 c 288.484 262.957 
261.582 289.219 228.02 300.254 c 212.43 346.871 169.48 378 120 378 c 57.137
 378 6 326.863 6 264 c 6 214.52 37.129 171.562 83.746 155.977 c 94.789 122.41
 121.043 95.508 155.957 83.902 c 171.098 38.699 213.77 6 264 6 c 326.863
 6 378 57.137 378 120 c h
222 102 m 215.383 102 210 107.383 210 114 c 210 120.617 215.383 126 222
 126 c h
234.938 73.824 m 234.324 71.316 234 68.695 234 66 c 246 66 l 246 76.586
 253.945 85.363 264.48 86.418 c 300.289 90 l 306 90 l 309.492 90 312.785
 90.785 315.785 92.137 c 316.906 87.652 l 317.629 84.742 318 81.742 318 
78.738 c 318 58.48 301.52 42 281.262 42 c 246.738 42 l 226.48 42 210 58.48
 210 78.738 c 210 81.742 210.371 84.738 211.098 87.641 c 212.219 92.129 
l 215.215 90.785 218.508 90 222 90 c 222.602 90 l 224.094 83.105 228.504
 77.164 234.938 73.824 c h
306 126 m 312.617 126 318 120.617 318 114 c 318 107.383 312.617 102 306
 102 c h
234 132 m 234 141.926 242.074 150 252 150 c 276 150 l 285.926 150 294 141.926
 294 132 c 294 101.43 l 263.285 98.359 l 253.535 97.379 245.184 92.23 239.922
 84.773 c 236.25 86.922 234 90.82 234 95.125 c h
258.426 190.344 m 261.875 198 l 266.117 198 l 269.566 190.344 l 264 186.996
 l h
258.422 221.719 m 260.281 221.82 262.117 222 264 222 c 265.883 222 267.719
 221.82 269.578 221.719 c 265.68 210 l 262.32 210 l h
323.328 202.805 m 319.285 195.148 313.566 188.562 306.691 183.461 c 296.82
 206.695 l 279.93 196.559 l 276.426 204.328 l 281.762 220.344 l 297.07 217.645
 311.184 211.535 323.328 202.805 c h
296.262 177.316 m 293.766 176.18 291.191 175.211 288.527 174.445 c 276.457
 180.48 l 291.176 189.305 l h
248.441 161.641 m 247.34 164.957 l 264 173.293 l 280.66 164.965 l 279.559
 161.645 l 278.375 161.785 277.219 162 276 162 c 252 162 l 250.781 162 249.625
 161.785 248.441 161.641 c h
231.738 177.316 m 236.824 189.305 l 251.543 180.48 l 239.473 174.445 l 
236.809 175.211 234.234 176.184 231.738 177.316 c h
204.672 202.805 m 216.82 211.535 230.93 217.645 246.234 220.344 c 251.566
 204.328 l 248.062 196.559 l 231.176 206.695 l 221.305 183.461 l 214.43 
188.562 208.711 195.148 204.672 202.805 c h
75.59 314.184 m 80.504 311.207 85.754 308.762 91.32 307.074 c 93.059 301.859
 l 84.102 296.656 78 287.074 78 276 c 78 239.125 l 78 233.934 79.777 228.906
 82.855 224.785 c 80.941 218.43 79.586 211.848 78.809 205.086 c 70.586 214.734
 66 226.957 66 240 c 66 290.371 l 66 299.34 69.457 307.805 75.59 314.184
 c h
159.738 249.316 m 164.832 261.305 l 179.543 252.48 l 167.473 246.445 l 
164.809 247.211 162.234 248.18 159.738 249.316 c h
197.574 262.34 m 192 258.996 l 186.426 262.34 l 189.875 270 l 194.117 270
 l h
132.672 274.805 m 144.82 283.535 158.93 289.645 174.234 292.344 c 179.566
 276.328 l 176.062 268.555 l 159.168 278.688 l 149.305 255.457 l 142.43 
260.562 136.711 267.148 132.672 274.805 c h
135.602 305.766 m 134.41 305.91 133.211 306 132 306 c 108 306 l 106.781
 306 105.625 305.785 104.441 305.641 c 102 312.973 l 102 314.051 l 102 319.48
 102.605 324.809 103.711 329.992 c 136.289 329.992 l 137.395 324.809 138
 319.48 138 314.059 c 138 312.977 l h
107.336 342 m 110.348 349.613 114.602 356.719 120 363.078 c 125.398 356.719
 129.652 349.613 132.664 342 c h
90 242.605 m 90 276 l 90 285.926 98.074 294 108 294 c 132 294 l 134.305
 294 136.523 293.488 138.613 292.656 c 117.629 281.484 100.621 263.922 90
 242.605 c h
60.672 346.805 m 73.895 356.309 89.449 362.695 106.324 364.973 c 96.941
 351.836 91.414 336.449 90.301 320.172 c 77.617 325.207 67.055 334.703 60.672
 346.805 c h
133.633 365.035 m 150.48 362.812 166.121 356.551 179.438 347.027 c 173.062
 334.816 162.457 325.242 149.699 320.172 c 148.59 336.473 143.047 351.875
 133.633 365.035 c h
171.133 303.996 m 164.441 302.754 157.984 300.887 151.758 298.523 c 150.27
 299.824 148.676 300.988 146.98 301.969 c 148.688 307.066 l 154.223 308.746
 159.457 311.18 164.348 314.137 c 167.184 311.172 169.508 307.758 171.133
 303.996 c h
186.422 293.719 m 188.281 293.82 190.117 294 192 294 c 193.883 294 195.738
 293.875 197.605 293.777 c 193.68 282 l 190.32 282 l h
251.441 275.027 m 247.391 267.277 241.637 260.617 234.695 255.461 c 224.832
 278.695 l 207.938 268.559 l 204.434 276.336 l 209.797 292.441 l 225.059
 289.781 239.227 283.758 251.441 275.027 c h
224.262 249.316 m 221.766 248.18 219.191 247.211 216.535 246.445 c 204.461
 252.48 l 219.176 261.305 l h
207.602 233.766 m 206.41 233.91 205.211 234 204 234 c 180 234 l 178.781
 234 177.625 233.785 176.441 233.641 c 175.34 236.957 l 192 245.293 l 208.66
 236.965 l h
162 170.605 m 162 204 l 162 213.926 170.074 222 180 222 c 204 222 l 206.305
 222 208.523 221.488 210.613 220.656 c 189.629 209.484 172.621 191.922 162
 170.605 c h
150 174 m 143.383 174 138 179.383 138 186 c 138 192.617 143.383 198 150
 198 c h
154.855 152.785 m 152.047 143.453 150.48 133.609 150.176 123.449 c 142.578
 130.332 138 140.238 138 150.738 c 138 153.742 138.371 156.738 139.098 159.641
 c 140.219 164.129 l 143.215 162.785 146.508 162 150 162 c 150.594 162 l
 151.324 158.656 152.809 155.531 154.855 152.785 c h
90 192 m 90 221.707 102.848 248.406 123.176 267.059 c 131.953 251.777 146.371
 240.203 163.312 235.066 c 165.055 229.855 l 157.766 225.617 152.34 218.516
 150.605 209.992 c 150 209.992 l 136.766 209.992 126 199.23 126 185.992 
c 126 181.105 127.488 176.555 130.008 172.758 c 127.457 162.551 l 126.492
 158.707 126 154.727 126 150.738 c 126 133.297 135.59 117.168 150.582 108.547
 c 150.938 105.02 151.488 101.555 152.16 98.129 c 114.59 113.953 90 150.395
 90 192 c h
51.176 339.059 m 55.051 332.316 60.035 326.309 65.844 321.246 c 58.285 
312.805 54 301.906 54 290.371 c 54 240 l 54 220.051 62.801 201.727 78.113
 189.125 c 78.27 182.656 78.965 176.309 80.152 170.125 c 42.59 185.957 18
 222.402 18 264 c 18 293.707 30.848 320.406 51.176 339.059 c h
213.871 303.848 m 206.766 305.207 199.469 306 192 306 c 189.059 306 186.176
 305.777 183.289 305.555 c 181.277 311.328 178.234 316.703 174.168 321.266
 c 180.035 326.383 185.07 332.449 188.957 339.277 c 199.531 329.586 208.074
 317.594 213.871 303.848 c h
285.871 231.848 m 278.785 233.227 271.48 234 264 234 c 249.82 234 236.293
 231.281 223.758 226.523 c 222.27 227.824 220.676 228.988 218.98 229.969
 c 220.688 235.066 l 237.715 240.223 252.203 251.879 260.969 267.277 c 271.531
 257.586 280.078 245.594 285.871 231.848 c h
366 120 m 366 63.758 320.242 18 264 18 c 207.758 18 162 63.758 162 120 
c 162 149.707 174.848 176.406 195.176 195.059 c 203.953 179.777 218.371 
168.199 235.312 163.066 c 237.047 157.855 l 229.758 153.617 224.336 146.516
 222.602 138 c 222 138 l 208.766 138 198 127.234 198 114 c 198 109.109 199.488
 104.562 202.008 100.766 c 199.457 90.559 l 198.492 86.707 198 82.727 198
 78.738 c 198 51.863 219.863 30 246.738 30 c 281.262 30 l 308.137 30 330
 51.863 330 78.738 c 330 82.727 329.508 86.707 328.543 90.562 c 325.992 
100.77 l 328.512 104.562 330 109.109 330 114 c 330 127.234 319.234 138 306
 138 c 305.395 138 l 303.66 146.516 298.234 153.625 290.941 157.859 c 292.68
 163.074 l 309.625 168.203 324.047 179.785 332.82 195.066 c 353.152 176.406
 366 149.707 366 120 c h
6 162 m 18 162 l 18 95.832 71.832 42 138 42 c 157.816 42 l 105.328 7.008
 l 98.676 16.992 l 120.02 31.223 l 55.703 40.02 6 95.316 6 162 c h
92.832 77.293 m 87.176 66.707 l 59.977 81.258 40.23 106.727 33.02 136.59
 c 44.676 139.41 l 51.09 112.871 68.641 90.227 92.832 77.293 c h
30 162 m 42 162 l 42 158.25 42.223 154.445 42.652 150.691 c 30.738 149.309
 l 30.246 153.516 30 157.789 30 162 c h
246 342 m 226.184 342 l 278.672 376.992 l 285.324 367.008 l 263.98 352.781
 l 328.297 343.98 378 288.684 378 222 c 366 222 l 366 288.168 312.168 342
 246 342 c h
291.168 306.707 m 296.824 317.293 l 324.031 302.734 343.77 277.266 350.98
 247.414 c 339.324 244.59 l 332.91 271.129 315.359 293.766 291.168 306.707
 c h
354 222 m 342 222 l 342 225.742 341.777 229.555 341.348 233.309 c 353.262
 234.691 l 353.754 230.477 354 226.207 354 222 c h
354 222 m W n
[6 0 0 6 0 0] concat
/CairoFunction
   << /FunctionType 2
      /Domain [ 0 1 ]
      /C0 [ 0.623529 0.184314 1 ]
      /C1 [ 0.0431373 0.694118 0.827451 ]
      /N 1
   >>
def
   << /ShadingType 2
      /ColorSpace /DeviceRGB
      /Coords [ 32 63 32 1 ]
      /Extend [ true true ]
      /Function CairoFunction
   >>
shfill
Q
Q Q
showpage
%%Trailer
end
%%EOF
