%!PS-Adobe-3.0 EPSF-3.0
%%Creator: cairo 1.16.0 (https://cairographics.org)
%%CreationDate: Mon May  4 07:13:12 2020
%%Pages: 1
%%DocumentData: Clean7Bit
%%LanguageLevel: 3
%%BoundingBox: 6 6 378 378
%%EndComments
%%BeginProlog
50 dict begin
/q { gsave } bind def
/Q { grestore } bind def
/cm { 6 array astore concat } bind def
/w { setlinewidth } bind def
/J { setlinecap } bind def
/j { setlinejoin } bind def
/M { setmiterlimit } bind def
/d { setdash } bind def
/m { moveto } bind def
/l { lineto } bind def
/c { curveto } bind def
/h { closepath } bind def
/re { exch dup neg 3 1 roll 5 3 roll moveto 0 rlineto
      0 exch rlineto 0 rlineto closepath } bind def
/S { stroke } bind def
/f { fill } bind def
/f* { eofill } bind def
/n { newpath } bind def
/W { clip } bind def
/W* { eoclip } bind def
/BT { } bind def
/ET { } bind def
/BDC { mark 3 1 roll /BDC pdfmark } bind def
/EMC { mark /EMC pdfmark } bind def
/cairo_store_point { /cairo_point_y exch def /cairo_point_x exch def } def
/Tj { show currentpoint cairo_store_point } bind def
/TJ {
  {
    dup
    type /stringtype eq
    { show } { -0.001 mul 0 cairo_font_matrix dtransform rmoveto } ifelse
  } forall
  currentpoint cairo_store_point
} bind def
/cairo_selectfont { cairo_font_matrix aload pop pop pop 0 0 6 array astore
    cairo_font exch selectfont cairo_point_x cairo_point_y moveto } bind def
/Tf { pop /cairo_font exch def /cairo_font_matrix where
      { pop cairo_selectfont } if } bind def
/Td { matrix translate cairo_font_matrix matrix concatmatrix dup
      /cairo_font_matrix exch def dup 4 get exch 5 get cairo_store_point
      /cairo_font where { pop cairo_selectfont } if } bind def
/Tm { 2 copy 8 2 roll 6 array astore /cairo_font_matrix exch def
      cairo_store_point /cairo_font where { pop cairo_selectfont } if } bind def
/g { setgray } bind def
/rg { setrgbcolor } bind def
/d1 { setcachedevice } bind def
/cairo_data_source {
  CairoDataIndex CairoData length lt
    { CairoData CairoDataIndex get /CairoDataIndex CairoDataIndex 1 add def }
    { () } ifelse
} def
/cairo_flush_ascii85_file { cairo_ascii85_file status { cairo_ascii85_file flushfile } if } def
/cairo_image { image cairo_flush_ascii85_file } def
/cairo_imagemask { imagemask cairo_flush_ascii85_file } def
%%EndProlog
%%BeginSetup
%%EndSetup
%%Page: 1 1
%%BeginPageSetup
%%PageBoundingBox: 6 6 378 378
%%EndPageSetup
q 6 6 372 372 rectclip
1 0 0 -1 0 384 cm q
q
258 180 m 258 183.312 255.312 186 252 186 c 248.688 186 246 183.312 246
 180 c 246 176.688 248.688 174 252 174 c 255.312 174 258 176.688 258 180
 c h
300 186 m 303.312 186 306 183.312 306 180 c 306 176.688 303.312 174 300
 174 c 296.688 174 294 176.688 294 180 c 294 183.312 296.688 186 300 186
 c h
306 210 m 294 210 l 294 216.617 288.617 222 282 222 c 258 222 l 258 234
 l 282 234 l 295.234 234 306 223.234 306 210 c h
378 348.996 m 378 378 l 6 378 l 6 366 l 66.918 366 l 77.473 302.684 l 66.266
 294.344 57.617 283.188 52.398 270.145 c 51.371 267.582 l 49.828 263.73 
47.309 260.336 44.082 257.746 c 22.5 240.484 l 20.41 238.812 18.988 236.531
 18.371 234 c 18 234 l 11.383 234 6 228.617 6 222 c 6 18 l 6 11.383 11.383
 6 18 6 c 162 6 l 168.617 6 174 11.383 174 18 c 174 187.105 l 180.965 189.59
 186 196.188 186 204 c 186 260.371 l 186 274.879 181.926 288.938 174.289
 301.223 c 177.859 322.656 l 187.309 290.73 213.539 265.879 247.391 258.852
 c 248.656 255.055 l 234.871 249.617 224.656 237.102 222.48 221.992 c 222
 221.992 l 208.766 221.992 198 211.23 198 197.992 c 198 193.078 199.492 
188.516 202.039 184.703 c 199.379 173.578 198 162.168 198 150.738 c 198 
134.598 208.195 120.438 223.184 115.188 c 228.438 100.195 242.598 90 258.738
 90 c 336 90 l 345.926 90 354 98.074 354 108 c 354 150.738 l 354 162.168
 352.621 173.586 349.961 184.703 c 352.508 188.516 354 193.086 354 198 c
 354 211.234 343.234 222 330 222 c 329.52 222 l 327.344 237.109 317.129 
249.617 303.344 255.059 c 304.609 258.859 l 347.336 267.719 378 304.996 
378 348.996 c h
247.535 271.078 m 250.211 284.477 l 263.539 276.48 l 251.184 270.301 l 
249.961 270.535 248.742 270.793 247.535 271.078 c h
259.68 366 m 292.312 366 l 277.312 306 l 274.688 306 l h
280.453 285.672 m 276 282.996 l 271.547 285.664 l 274.324 294 l 277.676
 294 l h
301.789 284.477 m 304.465 271.078 l 303.258 270.793 302.039 270.535 300.809
 270.301 c 288.457 276.48 l h
342 198 m 342 191.383 336.617 186 330 186 c 330 210 l 336.617 210 342 204.617
 342 198 c h
222 210 m 222 186 l 215.383 186 210 191.383 210 198 c 210 204.617 215.383
 210 222 210 c h
246 138.605 m 246 126 l 258 126 l 258 144 l 258 147.305 260.688 150 264
 150 c 312 150 l 321.926 150 330 158.074 330 168 c 330 174 l 333.406 174
 336.637 174.738 339.574 176.023 c 341.172 167.695 342 159.223 342 150.738
 c 342 108 l 342 104.695 339.312 102 336 102 c 258.738 102 l 246.93 102 
236.684 109.996 233.82 121.457 c 232.945 124.949 l 229.453 125.824 l 217.996
 128.688 210 138.93 210 150.738 c 210 159.215 210.828 167.688 212.426 176.023
 c 215.359 174.738 218.594 174 222 174 c 222 168 l 222 153.512 232.324 141.391
 246 138.605 c h
264 246 m 288 246 l 304.543 246 318 232.543 318 216 c 318 168 l 318 164.695
 315.312 162 312 162 c 264 162 l 256.414 162 249.91 157.285 247.266 150.629
 c 239.629 152.719 234 159.715 234 168 c 234 216 l 234 232.543 247.457 246
 264 246 c h
260.383 257.812 m 259.332 260.957 l 276 269.293 l 292.66 260.965 l 291.613
 257.82 l 290.426 257.922 289.219 258 288 258 c 264 258 l 262.781 258 261.574
 257.922 260.383 257.812 c h
186 348.996 m 186 366 l 210 366 l 210 330 l 222 330 l 222 366 l 247.32 
366 l 263.754 300.238 l 261.008 291.988 l 241.789 303.523 l 236.035 274.754
 l 206.258 286.766 186 315.66 186 348.996 c h
18 222 m 20.152 222 l 23.566 214.926 30.75 210 39.113 210 c 46.121 210 
52.902 212.051 58.723 215.934 c 65.852 220.688 l 67.133 221.543 68.633 222
 70.184 222 c 74.496 222 78 218.496 78 214.184 c 78 186 l 30 186 l 30 174
 l 78 174 l 78 162 l 30 162 l 30 150 l 78 150 l 78 144 l 78 141.887 78.434
 139.883 79.105 138 c 66 138 l 66 126 l 150 126 l 150 138 l 112.895 138 
l 113.566 139.883 114 141.887 114 144 c 114 150 l 150 150 l 150 162 l 114
 162 l 114 175.105 l 115.883 174.434 117.887 174 120 174 c 124.625 174 128.809
 175.805 132 178.68 c 135.191 175.801 139.375 174 144 174 c 152.297 174 
159.234 179.672 161.305 187.32 c 161.527 187.23 161.773 187.188 162 187.105
 c 162 18 l 18 18 l h
85.867 294 m 164.699 294 l 170.797 283.836 174 272.273 174 260.371 c 174
 204 l 174 200.695 171.312 198 168 198 c 164.688 198 162 200.695 162 204
 c 162 234 l 150 234 l 150 192 l 150 188.695 147.312 186 144 186 c 140.688
 186 138 188.695 138 192 c 138 234 l 126 234 l 126 192 l 126 188.695 123.312
 186 120 186 c 116.688 186 114 188.695 114 192 c 114 234 l 102 234 l 102
 144 l 102 140.695 99.312 138 96 138 c 92.688 138 90 140.695 90 144 c 90
 214.184 l 90 225.113 81.113 234 70.184 234 c 66.258 234 62.453 232.848 
59.191 230.672 c 52.062 225.918 l 48.215 223.355 43.738 222 39.121 222 c
 34.094 222 30 226.086 30 231.113 c 51.574 248.375 l 56.43 252.254 60.203
 257.352 62.508 263.125 c 63.535 265.68 l 68.125 277.141 75.82 286.895 85.867
 294 c h
79.078 366 m 172.922 366 l 162.918 306 l 89.082 306 l h
366 348.996 m 366 315.66 345.742 286.77 315.965 274.758 c 310.211 303.527
 l 290.992 291.996 l 288.246 300.246 l 304.68 366 l 330 366 l 330 330 l 
342 330 l 342 366 l 366 366 l h
126 114 m 54 114 l 54 102 l 54 88.441 61.535 76.621 72.641 70.48 c 68.551
 66.176 66 60.391 66 54 c 66 40.766 76.766 30 90 30 c 103.234 30 114 40.766
 114 54 c 114 60.391 111.449 66.176 107.359 70.48 c 118.465 76.621 126 88.441
 126 102 c h
90 66 m 96.617 66 102 60.617 102 54 c 102 47.383 96.617 42 90 42 c 83.383
 42 78 47.383 78 54 c 78 60.617 83.383 66 90 66 c h
114 102 m 114 88.766 103.234 78 90 78 c 76.766 78 66 88.766 66 102 c h
54 126 m 30 126 l 30 138 l 54 138 l h
54 126 m W n
[6 0 0 6 0 0] concat
/CairoFunction
   << /FunctionType 2
      /Domain [ 0 1 ]
      /C0 [ 0.623529 0.184314 1 ]
      /C1 [ 0.0431373 0.694118 0.827451 ]
      /N 1
   >>
def
   << /ShadingType 2
      /ColorSpace /DeviceRGB
      /Coords [ 32 63 32 1 ]
      /Extend [ true true ]
      /Function CairoFunction
   >>
shfill
Q
Q Q
showpage
%%Trailer
end
%%EOF
