%!PS-Adobe-3.0 EPSF-3.0
%%Creator: cairo 1.16.0 (https://cairographics.org)
%%CreationDate: Mon May  4 07:13:14 2020
%%Pages: 1
%%DocumentData: Clean7Bit
%%LanguageLevel: 3
%%BoundingBox: 6 6 378 378
%%EndComments
%%BeginProlog
50 dict begin
/q { gsave } bind def
/Q { grestore } bind def
/cm { 6 array astore concat } bind def
/w { setlinewidth } bind def
/J { setlinecap } bind def
/j { setlinejoin } bind def
/M { setmiterlimit } bind def
/d { setdash } bind def
/m { moveto } bind def
/l { lineto } bind def
/c { curveto } bind def
/h { closepath } bind def
/re { exch dup neg 3 1 roll 5 3 roll moveto 0 rlineto
      0 exch rlineto 0 rlineto closepath } bind def
/S { stroke } bind def
/f { fill } bind def
/f* { eofill } bind def
/n { newpath } bind def
/W { clip } bind def
/W* { eoclip } bind def
/BT { } bind def
/ET { } bind def
/BDC { mark 3 1 roll /BDC pdfmark } bind def
/EMC { mark /EMC pdfmark } bind def
/cairo_store_point { /cairo_point_y exch def /cairo_point_x exch def } def
/Tj { show currentpoint cairo_store_point } bind def
/TJ {
  {
    dup
    type /stringtype eq
    { show } { -0.001 mul 0 cairo_font_matrix dtransform rmoveto } ifelse
  } forall
  currentpoint cairo_store_point
} bind def
/cairo_selectfont { cairo_font_matrix aload pop pop pop 0 0 6 array astore
    cairo_font exch selectfont cairo_point_x cairo_point_y moveto } bind def
/Tf { pop /cairo_font exch def /cairo_font_matrix where
      { pop cairo_selectfont } if } bind def
/Td { matrix translate cairo_font_matrix matrix concatmatrix dup
      /cairo_font_matrix exch def dup 4 get exch 5 get cairo_store_point
      /cairo_font where { pop cairo_selectfont } if } bind def
/Tm { 2 copy 8 2 roll 6 array astore /cairo_font_matrix exch def
      cairo_store_point /cairo_font where { pop cairo_selectfont } if } bind def
/g { setgray } bind def
/rg { setrgbcolor } bind def
/d1 { setcachedevice } bind def
/cairo_data_source {
  CairoDataIndex CairoData length lt
    { CairoData CairoDataIndex get /CairoDataIndex CairoDataIndex 1 add def }
    { () } ifelse
} def
/cairo_flush_ascii85_file { cairo_ascii85_file status { cairo_ascii85_file flushfile } if } def
/cairo_image { image cairo_flush_ascii85_file } def
/cairo_imagemask { imagemask cairo_flush_ascii85_file } def
%%EndProlog
%%BeginSetup
%%EndSetup
%%Page: 1 1
%%BeginPageSetup
%%PageBoundingBox: 6 6 378 378
%%EndPageSetup
q 6 6 372 372 rectclip
1 0 0 -1 0 384 cm q
q
192 234 m 215.152 234 234 215.152 234 192 c 234 168.84 215.152 150 192 
150 c 168.848 150 150 168.84 150 192 c 150 215.152 168.848 234 192 234 c
 h
192 162 m 208.543 162 222 175.457 222 192 c 222 208.543 208.543 222 192
 222 c 175.457 222 162 208.543 162 192 c 162 175.457 175.457 162 192 162
 c h
198 114 m 186 114 l 186 102 l 198 102 l h
306 222 m 318 222 l 318 234 l 306 234 l h
72 258 m 76.109 258 80.117 257.574 84.023 256.848 c 96.629 277.801 114.793
 294.316 136.055 304.859 c 115.68 366 l 96 366 l 96 378 l 288 378 l 288 
366 l 268.32 366 l 247.938 304.859 l 269.203 294.316 287.363 277.793 299.969
 256.848 c 303.883 257.574 307.891 258 312 258 c 348.391 258 378 228.391
 378 192 c 378 155.609 348.391 126 312 126 c 307.883 126 303.871 126.426
 299.965 127.152 c 289.312 109.453 274.547 94.688 256.848 84.035 c 257.574
 80.129 258 76.117 258 72 c 258 35.609 228.391 6 192 6 c 155.609 6 126 35.609
 126 72 c 126 76.117 126.426 80.129 127.152 84.035 c 109.453 94.688 94.688
 109.453 84.035 127.152 c 80.129 126.426 76.117 126 72 126 c 35.609 126 
6 155.609 6 192 c 6 228.391 35.609 258 72 258 c h
37.902 233.824 m 43.152 219.664 56.629 210 72 210 c 87.367 210 100.848 
219.672 106.098 233.824 c 96.793 241.43 84.926 246 72 246 c 59.074 246 47.203
 241.43 37.902 233.824 c h
54 180 m 54 170.074 62.074 162 72 162 c 81.926 162 90 170.074 90 180 c 
90 189.926 81.926 198 72 198 c 62.074 198 54 189.926 54 180 c h
174 60 m 174 50.074 182.074 42 192 42 c 201.926 42 210 50.074 210 60 c 
210 69.926 201.926 78 192 78 c 182.074 78 174 69.926 174 60 c h
192 138 m 211.246 138 228.547 129.664 240.617 116.477 c 251.406 123.438
 260.555 132.59 267.523 143.383 c 254.336 155.453 246 172.754 246 192 c 
246 211.309 254.387 228.648 267.641 240.73 c 251.137 266.297 222.602 282
 192 282 c 161.398 282 132.863 266.297 116.359 240.73 c 129.613 228.648 
138 211.309 138 192 c 138 172.754 129.664 155.453 116.477 143.383 c 123.445
 132.594 132.594 123.438 143.383 116.477 c 155.453 129.664 172.754 138 192
 138 c h
157.902 113.824 m 163.152 99.664 176.629 90 192 90 c 207.367 90 220.848
 99.672 226.098 113.824 c 216.793 121.43 204.926 126 192 126 c 179.074 126
 167.203 121.43 157.902 113.824 c h
147.109 309.648 m 150.461 310.926 153.859 312.098 157.32 313.086 c 139.68
 366 l 128.32 366 l h
214.957 315.836 m 219.68 330 l 164.328 330 l 169.051 315.836 l 176.543 
317.227 184.211 318 192 318 c 199.789 318 207.457 317.227 214.957 315.836
 c h
160.324 342 m 223.68 342 l 231.68 366 l 152.32 366 l h
255.68 366 m 244.32 366 l 226.68 313.094 l 230.141 312.098 233.539 310.934
 236.891 309.652 c h
192 306 m 153 306 116.852 286.027 95.965 253.43 c 99.742 251.945 103.344
 250.121 106.754 248.004 c 125.531 276.523 157.625 294 192 294 c 226.375
 294 258.469 276.523 277.246 248.004 c 280.656 250.129 284.258 251.945 288.035
 253.43 c 267.148 286.027 231 306 192 306 c h
277.902 233.824 m 283.152 219.664 296.629 210 312 210 c 327.367 210 340.848
 219.672 346.098 233.824 c 336.793 241.43 324.926 246 312 246 c 299.074 
246 287.203 241.43 277.902 233.824 c h
294 180 m 294 170.074 302.074 162 312 162 c 321.926 162 330 170.074 330
 180 c 330 189.926 321.926 198 312 198 c 302.074 198 294 189.926 294 180
 c h
366 192 m 366 204.148 361.922 215.34 355.121 224.371 c 350.07 214.52 341.84
 206.762 331.895 202.285 c 338.047 196.789 342 188.879 342 180 c 342 163.457
 328.543 150 312 150 c 295.457 150 282 163.457 282 180 c 282 188.879 285.953
 196.781 292.105 202.285 c 282.16 206.762 273.93 214.523 268.879 224.371
 c 262.078 215.34 258 204.148 258 192 c 258 162.227 282.223 138 312 138 
c 341.777 138 366 162.227 366 192 c h
288.031 130.57 m 284.25 132.055 280.656 133.871 277.246 135.996 c 269.594
 124.363 259.633 114.402 248.004 106.754 c 250.121 103.352 251.945 99.75
 253.43 95.977 c 267.328 104.879 279.121 116.664 288.031 130.57 c h
192 18 m 221.777 18 246 42.227 246 72 c 246 84.148 241.922 95.34 235.117
 104.371 c 230.062 94.52 221.832 86.762 211.891 82.285 c 218.047 76.789 
222 68.879 222 60 c 222 43.457 208.543 30 192 30 c 175.457 30 162 43.457
 162 60 c 162 68.879 165.953 76.781 172.105 82.285 c 162.16 86.762 153.93
 94.523 148.879 104.371 c 142.078 95.336 138 84.148 138 72 c 138 42.227 
162.223 18 192 18 c h
130.57 95.977 m 132.055 99.758 133.871 103.352 135.996 106.754 c 124.367
 114.402 114.406 124.363 106.754 135.996 c 103.352 133.879 99.75 132.055
 95.969 130.57 c 104.879 116.664 116.672 104.879 130.57 95.977 c h
72 138 m 101.777 138 126 162.227 126 192 c 126 204.148 121.922 215.34 115.121
 224.371 c 110.07 214.52 101.84 206.762 91.895 202.285 c 98.047 196.789 
102 188.879 102 180 c 102 163.457 88.543 150 72 150 c 55.457 150 42 163.457
 42 180 c 42 188.879 45.953 196.781 52.105 202.285 c 42.16 206.762 33.93
 214.523 28.879 224.371 c 22.078 215.34 18 204.148 18 192 c 18 162.227 42.223
 138 72 138 c h
66 222 m 78 222 l 78 234 l 66 234 l h
42 78 m 69.516 78 l 7.758 16.242 l 16.242 7.758 l 78 69.516 l 78 42 l 90
 42 l 90 90 l 42 90 l h
78 342 m 78 314.484 l 16.242 376.242 l 7.758 367.758 l 69.516 306 l 42 
306 l 42 294 l 90 294 l 90 342 l h
342 306 m 314.484 306 l 376.242 367.758 l 367.758 376.242 l 306 314.484
 l 306 342 l 294 342 l 294 294 l 342 294 l h
376.242 16.242 m 314.484 78 l 342 78 l 342 90 l 294 90 l 294 42 l 306 42
 l 306 69.516 l 367.758 7.758 l h
376.242 16.242 m W n
[6 0 0 6 0 0] concat
/CairoFunction
   << /FunctionType 2
      /Domain [ 0 1 ]
      /C0 [ 0.623529 0.184314 1 ]
      /C1 [ 0.0431373 0.694118 0.827451 ]
      /N 1
   >>
def
   << /ShadingType 2
      /ColorSpace /DeviceRGB
      /Coords [ 32 63 32 1 ]
      /Extend [ true true ]
      /Function CairoFunction
   >>
shfill
Q
Q Q
showpage
%%Trailer
end
%%EOF
