%!PS-Adobe-3.0 EPSF-3.0
%%Creator: cairo 1.16.0 (https://cairographics.org)
%%CreationDate: Mon May  4 07:13:17 2020
%%Pages: 1
%%DocumentData: Clean7Bit
%%LanguageLevel: 3
%%BoundingBox: 6 6 378 378
%%EndComments
%%BeginProlog
50 dict begin
/q { gsave } bind def
/Q { grestore } bind def
/cm { 6 array astore concat } bind def
/w { setlinewidth } bind def
/J { setlinecap } bind def
/j { setlinejoin } bind def
/M { setmiterlimit } bind def
/d { setdash } bind def
/m { moveto } bind def
/l { lineto } bind def
/c { curveto } bind def
/h { closepath } bind def
/re { exch dup neg 3 1 roll 5 3 roll moveto 0 rlineto
      0 exch rlineto 0 rlineto closepath } bind def
/S { stroke } bind def
/f { fill } bind def
/f* { eofill } bind def
/n { newpath } bind def
/W { clip } bind def
/W* { eoclip } bind def
/BT { } bind def
/ET { } bind def
/BDC { mark 3 1 roll /BDC pdfmark } bind def
/EMC { mark /EMC pdfmark } bind def
/cairo_store_point { /cairo_point_y exch def /cairo_point_x exch def } def
/Tj { show currentpoint cairo_store_point } bind def
/TJ {
  {
    dup
    type /stringtype eq
    { show } { -0.001 mul 0 cairo_font_matrix dtransform rmoveto } ifelse
  } forall
  currentpoint cairo_store_point
} bind def
/cairo_selectfont { cairo_font_matrix aload pop pop pop 0 0 6 array astore
    cairo_font exch selectfont cairo_point_x cairo_point_y moveto } bind def
/Tf { pop /cairo_font exch def /cairo_font_matrix where
      { pop cairo_selectfont } if } bind def
/Td { matrix translate cairo_font_matrix matrix concatmatrix dup
      /cairo_font_matrix exch def dup 4 get exch 5 get cairo_store_point
      /cairo_font where { pop cairo_selectfont } if } bind def
/Tm { 2 copy 8 2 roll 6 array astore /cairo_font_matrix exch def
      cairo_store_point /cairo_font where { pop cairo_selectfont } if } bind def
/g { setgray } bind def
/rg { setrgbcolor } bind def
/d1 { setcachedevice } bind def
/cairo_data_source {
  CairoDataIndex CairoData length lt
    { CairoData CairoDataIndex get /CairoDataIndex CairoDataIndex 1 add def }
    { () } ifelse
} def
/cairo_flush_ascii85_file { cairo_ascii85_file status { cairo_ascii85_file flushfile } if } def
/cairo_image { image cairo_flush_ascii85_file } def
/cairo_imagemask { imagemask cairo_flush_ascii85_file } def
%%EndProlog
%%BeginSetup
%%EndSetup
%%Page: 1 1
%%BeginPageSetup
%%PageBoundingBox: 6 6 378 378
%%EndPageSetup
q 6 6 372 372 rectclip
1 0 0 -1 0 384 cm q
q
192 114 m 174 114 l 174 102 l 192 102 l 197.117 102 201.715 99.156 204 
94.586 c 204.629 93.316 l 215.363 98.688 l 214.734 99.953 l 210.402 108.617
 201.691 114 192 114 c h
378 246 m 378 366 l 378 372.617 372.617 378 366 378 c 18 378 l 11.383 378
 6 372.617 6 366 c 6 246 l 6 239.383 11.383 234 18 234 c 102 234 l 102 210
 l 102 203.383 107.383 198 114 198 c 114.02 198 l 114.199 168.852 135.133
 144.012 163.465 138.641 c 165.059 133.859 l 157.77 129.629 152.348 122.52
 150.613 114 c 150 114 l 136.766 114 126 103.234 126 90 c 126 85.109 127.488
 80.566 130.008 76.77 c 127.457 66.562 l 126.492 62.707 126 58.727 126 54.738
 c 126 27.863 147.863 6 174.738 6 c 209.262 6 l 236.137 6 258 27.863 258
 54.738 c 258 58.727 257.508 62.707 256.543 66.562 c 253.992 76.77 l 256.512
 80.566 258 85.109 258 90 c 258 103.234 247.234 114 234 114 c 233.395 114
 l 231.66 122.516 226.234 129.625 218.945 133.859 c 220.543 138.641 l 248.875
 144.012 269.809 168.859 269.988 198 c 270 198 l 276.617 198 282 203.383
 282 210 c 282 234 l 366 234 l 372.617 234 378 239.383 378 246 c h
366 246 m 342.605 246 l 345 257.734 354.266 267 366 269.395 c h
114 264 m 114 307.008 148.992 342 192 342 c 235.008 342 270 307.008 270
 264 c 270 234 l 246 234 l 246 264 l 246 293.777 221.773 318 192 318 c 162.227
 318 138 293.777 138 264 c 138 234 l 114 234 l h
150 210 m 150 264 l 150 287.152 168.84 306 192 306 c 215.16 306 234 287.152
 234 264 c 234 210 l h
186.426 166.344 m 189.875 174 l 194.125 174 l 197.574 166.344 l 192 162.996
 l h
187.688 198 m 196.312 198 l 193.312 186 l 190.688 186 l h
246 210 m 246 222 l 270 222 l 270 210 l h
235.586 157.363 m 224.824 182.695 l 207.938 172.559 l 204.328 180.562 l
 208.688 198 l 257.98 198 l 257.852 181.109 249.043 166.043 235.586 157.363
 c h
216.93 150.238 m 204.457 156.473 l 219.168 165.301 l 224.754 152.141 l 
222.246 151.301 219.625 150.672 216.93 150.238 c h
246 90 m 246 83.383 240.617 78 234 78 c 234 102 l 240.617 102 246 96.617
 246 90 c h
150 102 m 150 78 l 143.383 78 138 83.383 138 90 c 138 96.617 143.383 102
 150 102 c h
162.941 49.824 m 162.324 47.316 162 44.695 162 42 c 174 42 l 174 52.586
 181.945 61.363 192.48 62.418 c 228.289 66 l 234 66 l 237.492 66 240.785
 66.785 243.781 68.129 c 244.902 63.648 l 245.629 60.742 246 57.742 246 
54.738 c 246 34.48 229.52 18 209.262 18 c 174.738 18 l 154.48 18 138 34.48
 138 54.738 c 138 57.742 138.371 60.738 139.098 63.641 c 140.219 68.129 
l 143.215 66.785 146.508 66 150 66 c 150.602 66 l 152.094 59.105 156.504
 53.164 162.941 49.824 c h
162 108 m 162 117.926 170.074 126 180 126 c 204 126 l 213.926 126 222 117.926
 222 108 c 222 77.43 l 191.281 74.359 l 181.531 73.379 173.184 68.23 167.922
 60.773 c 164.25 62.922 162 66.82 162 71.125 c h
176.441 137.641 m 175.34 140.957 l 192 149.293 l 208.66 140.965 l 207.559
 137.645 l 206.375 137.785 205.219 138 204 138 c 180 138 l 178.781 138 177.625
 137.785 176.441 137.641 c h
159.238 152.152 m 164.824 165.312 l 179.539 156.484 l 167.062 150.254 l
 164.375 150.672 161.754 151.301 159.238 152.152 c h
126.02 198 m 175.312 198 l 179.672 180.562 l 176.062 172.559 l 159.176 
182.695 l 148.414 157.363 l 134.957 166.043 126.148 181.109 126.02 198 c
 h
114 210 m 114 222 l 138 222 l 138 210 l h
102 264 m 102 246 l 91.738 246 l 90.684 251.922 90 257.941 90 264 c 90 
320.242 135.758 366 192 366 c 248.242 366 294 320.242 294 264 c 294 257.941
 293.316 251.922 292.262 246 c 282 246 l 282 264 l 282 313.625 241.625 354
 192 354 c 142.375 354 102 313.625 102 264 c h
18 246 m 18 269.395 l 29.734 267 39 257.734 41.395 246 c h
18 366 m 41.395 366 l 39 354.266 29.734 345 18 342.605 c h
141.395 366 m 103.891 347.316 78 308.672 78 264 c 78 257.957 78.496 251.934
 79.441 246 c 53.52 246 l 50.875 264.355 36.355 278.875 18 281.52 c 18 330.48
 l 36.355 333.125 50.875 347.645 53.52 366 c h
242.605 366 m 330.48 366 l 333.125 347.645 347.645 333.125 366 330.48 c
 366 281.52 l 347.645 278.875 333.125 264.355 330.48 246 c 304.559 246 l
 305.504 251.934 306 257.957 306 264 c 306 308.672 280.109 347.316 242.605
 366 c h
366 366 m 366 342.605 l 354.266 345 345 354.266 342.605 366 c h
30 114 m 30 132 l 30 146.484 40.324 158.605 54 161.395 c 54 174 l 66 174
 l 66 162 l 90 162 l 90 132 l 90 115.457 76.543 102 60 102 c 50.074 102 
42 93.926 42 84 c 42 66 l 60 66 l 69.926 66 78 74.074 78 84 c 78 102 l 90
 102 l 90 84 l 90 69.516 79.676 57.395 66 54.605 c 66 42 l 54 42 l 54 54
 l 30 54 l 30 84 l 30 100.543 43.457 114 60 114 c 69.926 114 78 122.074 
78 132 c 78 150 l 60 150 l 50.074 150 42 141.926 42 132 c 42 114 l h
294 114 m 294 132 l 294 146.484 304.324 158.605 318 161.395 c 318 174 l
 330 174 l 330 162 l 354 162 l 354 132 l 354 115.457 340.543 102 324 102
 c 314.074 102 306 93.926 306 84 c 306 66 l 324 66 l 333.926 66 342 74.074
 342 84 c 342 102 l 354 102 l 354 84 l 354 69.516 343.676 57.395 330 54.605
 c 330 42 l 318 42 l 318 54 l 294 54 l 294 84 l 294 100.543 307.457 114 
324 114 c 333.926 114 342 122.074 342 132 c 342 150 l 324 150 l 314.074 
150 306 141.926 306 132 c 306 114 l h
294 114 m W n
[6 0 0 6 0 0] concat
/CairoFunction
   << /FunctionType 2
      /Domain [ 0 1 ]
      /C0 [ 0.623529 0.184314 1 ]
      /C1 [ 0.0431373 0.694118 0.827451 ]
      /N 1
   >>
def
   << /ShadingType 2
      /ColorSpace /DeviceRGB
      /Coords [ 32 63 32 1 ]
      /Extend [ true true ]
      /Function CairoFunction
   >>
shfill
Q
Q Q
showpage
%%Trailer
end
%%EOF
