[
  {
    "model": "core.commune",
    "fields": {
      "code_postal": "33000",
      "nom": "Bordeaux",
      "annee_de_creation": -600,
      "departement_id": 34,
      "type_commune": "VILLE"
    }
  },
  {
    "model": "core.commune",
    "fields": {
      "code_postal": "33300",
      "nom": "Bordeaux",
      "annee_de_creation": -600,
      "departement_id": 34,
      "type_commune": "VILLE"
    }
  },
  {
    "model": "core.commune",
    "fields": {
      "code_postal": "33100",
      "nom": "Bordeaux",
      "annee_de_creation": -600,
      "departement_id": 34,
      "type_commune": "VILLE"
    }
  },
  {
    "model": "core.commune",
    "fields": {
      "code_postal": "33090",
      "nom": "Bordeaux",
      "annee_de_creation": -600,
      "departement_id": 34,
      "type_commune": "VILLE"
    }
  },
  {
    "model": "core.commune",
    "fields": {
      "code_postal": "92150",
      "nom": "Suresnes",
      "annee_de_creation": 1641,
      "departement_id": 93,
      "type_commune": "VILLE"
    }
  },
  {
    "model": "core.commune",
    "fields": {
      "code_postal": "92170",
      "nom": "Vanves",
      "annee_de_creation": 1893,
      "departement_id": 93,
      "type_commune": "VILLE"
    }
  },
  {
    "model": "core.commune",
    "fields": {
      "code_postal": "54121",
      "nom": "Vandi\u00e8res",
      "annee_de_creation": 1918,
      "departement_id": 55,
      "type_commune": "VILLAGE"
    }
  },
  {
    "model": "core.commune",
    "fields": {
      "code_postal": "56000",
      "nom": "Vannes",
      "annee_de_creation": 1341,
      "departement_id": 57,
      "type_commune": "VILLE"
    }
  },{
    "model": "core.commune",
    "fields": {
      "code_postal": "67204",
      "nom": "Achenheim",
      "departement_id": 68,
      "annee_de_creation": 1741,
      "type_commune": "VILLE"
    }
  },
  {
    "model": "core.commune",
    "fields": {
      "code_postal": "67320",
      "nom": "Adamswiller - Asswiller - Baerendorf - Berg - Bettwiller - Bust - Drulingen - Durstel - Eschbourg - Eschwiller - Eywiller - G\u0153rlingen - Gungwiller - Hirschland - Kirrberg - Ottwiller - Pfalzweyer - Rauwiller - Rexingen - Sch\u0153nbourg - Siewiller - Thal-Drulingen - Weyer",
      "departement_id": 68,
      "annee_de_creation": 1940,
      "type_commune": "VILLAGE"
    }
  },
  {
    "model": "core.commune",
    "fields": {
      "code_postal": "67220",
      "nom": "Alb\u00e9 - Bassemberg - Breitenau - Breitenbach - Dieffenbach-au-Val - Fouchy - Lalaye - Maisonsgoutte - Neubois - Neuve-\u00c9glise - Saint-Martin - Saint-Maurice - Saint-Pierre-Bois - Steige - Thanvill\u00e9 - Triembach-au-Val - Urbeis - Vill\u00e9",
      "departement_id": 68,
      "annee_de_creation": 1859,
      "type_commune": "VILLAGE"
    }
  },
  {
    "model": "core.commune",
    "fields": {
      "code_postal": "67310",
      "nom": "Sommerau - Balbronn - Bergbieten - Cosswiller - Crastatt - Dahlenheim - Dangolsheim - Flexbourg - Hoheng\u0153ft - Kn\u0153rsheim - Rangen - Romanswiller - Scharrachbergheim-Irmstett - Traenheim - Wasselonne - Westhoffen - Zehnacker - Zeinheim",
      "departement_id": 68,
      "annee_de_creation": 1867,
      "type_commune": "VILLAGE"
    }
  },
  {
    "model": "core.commune",
    "fields": {
      "code_postal": "67440",
      "nom": "Sommerau - Dimbsthal - Hengwiller - Jetterswiller - Kleing\u0153ft - Lochwiller - Marmoutier - Reinhardsmunster - Reutenbourg - Schwenheim - Thal-Marmoutier - Westhouse-Marmoutier",
      "departement_id": 68,
      "annee_de_creation": 1909,
      "type_commune": "VILLAGE"
    }
  },
  {
    "model": "core.commune",
    "fields": {
      "code_postal": "67270",
      "nom": "Alteckendorf - Bossendorf - Duntzenheim - Durningen - Geiswiller-Z\u0153bersdorf - Gougenheim - Hochfelden - Hohfrankenheim - Huttendorf - Ingenheim - Kienheim - Lixhausen - Melsheim - Minversheim - Mutzenhouse - Rohr - Saessolsheim - Scherlenheim - Schwindratzheim - Wickersheim-Wilshausen - Wilwisheim - Wingersheim les Quatre Bans",
      "departement_id": 68,
      "annee_de_creation": 1050,
      "type_commune": "VILLAGE"
    }
  },
  {
    "model": "core.commune",
    "fields": {
      "code_postal": "67490",
      "nom": "Altenheim - Dettwiller - Friedolsheim - Gottesheim - Littenheim - Lupstein - Printzheim",
      "departement_id": 68,
      "annee_de_creation": 1693,
      "type_commune": "VILLAGE"
    }
  },
  {
    "model": "core.commune",
    "fields": {
      "code_postal": "67120",
      "nom": "Altorf - Avolsheim - Dachstein - Dorlisheim - Duppigheim - Duttlenheim - Ergersheim - Ernolsheim-Bruche - Kolbsheim - Molsheim - Soultz-les-Bains - Wolxheim",
      "departement_id": 68,
      "annee_de_creation": 1919,
      "type_commune": "VILLAGE"
    }
  },
  {
    "model": "core.commune",
    "fields": {
      "code_postal": "67260",
      "nom": "Altwiller - Bissert - Burbach - Diedendorf - Harskirchen - Herbitzheim - Hinsingen - Keskastel - Rimsdorf - Sarre-Union - Sarrewerden - Schopperten - Siltzheim - Wolfskirchen",
      "departement_id": 68,
      "annee_de_creation": 1923,
      "type_commune": "VILLAGE"
    }
  },
  {
    "model": "core.commune",
    "fields": {
      "code_postal": "67140",
      "nom": "Andlau - Barr - Bernardvill\u00e9 - Bourgheim - Eichhoffen - Gertwiller - Heiligenstein - Le Hohwald - Itterswiller - Mittelbergheim - Reichsfeld - Saint-Pierre - Stotzheim - Zellwiller",
      "departement_id": 68,
      "annee_de_creation": 1922,
      "type_commune": "VILLAGE"
    }
  },
  {
    "model": "core.commune",
    "fields": {
      "code_postal": "67390",
      "nom": "Artolsheim - B\u0153senbiesen - Bootzheim - Elsenheim - Heidolsheim - Hessenheim - Mackenheim - Marckolsheim - Ohnenheim - Richtolsheim - Saasenheim - Sch\u0153nau - Schwobsheim",
      "departement_id": 68,
      "annee_de_creation": 1500,
      "type_commune": "VILLAGE"
    }
  },
  {
    "model": "core.commune",
    "fields": {
      "code_postal": "67250",
      "nom": "Aschbach - Haguenau - Hoffen - Hunspach - Ingolsheim - Keffenach - Kutzenhausen - Lampertsloch - Lobsann - Memmelshoffen - Merkwiller-Pechelbronn - Oberr\u0153dern - Preuschdorf - Retschwiller - Sch\u0153nenbourg - Soultz-sous-For\u00eats - Stundwiller - Surbourg",
      "departement_id": 68,
      "annee_de_creation": 1823,
      "type_commune": "VILLE"
    }
  },
  {
    "model": "core.commune",
    "fields": {
      "code_postal": "67600",
      "nom": "Baldenheim - Bindernheim - Ebersheim - Ebersmunster - Hilsenheim - Kintzheim - Mussig - Muttersholtz - Orschwiller - S\u00e9lestat",
      "departement_id": 68,
      "annee_de_creation": 1888,
      "type_commune": "VILLAGE"
    }
  },
  {
    "model": "core.commune",
    "fields": {
      "code_postal": "67130",
      "nom": "Barembach - Bellefosse - Belmont - Blancherupt - La Broque - Fouday - Grandfontaine - Lutzelhouse - Muhlbach-sur-Bruche - Natzwiller - Neuviller-la-Roche - Plaine - Russ - Schirmeck - Solbach - Waldersbach - Wildersbach - Wisches",
      "departement_id": 68,
      "annee_de_creation": 1900,
      "type_commune": "VILLE"
    }
  },
  {
    "model": "core.commune",
    "fields": {
      "code_postal": "67500",
      "nom": "Batzendorf - Gries - Haguenau - Niederschaeffolsheim - Weitbruch",
      "departement_id": 68,
      "annee_de_creation": 1830,
      "type_commune": "VILLE"
    }
  },
  {
    "model": "core.commune",
    "fields": {
      "code_postal": "67930",
      "nom": "Beinheim - Kesseldorf",
      "departement_id": 68,
      "annee_de_creation": 1965,
      "type_commune": "VILLE"
    }
  }
]