﻿"Date","Price","Open","High","Low","Vol.","Change %"
"Nov 19","129.79","130.30","130.48","129.71","-","-0.39%"
"Oct 19","130.30","130.38","132.03","129.05","32.14M","-0.01%"
"Sep 19","130.31","131.25","131.72","128.06","10.54M","-0.56%"
"Aug 19","131.05","127.50","131.61","127.14","45.52M","2.85%"
"Jul 19","127.42","127.61","128.44","126.72","29.85M","-0.43%"
"Jun 19","127.97","126.31","128.27","126.20","11.02M","1.26%"
"May 19","126.38","123.69","126.50","122.94","41.71M","2.19%"
"Apr 19","123.67","124.16","124.17","122.64","27.18M","-0.44%"
"Mar 19","124.22","121.72","124.97","121.31","14.53M","2.03%"
"Feb 19","121.75","122.45","122.53","121.59","29.30M","-0.59%"
"Jan 19","122.47","121.81","123.25","121.06","31.56M","0.37%"
"Dec 18","122.02","119.38","122.12","119.27","9.03M","2.07%"
"Nov 18","119.55","118.52","119.77","117.70","38.68M","0.94%"
"Oct 18","118.44","118.72","119.19","117.42","47.98M","-0.29%"
"Sep 18","118.78","120.33","120.42","118.34","10.22M","-1.34%"
"Aug 18","120.39","119.41","120.75","119.08","34.27M","0.81%"
"Jul 18","119.42","120.12","120.62","119.25","25.48M","-0.64%"
"Jun 18","120.19","120.55","120.55","119.25","10.17M","-0.45%"
"May 18","120.73","119.55","121.39","118.33","39.40M","0.93%"
"Apr 18","119.62","121.03","121.38","118.97","27.39M","-1.25%"
"Mar 18","121.14","120.69","121.30","119.69","12.90M","0.40%"
"Feb 18","120.66","121.67","122.59","120.03","41.55M","-0.76%"
"Jan 18","121.58","123.98","124.00","121.33","32.83M","-1.99%"
"Dec 17","124.05","124.34","125.09","123.39","5.69M","-0.21%"
"Nov 17","124.31","124.88","125.47","124.19","30.64M","-0.50%"
"Oct 17","124.94","125.23","125.80","124.19","28.78M","-0.30%"
"Sep 17","125.31","127.27","128.11","125.06","10.76M","-1.52%"
"Aug 17","127.25","125.84","127.59","125.67","29.97M","1.08%"
"Jul 17","125.89","125.52","126.38","124.80","24.43M","0.29%"
"Jun 17","125.53","126.47","127.55","125.45","10.01M","-0.81%"
"May 17","126.56","125.72","126.72","124.72","31.41M","0.67%"
"Apr 17","125.72","124.59","126.62","124.50","25.53M","0.93%"
"Mar 17","124.56","124.80","125.28","123.31","9.20M","-0.44%"
"Feb 17","125.11","124.45","125.67","123.77","29.50M","0.51%"
"Jan 17","124.47","124.12","125.42","123.56","28.49M","0.15%"
"Dec 16","124.28","125.09","125.77","123.02","4.14M","-0.76%"
"Nov 16","125.23","129.67","131.00","124.80","37.16M","-3.39%"
"Oct 16","129.62","131.22","131.23","129.20","22.85M","-1.14%"
"Sep 16","131.12","131.73","132.48","130.66","8.22M","-0.58%"
"Aug 16","131.88","133.12","133.12","131.30","27.25M","-0.88%"
"Jul 16","133.05","133.03","134.23","131.61","23.17M","0.05%"
"Jun 16","132.98","129.66","134.22","129.59","11.22M","2.45%"
"May 16","129.80","129.92","131.20","129.30","25.77M","-0.20%"
"Apr 16","130.06","130.48","131.30","129.06","22.25M","-0.25%"
"Mar 16","130.39","130.95","131.22","128.52","6.92M","-0.40%"
"Feb 16","130.91","129.59","133.05","129.16","33.61M","1.03%"
"Jan 16","129.58","125.88","129.69","125.77","27.24M","2.91%"
"Dec 15","125.91","127.08","127.88","125.44","3.76M","-0.87%"
"Nov 15","127.02","127.77","127.83","125.70","22.63M","-0.52%"
"Oct 15","127.69","128.88","130.02","127.45","23.46M","-0.81%"
"Sep 15","128.73","127.52","128.92","127.12","8.55M","0.85%"
"Aug 15","127.64","127.58","129.89","126.55","27.37M","0.16%"
"Jul 15","127.44","125.97","127.62","125.16","23.54M","1.01%"
"Jun 15","126.17","128.14","128.30","124.91","9.85M","-1.67%"
"May 15","128.31","128.45","128.45","126.20","30.62M","-0.05%"
"Apr 15","128.38","128.91","130.12","127.81","22.27M","-0.41%"
"Mar 15","128.91","128.41","129.56","126.62","7.52M","0.38%"
"Feb 15","128.42","131.05","131.11","127.06","26.82M","-1.88%"
"Jan 15","130.88","126.61","131.17","126.41","27.44M","3.22%"
"Dec 14","126.80","127.84","128.78","125.66","3.32M","-0.67%"
"Nov 14","127.66","126.42","127.78","125.84","22.38M","1.03%"
"Oct 14","126.36","124.80","130.53","124.69","39.08M","1.38%"
"Sep 14","124.64","126.28","126.31","123.94","9.35M","-1.34%"
"Aug 14","126.33","124.64","127.03","124.41","27.60M","1.38%"
"Jul 14","124.61","125.08","125.73","123.81","23.31M","-0.45%"
"Jun 14","125.17","126.14","126.20","124.08","7.02M","-0.92%"
"May 14","126.33","124.42","126.77","123.78","27.71M","1.54%"
"Apr 14","124.42","123.53","125.08","122.70","24.98M","0.74%"
"Mar 14","123.50","126.73","126.75","123.08","8.63M","-2.07%"
"Feb 14","126.11","125.78","126.50","125.09","23.51M","0.29%"
"Jan 14","125.75","122.80","125.91","122.78","23.18M","2.19%"
"Dec 13","123.05","126.50","126.59","122.77","3.35M","-2.83%"
"Nov 13","126.64","127.23","127.70","125.72","22.27M","-0.57%"
"Oct 13","127.36","126.42","128.06","125.52","21.24M","0.77%"
"Sep 13","126.39","125.00","126.92","123.33","6.87M","0.84%"
"Aug 13","125.34","126.50","126.98","124.00","26.02M","-0.87%"
"Jul 13","126.44","126.38","127.31","124.36","21.60M","-0.09%"
"Jun 13","126.56","130.28","131.44","125.02","12.70M","-2.83%"
"May 13","130.25","133.36","133.78","129.59","35.60M","-2.33%"
"Apr 13","133.36","131.73","133.75","131.73","23.79M","1.05%"
"Mar 13","131.98","132.77","133.14","131.09","8.91M","-0.54%"
"Feb 13","132.70","131.22","132.98","130.72","27.80M","1.08%"
"Jan 13","131.28","131.94","132.55","130.94","24.59M","-1.13%"
"Dec 12","132.78","134.05","134.95","132.06","3.60M","-1.00%"
"Nov 12","134.12","132.95","134.36","132.31","19.32M","0.82%"
"Oct 12","133.03","133.47","133.80","131.69","18.73M","-0.34%"
"Sep 12","133.48","134.80","134.86","132.25","6.18M","-0.94%"
"Aug 12","134.75","134.81","134.92","132.16","20.75M","0.07%"
"Jul 12","134.66","133.45","135.48","133.30","16.67M","0.96%"
"Jun 12","133.38","135.05","135.91","132.91","6.83M","-1.13%"
"May 12","134.91","132.23","135.27","131.86","26.11M","1.99%"
"Apr 12","132.28","129.44","132.53","128.77","20.67M","2.16%"
"Mar 12","129.48","131.33","131.78","128.38","7.80M","-1.36%"
"Feb 12","131.27","132.28","132.33","130.38","21.58M","-0.74%"
"Jan 12","132.25","130.61","132.34","129.81","19.29M","0.86%"
"Dec 11","131.12","130.12","132.22","129.48","3.14M","0.74%"
"Nov 11","130.16","129.48","131.30","129.23","22.21M","0.85%"
"Oct 11","129.06","130.16","131.39","127.19","23.53M","-0.79%"
"Sep 11","130.09","129.95","131.98","129.42","8.97M","0.05%"
"Aug 11","130.03","125.45","131.64","125.30","34.81M","3.45%"
"Jul 11","125.69","122.23","125.94","121.70","25.83M","2.75%"
"Jun 11","122.33","123.92","125.89","121.88","11.20M","-1.37%"
"May 11","124.03","121.12","124.12","120.89","26.38M","2.39%"
"Apr 11","121.14","118.78","121.22","117.92","20.14M","1.77%"
"Mar 11","119.03","120.25","123.11","118.59","8.17M","-1.09%"
"Feb 11","120.34","120.83","120.88","117.69","23.84M","-0.38%"
"Jan 11","120.80","120.30","121.48","119.14","22.24M","0.30%"
"Dec 10","120.44","125.00","125.06","118.89","3.47M","-3.69%"
"Nov 10","125.05","126.28","128.03","124.05","25.57M","-0.97%"
"Oct 10","126.28","126.11","127.69","125.05","22.90M","0.18%"
"Sep 10","126.05","126.50","126.78","124.00","9.21M","-0.36%"
"Aug 10","126.50","123.77","126.88","123.39","25.54M","2.17%"
"Jul 10","123.81","122.69","123.89","121.45","22.27M","1.03%"
"Jun 10","122.55","120.58","122.84","119.69","8.68M","1.56%"
"May 10","120.67","117.81","122.45","117.44","30.52M","2.34%"
"Apr 10","117.91","116.19","117.97","114.83","22.04M","1.43%"
"Mar 10","116.25","118.66","119.17","115.28","7.78M","-2.24%"
"Feb 10","118.91","118.28","118.95","116.89","20.09M","0.63%"
"Jan 10","118.16","115.19","118.44","114.97","16.84M","2.35%"
"Dec 09","115.45","121.19","121.22","114.89","2.73M","-4.72%"
"Nov 09","121.17","118.77","121.67","117.55","16.05M","2.16%"
"Oct 09","118.61","118.33","119.91","116.88","19.23M","0.24%"
"Sep 09","118.33","118.50","119.88","116.59","5.69M","-0.19%"
"Aug 09","118.55","117.34","118.64","114.66","16.79M","1.08%"
"Jul 09","117.28","116.27","119.00","115.48","16.41M","0.87%"
"Jun 09","116.27","118.36","118.45","114.25","5.39M","-1.98%"
"May 09","118.62","121.00","122.06","116.94","14.11M","-1.92%"
"Apr 09","120.94","124.22","124.56","120.50","11.88M","-2.53%"
"Mar 09","124.08","121.92","127.05","121.75","4.41M","1.96%"
"Feb 09","121.70","122.75","124.78","121.08","12.25M","-0.79%"
"Jan 09","122.67","126.33","127.52","122.34","9.75M","-2.45%"
"Dec 08","125.75","122.91","130.80","122.70","1.24M","2.33%"
"Nov 08","122.89","113.11","123.17","112.86","9.94M","8.68%"
"Oct 08","113.08","114.73","118.06","111.39","15.10M","-1.34%"
"Sep 08","114.62","116.66","120.53","114.02","6.47M","-1.77%"
"Aug 08","116.69","115.03","117.20","114.06","17.61M","1.62%"
"Jul 08","114.83","113.89","116.06","112.84","22.86M","0.80%"
"Jun 08","113.92","113.84","116.00","111.88","6.99M","-0.03%"
"May 08","113.95","115.94","116.41","113.12","23.07M","-1.61%"
"Apr 08","115.81","119.02","119.09","114.62","23.76M","-2.64%"
"Mar 08","118.95","118.83","121.81","117.80","7.27M","0.22%"
"Feb 08","118.69","116.98","118.83","115.14","50.90M","1.69%"
"Jan 08","116.72","113.44","119.16","113.06","29.04M","2.94%"
"Dec 07","113.39","114.05","115.02","111.50","4.04M","-0.47%"
"Nov 07","113.92","109.94","114.97","109.73","30.08M","3.54%"
"Oct 07","110.02","109.22","111.20","108.20","25.06M","0.68%"
"Sep 07","109.28","109.50","111.42","108.39","9.51M","-0.18%"
"Aug 07","109.48","107.66","109.84","106.64","34.36M","1.92%"
"Jul 07","107.42","105.69","107.84","104.55","32.05M","1.63%"
"Jun 07","105.70","106.38","106.52","104.12","10.94M","-0.65%"
"May 07","106.39","108.36","108.50","106.20","27.39M","-1.79%"
"Apr 07","108.33","108.14","108.44","107.17","18.30M","0.19%"
"Mar 07","108.12","108.45","109.30","107.89","9.91M","-0.41%"
"Feb 07","108.56","106.81","109.23","106.56","24.60M","1.70%"
"Jan 07","106.75","107.48","108.33","106.20","20.41M","-0.67%"
"Dec 06","107.47","109.12","109.56","107.36","4.05M","-1.50%"
"Nov 06","109.11","108.22","109.14","107.31","23.30M","0.82%"
"Oct 06","108.22","108.06","108.67","106.59","20.42M","0.15%"
"Sep 06","108.06","107.42","108.75","106.69","9.07M","0.60%"
"Aug 06","107.42","106.06","107.45","105.75","20.32M","1.31%"
"Jul 06","106.03","104.84","106.06","104.16","16.51M","1.12%"
"Jun 06","104.86","105.02","106.20","104.03","6.43M","-0.21%"
"May 06","105.08","105.59","106.11","104.58","19.40M","-0.47%"
"Apr 06","105.58","106.39","106.53","104.92","17.00M","-0.76%"
"Mar 06","106.39","107.98","108.05","106.12","7.12M","-1.49%"
"Feb 06","108.00","108.50","108.59","107.53","17.54M","-0.41%"
"Jan 06","108.44","109.39","110.20","108.28","16.97M","-0.89%"
"Dec 05","109.41","108.78","109.88","108.20","3.47M","0.63%"
"Nov 05","108.73","108.48","109.53","107.48","17.58M","0.26%"
"Oct 05","108.45","109.89","110.08","108.12","15.25M","-1.34%"
"Sep 05","109.92","112.97","113.42","109.84","7.09M","-2.66%"
"Aug 05","112.92","111.03","113.06","109.78","16.56M","1.75%"
"Jul 05","110.98","113.67","113.67","110.88","13.61M","-2.19%"
"Jun 05","113.47","113.03","114.50","111.78","5.69M","0.56%"
"May 05","112.84","111.38","113.42","110.80","18.66M","1.27%"
"Apr 05","111.42","109.28","111.89","108.84","18.67M","1.97%"
"Mar 05","109.27","110.77","111.59","107.83","6.36M","-1.45%"
"Feb 05","110.88","112.27","113.39","110.64","15.35M","-1.24%"
"Jan 05","112.27","111.94","112.56","110.72","12.92M","0.29%"
"Dec 04","111.94","111.53","113.44","110.98","3.20M","0.44%"
"Nov 04","111.45","113.56","113.56","111.23","16.90M","-1.86%"
"Oct 04","113.56","112.59","114.16","111.66","15.64M","0.83%"
"Sep 04","112.62","113.58","114.38","112.16","7.02M","-0.75%"
"Aug 04","113.47","111.00","113.77","110.66","13.84M","2.48%"
"Jul 04","110.72","109.56","111.42","109.17","12.20M","1.27%"
"Jun 04","109.33","109.73","110.16","108.09","5.01M","-0.50%"
"May 04","109.88","110.50","111.09","107.80","13.94M","-0.56%"
"Apr 04","110.50","115.41","115.50","109.95","15.41M","-4.25%"
"Mar 04","115.41","115.44","117.97","114.45","4.89M","0.03%"
"Feb 04","115.38","113.42","115.48","112.88","11.80M","1.71%"
"Jan 04","113.44","112.08","115.11","111.03","12.83M","1.04%"
"Dec 03","112.27","112.30","114.28","111.44","2.16M","-0.12%"
"Nov 03","112.41","112.28","114.16","110.72","10.55M","0.10%"
"Oct 03","112.30","114.58","114.75","110.48","13.33M","-2.02%"
"Sep 03","114.62","111.09","114.67","110.00","4.97M","2.77%"
"Aug 03","111.53","111.00","113.48","109.61","12.68M","0.82%"
"Jul 03","110.62","117.59","117.95","110.06","15.12M","-5.81%"
"Jun 03","117.44","118.78","121.50","116.75","3.97M","-1.36%"
"May 03","119.06","115.22","119.39","114.47","11.53M","3.42%"
"Apr 03","115.12","115.25","115.31","113.12","9.26M","0.21%"
"Mar 03","114.88","116.72","117.91","112.47","3.58M","-1.58%"
"Feb 03","116.72","114.06","116.81","113.59","7.79M","2.46%"
"Jan 03","113.92","115.12","115.20","112.17","7.34M","-0.98%"
"Dec 02","115.05","112.16","115.55","111.50","1.31M","2.25%"
"Nov 02","112.52","114.80","115.47","112.06","7.01M","-1.92%"
"Oct 02","114.72","115.86","116.44","111.80","10.97M","-1.03%"
"Sep 02","115.91","113.28","116.20","113.28","3.37M","2.42%"
"Aug 02","113.17","110.61","114.19","110.53","8.72M","2.31%"
"Jul 02","110.61","107.33","111.97","106.88","8.82M","3.15%"
"Jun 02","107.23","106.58","108.95","106.23","3.29M","0.47%"
"May 02","106.73","105.56","107.03","104.25","7.07M","1.11%"
"Apr 02","105.56","102.47","105.80","102.19","5.35M","3.04%"
"Mar 02","102.45","107.23","107.34","101.91","2.16M","-4.48%"
"Feb 02","107.25","105.84","107.67","105.52","5.37M","1.29%"
"Jan 02","105.88","105.30","107.38","103.86","5.38M","0.70%"
"Dec 01","105.14","108.30","109.05","103.72","885.87K","-2.87%"
"Nov 01","108.25","111.72","112.41","105.53","5.89M","-2.93%"
"Oct 01","111.52","108.75","111.86","108.28","3.99M","2.52%"
"Sep 01","108.78","107.20","109.92","106.17","1.69M","1.45%"
"Aug 01","107.22","106.03","107.75","105.00","4.44M","1.05%"
"Jul 01","106.11","103.02","106.19","102.69","3.43M","3.00%"
"Jun 01","103.02","103.72","105.44","102.80","1.48M","-0.65%"
"May 01","103.69","103.83","105.62","102.69","4.31M","-0.09%"
"Apr 01","103.78","106.36","106.86","103.31","4.27M","-2.28%"
"Mar 01","106.20","106.38","107.52","105.41","1.55M","-0.12%"
"Feb 01","106.33","105.47","106.34","104.09","3.83M","1.05%"
"Jan 01","105.22","104.86","106.56","103.62","4.56M","0.34%"
"Dec 00","104.86","102.67","105.56","102.30","852.57K","1.92%"
"Nov 00","102.88","100.73","102.98","99.84","3.41M","2.16%"
"Oct 00","100.70","100.27","102.09","99.67","3.75M","0.48%"
"Sep 00","100.22","100.20","100.72","99.31","1.38M","0.06%"
"Aug 00","100.16","98.84","100.41","98.84","3.14M","1.28%"
"Jul 00","98.89","98.44","99.28","97.62","2.28M","0.42%"
"Jun 00","98.48","96.98","98.98","96.98","1.10M","1.58%"
"May 00","96.95","96.94","97.05","94.83","3.37M","0.00%"
"Apr 00","96.95","98.17","99.94","96.47","3.16M","-1.15%"
"Mar 00","98.08","95.78","98.22","95.50","1.16M","2.41%"
"Feb 00","95.77","94.75","96.84","94.08","3.64M","1.04%"
"Jan 00","94.78","95.66","95.77","93.67","3.20M","-1.13%"
"Dec 99","95.86","109.20","110.19","95.72","611.53K","-12.26%"
"Nov 99","109.25","109.69","110.88","109.00","2.39M","-0.43%"
"Oct 99","109.72","110.16","110.22","107.73","2.34M","-0.36%"
"Sep 99","110.12","110.09","111.16","109.53","1.05M","0.11%"
"Aug 99","110.00","110.28","111.66","108.72","2.79M","-0.28%"
"Jul 99","110.31","111.27","112.25","110.00","2.39M","-0.79%"
"Jun 99","111.19","112.25","112.25","109.16","1.12M","-0.89%"
"May 99","112.19","114.72","114.81","111.84","2.70M","-2.18%"
"Apr 99","114.69","114.69","116.69","114.28","2.04M","0.00%"
"Mar 99","114.69","114.69","116.00","113.78","1.02M","-0.03%"
"Feb 99","114.72","119.19","119.22","114.03","2.95M","-3.75%"
"Jan 99","119.19","119.06","119.97","117.12","2.22M","0.03%"
"Dec 98","119.16","119.56","120.62","117.81","596.35K","0.11%"
"Nov 98","119.03","120.28","120.31","117.19","2.31M","-1.06%"
"Oct 98","120.31","121.50","123.59","117.09","1.17M","-0.93%"
"Sep 98","121.44","117.31","121.47","116.41","953.12K","3.85%"
"Aug 98","116.94","113.59","117.34","113.53","2.75M","2.98%"
"Jul 98","113.56","113.81","114.41","113.06","1.61M","-0.25%"
"Jun 98","113.84","112.88","114.22","112.53","884.38K","0.77%"
"May 98","112.97","112.31","113.16","111.75","2.06M","0.59%"
"Apr 98","112.31","112.41","114.09","111.34","2.26M","-0.06%"
"Mar 98","112.38","112.75","113.38","111.50","974.35K","-0.28%"
"Feb 98","112.69","113.72","114.00","112.09","2.09M","-0.91%"
"Jan 98","113.72","112.19","115.25","112.12","2.27M","1.39%"
"Dec 97","112.16","111.53","112.88","110.25","569.16K","0.48%"
"Nov 97","111.62","111.69","112.00","110.97","1.45M","-0.12%"
"Oct 97","111.75","110.16","112.38","109.53","2.54M","1.48%"
"Sep 97","110.12","109.09","110.81","108.72","740.08K","1.00%"
"Aug 97","109.03","111.03","111.12","108.41","2.03M","-1.77%"
"Jul 97","111.00","107.94","111.09","107.78","1.47M","2.89%"
"Jun 97","107.88","107.62","109.16","107.41","761.66K","0.33%"
"May 97","107.53","107.09","107.75","106.53","1.61M","0.52%"
"Apr 97","106.97","105.53","107.25","105.06","1.66M","1.39%"
"Mar 97","105.50","108.25","108.44","105.41","769.18K","-2.62%"
"Feb 97","108.34","108.88","110.53","108.09","1.56M","-0.40%"
"Jan 97","108.78","109.12","109.34","107.56","1.74M","-0.31%"
"Dec 96","109.12","111.53","111.78","109.06","419.14K","-2.13%"
"Nov 96","111.50","109.62","111.53","109.38","1.57M","1.72%"
"Oct 96","109.62","107.28","109.91","107.19","1.46M","2.18%"
"Sep 96","107.28","106.00","107.94","105.47","666.03K","1.06%"
"Aug 96","106.16","107.16","109.47","105.75","1.50M","-0.90%"
"Jul 96","107.12","107.50","107.66","104.91","1.52M","-0.35%"
"Jun 96","107.50","106.50","107.69","105.31","640.36K","0.94%"
"May 96","106.50","107.47","108.00","105.88","1.79M","-0.93%"
"Apr 96","107.50","108.94","109.56","106.22","1.57M","-1.29%"
"Mar 96","108.91","111.59","112.84","108.22","685.20K","-2.30%"
"Feb 96","111.47","114.88","115.44","110.91","1.87M","-2.93%"
"Jan 96","114.84","114.56","115.31","113.06","1.56M","0.22%"
"Dec 95","114.59","113.31","114.69","112.12","373.18K","1.21%"
"Nov 95","113.22","111.44","113.38","111.31","1.40M","1.52%"
"Oct 95","111.53","110.12","111.97","110.09","1.40M","1.16%"
"Sep 95","110.25","110.00","111.16","108.81","838.02K","0.25%"
"Aug 95","109.97","108.91","110.06","107.22","1.66M","0.97%"
"Jul 95","108.91","110.16","111.97","108.03","1.53M","-1.07%"
"Jun 95","110.09","110.31","113.19","109.34","815.76K","-0.15%"
"May 95","110.25","105.31","110.34","105.12","1.95M","4.69%"
"Apr 95","105.31","103.94","105.97","103.84","1.34M","1.35%"
"Mar 95","103.91","104.38","105.69","102.97","899.25K","-0.45%"
"Feb 95","104.38","101.75","104.38","101.12","1.71M","2.65%"
"Jan 95","101.69","99.97","101.78","99.19","1.70M","1.75%"
"Dec 94","99.94","100.16","101.34","99.53","434.72K","-0.31%"
"Nov 94","100.25","100.66","100.97","99.06","1.80M","-0.41%"
"Oct 94","100.66","101.44","102.28","99.88","1.61M","-0.80%"
"Sep 94","101.47","105.22","106.12","101.06","748.36K","-3.59%"
"Aug 94","105.25","104.91","105.75","103.38","1.76M","0.09%"
"Jul 94","105.16","102.97","105.25","102.16","1.59M","2.13%"
"Jun 94","102.97","105.00","107.28","102.94","892.69K","-1.91%"
"May 94","104.97","105.38","106.41","102.56","2.11M","-0.32%"
"Apr 94","105.31","106.62","106.97","103.84","2.16M","-0.91%"
"Mar 94","106.28","111.12","111.22","105.72","934.70K","-4.33%"
"Feb 94","111.09","114.28","114.34","110.53","1.67M","-2.82%"
"Jan 94","114.31","112.69","114.81","111.94","1.43M","1.46%"
"Dec 93","112.66","113.28","114.62","112.53","404.48K","-0.60%"
"Nov 93","113.34","115.06","115.09","112.66","1.67M","-1.52%"
"Oct 93","115.09","115.47","117.12","114.59","1.20M","-0.25%"
"Sep 93","115.38","115.72","117.28","114.72","572.92K","-0.29%"
"Aug 93","115.72","113.28","115.94","112.75","1.10M","2.15%"
"Jul 93","113.28","113.31","114.41","112.00","1.11M","-0.03%"
"Jun 93","113.31","111.72","113.66","111.72","600.22K","1.42%"
"May 93","111.72","112.19","113.22","111.22","1.17M","-0.25%"
"Apr 93","112.00","111.19","113.41","110.22","1.07M","0.73%"
"Mar 93","111.19","112.69","114.75","110.41","594.09K","-1.06%"
"Feb 93","112.38","110.00","113.31","109.38","1.11M","2.37%"
"Jan 93","109.78","106.88","110.00","106.19","1.11M","2.68%"
"Dec 92","106.91","106.12","108.28","106.03","365.19K","0.74%"
"Nov 92","106.12","106.69","107.31","105.41","1.04M","-0.53%"
"Oct 92","106.69","109.22","110.62","105.81","1.28M","-2.32%"
"Sep 92","109.22","108.81","111.31","107.66","488.42K","0.40%"
"Aug 92","108.78","107.62","110.19","107.28","919.23K","0.96%"
"Jul 92","107.75","104.41","109.25","104.22","845.72K","3.23%"
"Jun 92","104.38","103.81","105.34","103.16","283.73K","0.55%"
"May 92","103.81","101.84","104.81","101.84","636.04K","2.05%"
"Apr 92","101.72","101.72","103.50","101.50","603.53K","0.03%"
"Mar 92","101.69","104.16","104.28","100.88","290.72K","-2.37%"
"Feb 92","104.16","103.66","105.12","102.31","731.05K","0.61%"
"Jan 92","103.53","107.34","107.38","103.22","903.73K","-3.50%"
"Dec 91","107.28","103.50","107.53","103.47","206.31K","3.68%"
"Nov 91","103.47","102.91","104.00","102.19","555.85K","0.49%"
"Oct 91","102.97","102.66","103.22","101.16","556.85K","0.37%"
"Sep 91","102.59","100.94","102.66","100.44","202.83K","1.80%"
"Aug 91","100.78","98.56","101.50","98.19","570.15K","2.35%"
"Jul 91","98.47","97.59","98.47","96.78","306.53K","0.99%"
"Jun 91","97.50","99.06","99.06","96.66","175.32K","-1.60%"
"May 91","99.09","99.34","99.88","98.09","466.42K","-0.19%"
"Apr 91","99.28","98.56","99.81","98.28","452.70K","0.54%"
"Mar 91","98.75","99.16","99.56","97.28","183.85K","-0.56%"
"Feb 91","99.31","99.47","101.09","99.19","392.68K","-0.10%"
"Jan 91","99.41","98.94","99.97","97.56","454.78K","0.67%"
"Dec 90","98.75","98.16","100.38","97.69","137.53K","0.83%"
"Nov 90","97.94","95.72","98.22","95.72","462.46K","2.29%"
"Oct 90","95.75","94.81","96.19","93.81","430.86K","1.19%"
"Sep 90","94.62","94.16","95.12","93.00","191.72K","0.13%"
"Aug 90","94.50","97.56","98.16","93.03","590.34K","-3.11%"
"Jul 90","97.53","97.03","97.78","95.62","395.82K","0.55%"
"Jun 90","97.00","95.94","97.47","95.81","154.51K","1.10%"
"May 90","95.94","93.41","96.22","92.81","507.96K","2.88%"
"Apr 90","93.25","95.47","96.62","92.91","371.67K","-2.29%"
"Mar 90","95.44","96.34","96.72","94.94","178.77K","-1.01%"
"Feb 90","96.41","97.00","97.81","95.22","542.04K","-0.61%"
"Jan 90","97.00","99.59","99.94","95.97","472.19K","-2.76%"