\relax 
\providecommand\hyper@newdestlabel[2]{}
\catcode `"\active 
\AC@reset@newl@bel
\providecommand\HyperFirstAtBeginDocument{\AtBeginDocument}
\HyperFirstAtBeginDocument{\ifx\hyper@anchor\@undefined
\global\let\oldcontentsline\contentsline
\gdef\contentsline#1#2#3#4{\oldcontentsline{#1}{#2}{#3}}
\global\let\oldnewlabel\newlabel
\gdef\newlabel#1#2{\newlabelxx{#1}#2}
\gdef\newlabelxx#1#2#3#4#5#6{\oldnewlabel{#1}{{#2}{#3}}}
\AtEndDocument{\ifx\hyper@anchor\@undefined
\let\contentsline\oldcontentsline
\let\newlabel\oldnewlabel
\fi}
\fi}
\global\let\hyper@last\relax 
\gdef\HyperFirstAtBeginDocument#1{#1}
\providecommand\HyField@AuxAddToFields[1]{}
\providecommand\HyField@AuxAddToCoFields[2]{}
\abx@aux@refcontext{anyt/global//global/global}
\abx@aux@cite{neuroRace:Git}
\abx@aux@segm{0}{0}{neuroRace:Git}
\abx@aux@cite{rnn:2015}
\abx@aux@segm{0}{0}{rnn:2015}
\abx@aux@cite{per-gra:2007}
\abx@aux@segm{0}{0}{per-gra:2007}
\@writefile{toc}{\boolfalse {citerequest}\boolfalse {citetracker}\boolfalse {pagetracker}\boolfalse {backtracker}\relax }
\@writefile{lof}{\boolfalse {citerequest}\boolfalse {citetracker}\boolfalse {pagetracker}\boolfalse {backtracker}\relax }
\@writefile{lot}{\boolfalse {citerequest}\boolfalse {citetracker}\boolfalse {pagetracker}\boolfalse {backtracker}\relax }
\babel@aux{ngerman}{}
\babel@aux{ngerman}{}
\babel@aux{ngerman}{}
\@writefile{toc}{\defcounter {refsection}{0}\relax }\@writefile{toc}{\contentsline {section}{\numberline {1}Motivation}{1}{section.1}}
\abx@aux@cite{deeplearningAi:2018}
\abx@aux@segm{0}{0}{deeplearningAi:2018}
\abx@aux@cite{arXiv:1609.03499}
\abx@aux@segm{0}{0}{arXiv:1609.03499}
\abx@aux@cite{tensor:2018}
\abx@aux@segm{0}{0}{tensor:2018}
\@writefile{toc}{\defcounter {refsection}{0}\relax }\@writefile{toc}{\contentsline {section}{\numberline {2}Zielsetzung}{2}{section.2}}
\@writefile{toc}{\defcounter {refsection}{0}\relax }\@writefile{toc}{\contentsline {section}{\numberline {3}Vorgehen}{2}{section.3}}
\@writefile{toc}{\defcounter {refsection}{0}\relax }\@writefile{toc}{\contentsline {section}{\numberline {4}Erfordernisse und Randbedingungen}{2}{section.4}}
\@writefile{toc}{\defcounter {refsection}{0}\relax }\@writefile{toc}{\contentsline {section}{\numberline {5}Zeitplan}{3}{section.5}}
\@writefile{lof}{\defcounter {refsection}{0}\relax }\@writefile{lof}{\contentsline {figure}{\numberline {1}{\ignorespaces Zeitplan}}{3}{figure.caption.1}}
\@writefile{toc}{\defcounter {refsection}{0}\relax }\@writefile{toc}{\contentsline {section}{\numberline {6}Erwartete Ergebnisse}{3}{section.6}}
\abx@aux@cite{gru:2014}
\abx@aux@segm{0}{0}{gru:2014}
\abx@aux@cite{lstm:1997}
\abx@aux@segm{0}{0}{lstm:1997}
\@writefile{toc}{\defcounter {refsection}{0}\relax }\@writefile{toc}{\contentsline {section}{\numberline {7}Vorl\IeC {\"a}ufige Gliederung}{4}{section.7}}
\@writefile{toc}{\defcounter {refsection}{0}\relax }\@writefile{toc}{\contentsline {section}{Literaturangaben}{4}{section*.2}}
\abx@aux@refcontextdefaultsdone
\abx@aux@defaultrefcontext{0}{gru:2014}{anyt/global//global/global}
\abx@aux@defaultrefcontext{0}{neuroRace:Git}{anyt/global//global/global}
\abx@aux@defaultrefcontext{0}{lstm:1997}{anyt/global//global/global}
\abx@aux@defaultrefcontext{0}{rnn:2015}{anyt/global//global/global}
\abx@aux@defaultrefcontext{0}{deeplearningAi:2018}{anyt/global//global/global}
\abx@aux@defaultrefcontext{0}{arXiv:1609.03499}{anyt/global//global/global}
\abx@aux@defaultrefcontext{0}{per-gra:2007}{anyt/global//global/global}
\abx@aux@defaultrefcontext{0}{tensor:2018}{anyt/global//global/global}
