\boolfalse {citerequest}\boolfalse {citetracker}\boolfalse {pagetracker}\boolfalse {backtracker}\relax 
\babel@toc {ngerman}{}
\defcounter {refsection}{0}\relax 
\addvspace {10\p@ }
\defcounter {refsection}{0}\relax 
\addvspace {10\p@ }
\defcounter {refsection}{0}\relax 
\contentsline {figure}{\numberline {\relax 2.1}{\ignorespaces RNN simple Struktur\relax }}{4}{figure.caption.4}
\defcounter {refsection}{0}\relax 
\contentsline {figure}{\numberline {\relax 2.2}{\ignorespaces \relax }}{6}{figure.caption.5}
\defcounter {refsection}{0}\relax 
\contentsline {figure}{\numberline {\relax 2.3}{\ignorespaces Beispielverteilung f\IeC {\"u}r Lenkwerte\relax }}{8}{figure.caption.6}
\defcounter {refsection}{0}\relax 
\contentsline {figure}{\numberline {\relax 2.4}{\ignorespaces Beispiel f\IeC {\"u}r das Mittelwerts-Oversampling\relax }}{9}{figure.caption.7}
\defcounter {refsection}{0}\relax 
\contentsline {figure}{\numberline {\relax 2.5}{\ignorespaces Beispiel des Informationsgehaltes anhand eines Differenzbildes\relax }}{10}{figure.caption.8}
\defcounter {refsection}{0}\relax 
\contentsline {figure}{\numberline {\relax 2.6}{\ignorespaces Heatmap Relevanzbereich\relax }}{11}{figure.caption.9}
\defcounter {refsection}{0}\relax 
\contentsline {figure}{\numberline {\relax 2.7}{\ignorespaces Heatmap Beispielbild\relax }}{12}{figure.caption.10}
\defcounter {refsection}{0}\relax 
\contentsline {figure}{\numberline {\relax 2.8}{\ignorespaces CNN Zero-Padding \cite {img:same_padding_no_strides}\relax }}{14}{figure.caption.11}
\defcounter {refsection}{0}\relax 
\contentsline {figure}{\numberline {\relax 2.9}{\ignorespaces Batch-Aufbau bei nicht sequenziellen Daten (a) und sequenziellen (b)\relax }}{16}{figure.caption.12}
\defcounter {refsection}{0}\relax 
\contentsline {figure}{\numberline {\relax 2.10}{\ignorespaces Peephole-Connections Decoder\relax }}{17}{figure.caption.13}
\defcounter {refsection}{0}\relax 
\contentsline {figure}{\numberline {\relax 2.11}{\ignorespaces Teacher Forcing RNN\relax }}{20}{figure.caption.14}
\defcounter {refsection}{0}\relax 
\addvspace {10\p@ }
\defcounter {refsection}{0}\relax 
\contentsline {figure}{\numberline {\relax 3.1}{\ignorespaces Steuerung durch Einzelentscheidungen\relax }}{23}{figure.caption.15}
\defcounter {refsection}{0}\relax 
\contentsline {figure}{\numberline {\relax 3.2}{\ignorespaces Heatmap Beispiele\relax }}{25}{figure.caption.16}
\defcounter {refsection}{0}\relax 
\contentsline {figure}{\numberline {\relax 3.3}{\ignorespaces Verteilung der Trainingsdaten\relax }}{26}{figure.caption.17}
\defcounter {refsection}{0}\relax 
\addvspace {10\p@ }
\defcounter {refsection}{0}\relax 
\contentsline {figure}{\numberline {\relax 4.1}{\ignorespaces Netzarchitektur des Geschwindigkeitsnetzes\relax }}{32}{figure.caption.18}
\defcounter {refsection}{0}\relax 
\contentsline {figure}{\numberline {\relax 4.2}{\ignorespaces Netzarchitektur des Netzes welches beide Werte ausgibt\relax }}{33}{figure.caption.19}
\defcounter {refsection}{0}\relax 
\contentsline {figure}{\numberline {\relax 4.3}{\ignorespaces Netzarchitektur des Netzes welches beide Werte ausgibt mit separaten LSTM-Pfaden\relax }}{33}{figure.caption.20}
\defcounter {refsection}{0}\relax 
\addvspace {10\p@ }
\defcounter {refsection}{0}\relax 
\contentsline {figure}{\numberline {\relax 5.1}{\ignorespaces Bitmask Batch f\IeC {\"u}r die Vektorisierung\relax }}{36}{figure.caption.21}
\defcounter {refsection}{0}\relax 
\addvspace {10\p@ }
\defcounter {refsection}{0}\relax 
\addvspace {10\p@ }
\defcounter {refsection}{0}\relax 
\addvspace {10\p@ }
\defcounter {refsection}{0}\relax 
\addvspace {10\p@ }
\defcounter {refsection}{0}\relax 
\addvspace {10\p@ }
\defcounter {refsection}{0}\relax 
\addvspace {10\p@ }
\defcounter {refsection}{0}\relax 
\addvspace {10\p@ }
\defcounter {refsection}{0}\relax 
\addvspace {10\p@ }
