\relax 
\providecommand\hyper@newdestlabel[2]{}
\providecommand*\new@tpo@label[2]{}
\catcode `"\active 
\AC@reset@newl@bel
\providecommand\HyperFirstAtBeginDocument{\AtBeginDocument}
\HyperFirstAtBeginDocument{\ifx\hyper@anchor\@undefined
\global\let\oldcontentsline\contentsline
\gdef\contentsline#1#2#3#4{\oldcontentsline{#1}{#2}{#3}}
\global\let\oldnewlabel\newlabel
\gdef\newlabel#1#2{\newlabelxx{#1}#2}
\gdef\newlabelxx#1#2#3#4#5#6{\oldnewlabel{#1}{{#2}{#3}}}
\AtEndDocument{\ifx\hyper@anchor\@undefined
\let\contentsline\oldcontentsline
\let\newlabel\oldnewlabel
\fi}
\fi}
\global\let\hyper@last\relax 
\gdef\HyperFirstAtBeginDocument#1{#1}
\providecommand\HyField@AuxAddToFields[1]{}
\providecommand\HyField@AuxAddToCoFields[2]{}
\providecommand\BKM@entry[2]{}
\abx@aux@refcontext{anyt/global//global/global}
\@writefile{toc}{\boolfalse {citerequest}\boolfalse {citetracker}\boolfalse {pagetracker}\boolfalse {backtracker}\relax }
\@writefile{lof}{\boolfalse {citerequest}\boolfalse {citetracker}\boolfalse {pagetracker}\boolfalse {backtracker}\relax }
\@writefile{lot}{\boolfalse {citerequest}\boolfalse {citetracker}\boolfalse {pagetracker}\boolfalse {backtracker}\relax }
\babel@aux{ngerman}{}
\providecommand\@gls@reference[3]{}
\@input{chapter/Abstract.aux}
\abx@aux@cite{arXiv:end_to_end_udacity}
\abx@aux@segm{0}{0}{arXiv:end_to_end_udacity}
\abx@aux@cite{arXiv:end_to_end_vid_data}
\abx@aux@segm{0}{0}{arXiv:end_to_end_vid_data}
\abx@aux@cite{arXiv:interpretable_learning}
\abx@aux@segm{0}{0}{arXiv:interpretable_learning}
\abx@aux@cite{arXiv:end_to_end_nvidia}
\abx@aux@segm{0}{0}{arXiv:end_to_end_nvidia}
\abx@aux@cite{1549828}
\abx@aux@segm{0}{0}{1549828}
\abx@aux@cite{DBLP:journals/corr/ZeilerF13}
\abx@aux@segm{0}{0}{DBLP:journals/corr/ZeilerF13}
\abx@aux@cite{DBLP:journals/corr/XuGYD16}
\abx@aux@segm{0}{0}{DBLP:journals/corr/XuGYD16}
\abx@aux@cite{DBLP:journals/corr/SantanaH16}
\abx@aux@segm{0}{0}{DBLP:journals/corr/SantanaH16}
\abx@aux@cite{web:forschB}
\abx@aux@segm{0}{0}{web:forschB}
\BKM@entry{id=1,dest={636861707465722E31},srcline={1}}{45696E6C656974756E67}
\BKM@entry{id=2,dest={73656374696F6E2E312E31},srcline={3}}{4D6F7469766174696F6E}
\BKM@entry{id=3,dest={73656374696F6E2E312E32},srcline={6}}{5A69656C7365747A756E67}
\@writefile{toc}{\defcounter {refsection}{0}\relax }\@writefile{toc}{\contentsline {chapter}{\numberline {1}Einleitung}{1}{chapter.1}}
\@writefile{lof}{\defcounter {refsection}{0}\relax }\@writefile{lof}{\addvspace {10\p@ }}
\@writefile{lot}{\defcounter {refsection}{0}\relax }\@writefile{lot}{\addvspace {10\p@ }}
\@writefile{lol}{\defcounter {refsection}{0}\relax }\@writefile{lol}{\addvspace {10\p@ }}
\@writefile{toc}{\defcounter {refsection}{0}\relax }\@writefile{toc}{\contentsline {section}{\numberline {1.1}Motivation}{1}{section.1.1}}
\@writefile{toc}{\defcounter {refsection}{0}\relax }\@writefile{toc}{\contentsline {section}{\numberline {1.2}Zielsetzung}{1}{section.1.2}}
\BKM@entry{id=4,dest={73656374696F6E2E312E33},srcline={11}}{566F72676568656E737765697365}
\abx@aux@segm{0}{0}{arXiv:end_to_end_udacity}
\abx@aux@segm{0}{0}{arXiv:end_to_end_vid_data}
\abx@aux@segm{0}{0}{arXiv:interpretable_learning}
\abx@aux@segm{0}{0}{arXiv:end_to_end_nvidia}
\abx@aux@segm{0}{0}{1549828}
\abx@aux@segm{0}{0}{DBLP:journals/corr/ZeilerF13}
\abx@aux@segm{0}{0}{DBLP:journals/corr/XuGYD16}
\abx@aux@segm{0}{0}{DBLP:journals/corr/SantanaH16}
\@writefile{toc}{\defcounter {refsection}{0}\relax }\@writefile{toc}{\contentsline {section}{\numberline {1.3}Vorgehensweise}{2}{section.1.3}}
\BKM@entry{id=5,dest={636861707465722E32},srcline={1}}{4772756E646C6167656E}
\abx@aux@cite{web:icw1}
\abx@aux@segm{0}{0}{web:icw1}
\abx@aux@cite{web:icw2}
\abx@aux@segm{0}{0}{web:icw2}
\BKM@entry{id=6,dest={73656374696F6E2E322E31},srcline={4}}{526563757272656E74204E657572616C204E6574776F726B20524E4E}
\@writefile{toc}{\defcounter {refsection}{0}\relax }\@writefile{toc}{\contentsline {chapter}{\numberline {2}Grundlagen}{3}{chapter.2}}
\@writefile{lof}{\defcounter {refsection}{0}\relax }\@writefile{lof}{\addvspace {10\p@ }}
\@writefile{lot}{\defcounter {refsection}{0}\relax }\@writefile{lot}{\addvspace {10\p@ }}
\@writefile{lol}{\defcounter {refsection}{0}\relax }\@writefile{lol}{\addvspace {10\p@ }}
\@writefile{toc}{\defcounter {refsection}{0}\relax }\@writefile{toc}{\contentsline {section}{\numberline {2.1}Recurrent Neural Network RNN}{3}{section.2.1}}
\abx@aux@segm{0}{0}{web:icw1}
\BKM@entry{id=7,dest={73656374696F6E2E322E32},srcline={15}}{524E4E20537461746573}
\@writefile{lof}{\defcounter {refsection}{0}\relax }\@writefile{lof}{\contentsline {figure}{\numberline {\relax 2.1}{\ignorespaces  RNN simple Struktur\relax }}{4}{figure.caption.4}}
\providecommand*\caption@xref[2]{\@setref\relax\@undefined{#1}}
\newlabel{fig:rnnSimple}{{\relax 2.1}{4}{RNN simple Struktur\relax }{figure.caption.4}{}}
\@writefile{toc}{\defcounter {refsection}{0}\relax }\@writefile{toc}{\contentsline {section}{\numberline {2.2}RNN States}{4}{section.2.2}}
\BKM@entry{id=8,dest={73656374696F6E2E322E33},srcline={22}}{436C61737320496D62616C616E63652050726F626C656D}
\@writefile{toc}{\defcounter {refsection}{0}\relax }\@writefile{toc}{\contentsline {section}{\numberline {2.3}Class Imbalance Problem}{5}{section.2.3}}
\BKM@entry{id=9,dest={73656374696F6E2E322E34},srcline={51}}{4F76657273616D706C696E67206265692054696D65736572696573}
\abx@aux@cite{web:forschA}
\abx@aux@segm{0}{0}{web:forschA}
\@writefile{lof}{\defcounter {refsection}{0}\relax }\@writefile{lof}{\contentsline {figure}{\numberline {\relax 2.2}{\ignorespaces \relax }}{6}{figure.caption.5}}
\newlabel{fig:steerDist}{{\relax 2.2}{6}{\relax }{figure.caption.5}{}}
\@writefile{toc}{\defcounter {refsection}{0}\relax }\@writefile{toc}{\contentsline {section}{\numberline {2.4}Oversampling bei Timeseries}{7}{section.2.4}}
\@writefile{lof}{\defcounter {refsection}{0}\relax }\@writefile{lof}{\contentsline {figure}{\numberline {\relax 2.3}{\ignorespaces  Beispielverteilung f\IeC {\"u}r Lenkwerte\relax }}{8}{figure.caption.6}}
\newlabel{fig:steerClassExample}{{\relax 2.3}{8}{Beispielverteilung für Lenkwerte\relax }{figure.caption.6}{}}
\@writefile{lof}{\defcounter {refsection}{0}\relax }\@writefile{lof}{\contentsline {figure}{\numberline {\relax 2.4}{\ignorespaces  Beispiel f\IeC {\"u}r das Mittelwerts-Oversampling\relax }}{9}{figure.caption.7}}
\newlabel{fig:overMeanExample}{{\relax 2.4}{9}{Beispiel für das Mittelwerts-Oversampling\relax }{figure.caption.7}{}}
\BKM@entry{id=10,dest={73656374696F6E2E322E35},srcline={117}}{486561746D6170207A75722056697375616C696573696572756E6720766F6E20506978656C206F6620496E746572657374}
\abx@aux@cite{web:keras}
\abx@aux@segm{0}{0}{web:keras}
\abx@aux@segm{0}{0}{DBLP:journals/corr/ZeilerF13}
\abx@aux@cite{web:cs231n}
\abx@aux@segm{0}{0}{web:cs231n}
\@writefile{lof}{\defcounter {refsection}{0}\relax }\@writefile{lof}{\contentsline {figure}{\numberline {\relax 2.5}{\ignorespaces  Beispiel des Informationsgehaltes anhand eines Differenzbildes\relax }}{10}{figure.caption.8}}
\newlabel{fig:diffImg}{{\relax 2.5}{10}{Beispiel des Informationsgehaltes anhand eines Differenzbildes\relax }{figure.caption.8}{}}
\@writefile{toc}{\defcounter {refsection}{0}\relax }\@writefile{toc}{\contentsline {section}{\numberline {2.5}Heatmap zur Visualiesierung von Pixel of Interest}{11}{section.2.5}}
\newlabel{sec:fund_heatmap}{{2.5}{11}{Heatmap zur Visualiesierung von Pixel of Interest}{section.2.5}{}}
\@writefile{lof}{\defcounter {refsection}{0}\relax }\@writefile{lof}{\contentsline {figure}{\numberline {\relax 2.6}{\ignorespaces  Heatmap Relevanzbereich\relax }}{11}{figure.caption.9}}
\newlabel{fig:heatmapGitter}{{\relax 2.6}{11}{Heatmap Relevanzbereich\relax }{figure.caption.9}{}}
\@writefile{lof}{\defcounter {refsection}{0}\relax }\@writefile{lof}{\contentsline {figure}{\numberline {\relax 2.7}{\ignorespaces  Heatmap Beispielbild\relax }}{12}{figure.caption.10}}
\newlabel{fig:heatmapExample}{{\relax 2.7}{12}{Heatmap Beispielbild\relax }{figure.caption.10}{}}
\BKM@entry{id=11,dest={73656374696F6E2E322E36},srcline={159}}{5A65726F2D50616464696E672053657175656E6365204C6561726E696E67}
\@writefile{toc}{\defcounter {refsection}{0}\relax }\@writefile{toc}{\contentsline {section}{\numberline {2.6}Zero-Padding Sequence Learning}{13}{section.2.6}}
\abx@aux@cite{img:same_padding_no_strides}
\abx@aux@segm{0}{0}{img:same_padding_no_strides}
\abx@aux@segm{0}{0}{img:same_padding_no_strides}
\@writefile{lof}{\defcounter {refsection}{0}\relax }\@writefile{lof}{\contentsline {figure}{\numberline {\relax 2.8}{\ignorespaces  CNN Zero-Padding \cite {img:same_padding_no_strides}\relax }}{14}{figure.caption.11}}
\newlabel{fig:samePadding}{{\relax 2.8}{14}{CNN Zero-Padding \cite {img:same_padding_no_strides}\relax }{figure.caption.11}{}}
\BKM@entry{id=12,dest={73656374696F6E2E322E37},srcline={204}}{426174636820524E4E204C6561726E696E67}
\@writefile{toc}{\defcounter {refsection}{0}\relax }\@writefile{toc}{\contentsline {section}{\numberline {2.7}Batch RNN Learning}{15}{section.2.7}}
\BKM@entry{id=13,dest={73656374696F6E2E322E38},srcline={236}}{5365636F6E642048616E64205465616368657220466F7263696E67}
\@writefile{lof}{\defcounter {refsection}{0}\relax }\@writefile{lof}{\contentsline {figure}{\numberline {\relax 2.9}{\ignorespaces  Batch-Aufbau bei nicht sequenziellen Daten (a) und sequenziellen (b)\relax }}{16}{figure.caption.12}}
\newlabel{fig:batchStructure}{{\relax 2.9}{16}{Batch-Aufbau bei nicht sequenziellen Daten (a) und sequenziellen (b)\relax }{figure.caption.12}{}}
\@writefile{toc}{\defcounter {refsection}{0}\relax }\@writefile{toc}{\contentsline {section}{\numberline {2.8}Second Hand Teacher Forcing}{17}{section.2.8}}
\@writefile{lof}{\defcounter {refsection}{0}\relax }\@writefile{lof}{\contentsline {figure}{\numberline {\relax 2.10}{\ignorespaces  Peephole-Connections Decoder\relax }}{17}{figure.caption.13}}
\newlabel{fig:peepholeDecoder}{{\relax 2.10}{17}{Peephole-Connections Decoder\relax }{figure.caption.13}{}}
\abx@aux@cite{web:masteryTeacher}
\abx@aux@segm{0}{0}{web:masteryTeacher}
\BKM@entry{id=14,dest={73656374696F6E2E322E39},srcline={303}}{50726F666563636F7220466F7263696E67}
\abx@aux@cite{lamb2016professor}
\abx@aux@segm{0}{0}{lamb2016professor}
\@writefile{lof}{\defcounter {refsection}{0}\relax }\@writefile{lof}{\contentsline {figure}{\numberline {\relax 2.11}{\ignorespaces  Teacher Forcing RNN\relax }}{20}{figure.caption.14}}
\newlabel{fig:teacher_forcing}{{\relax 2.11}{20}{Teacher Forcing RNN\relax }{figure.caption.14}{}}
\@writefile{toc}{\defcounter {refsection}{0}\relax }\@writefile{toc}{\contentsline {section}{\numberline {2.9}Profeccor Forcing}{21}{section.2.9}}
\BKM@entry{id=15,dest={636861707465722E33},srcline={1}}{416E616C797365}
\BKM@entry{id=16,dest={73656374696F6E2E332E31},srcline={4}}{4E6575726F526163652050726F6A656B74}
\abx@aux@cite{web:neuroRace:Git}
\abx@aux@segm{0}{0}{web:neuroRace:Git}
\BKM@entry{id=17,dest={73656374696F6E2E332E32},srcline={7}}{53696D756C6174696F6E}
\abx@aux@cite{web:mitGazebo}
\abx@aux@segm{0}{0}{web:mitGazebo}
\abx@aux@cite{web:gazebo}
\abx@aux@segm{0}{0}{web:gazebo}
\@writefile{toc}{\defcounter {refsection}{0}\relax }\@writefile{toc}{\contentsline {chapter}{\numberline {3}Analyse}{22}{chapter.3}}
\@writefile{lof}{\defcounter {refsection}{0}\relax }\@writefile{lof}{\addvspace {10\p@ }}
\@writefile{lot}{\defcounter {refsection}{0}\relax }\@writefile{lot}{\addvspace {10\p@ }}
\@writefile{lol}{\defcounter {refsection}{0}\relax }\@writefile{lol}{\addvspace {10\p@ }}
\newlabel{chap:analyse}{{3}{22}{Analyse}{chapter.3}{}}
\@writefile{toc}{\defcounter {refsection}{0}\relax }\@writefile{toc}{\contentsline {section}{\numberline {3.1}NeuroRace Projekt}{22}{section.3.1}}
\@writefile{toc}{\defcounter {refsection}{0}\relax }\@writefile{toc}{\contentsline {section}{\numberline {3.2}Simulation}{22}{section.3.2}}
\BKM@entry{id=18,dest={73656374696F6E2E332E33},srcline={10}}{42697368657269676520537465756572756E67}
\@writefile{toc}{\defcounter {refsection}{0}\relax }\@writefile{toc}{\contentsline {section}{\numberline {3.3}Bisherige Steuerung}{23}{section.3.3}}
\@writefile{lof}{\defcounter {refsection}{0}\relax }\@writefile{lof}{\contentsline {figure}{\numberline {\relax 3.1}{\ignorespaces Steuerung durch Einzelentscheidungen\relax }}{23}{figure.caption.15}}
\newlabel{img:anal_control_single}{{\relax 3.1}{23}{Steuerung durch Einzelentscheidungen\relax }{figure.caption.15}{}}
\BKM@entry{id=19,dest={73656374696F6E2E332E34},srcline={36}}{486561746D617073}
\abx@aux@segm{0}{0}{arXiv:end_to_end_udacity}
\BKM@entry{id=20,dest={73656374696F6E2E332E35},srcline={53}}{547261696E696E6773646174656E}
\@writefile{toc}{\defcounter {refsection}{0}\relax }\@writefile{toc}{\contentsline {section}{\numberline {3.4}Heatmaps}{25}{section.3.4}}
\@writefile{lof}{\defcounter {refsection}{0}\relax }\@writefile{lof}{\contentsline {figure}{\numberline {\relax 3.2}{\ignorespaces  Heatmap Beispiele\relax }}{25}{figure.caption.16}}
\newlabel{fig:heatSpeedSteer}{{\relax 3.2}{25}{Heatmap Beispiele\relax }{figure.caption.16}{}}
\@writefile{toc}{\defcounter {refsection}{0}\relax }\@writefile{toc}{\contentsline {section}{\numberline {3.5}Trainingsdaten}{26}{section.3.5}}
\@writefile{lof}{\defcounter {refsection}{0}\relax }\@writefile{lof}{\contentsline {figure}{\numberline {\relax 3.3}{\ignorespaces  Verteilung der Trainingsdaten\relax }}{26}{figure.caption.17}}
\newlabel{fig:speedSteerDist}{{\relax 3.3}{26}{Verteilung der Trainingsdaten\relax }{figure.caption.17}{}}
\BKM@entry{id=21,dest={636861707465722E34},srcline={1}}{4B6F6E7A657074696F6E}
\BKM@entry{id=22,dest={73656374696F6E2E342E31},srcline={7}}{537465756572756E672064657320466168727A65756773}
\abx@aux@segm{0}{0}{arXiv:end_to_end_udacity}
\abx@aux@segm{0}{0}{arXiv:end_to_end_udacity}
\abx@aux@segm{0}{0}{arXiv:end_to_end_udacity}
\@writefile{toc}{\defcounter {refsection}{0}\relax }\@writefile{toc}{\contentsline {chapter}{\numberline {4}Konzeption}{28}{chapter.4}}
\@writefile{lof}{\defcounter {refsection}{0}\relax }\@writefile{lof}{\addvspace {10\p@ }}
\@writefile{lot}{\defcounter {refsection}{0}\relax }\@writefile{lot}{\addvspace {10\p@ }}
\@writefile{lol}{\defcounter {refsection}{0}\relax }\@writefile{lol}{\addvspace {10\p@ }}
\newlabel{chap:conception}{{4}{28}{Konzeption}{chapter.4}{}}
\@writefile{toc}{\defcounter {refsection}{0}\relax }\@writefile{toc}{\contentsline {section}{\numberline {4.1}Steuerung des Fahrzeugs}{28}{section.4.1}}
\BKM@entry{id=23,dest={73656374696F6E2E342E32},srcline={16}}{547261696E696E6720646572206E6575726F6E616C656E204E65747A65}
\@writefile{toc}{\defcounter {refsection}{0}\relax }\@writefile{toc}{\contentsline {section}{\numberline {4.2}Training der neuronalen Netze}{29}{section.4.2}}
\BKM@entry{id=24,dest={73656374696F6E2E342E33},srcline={29}}{417263686974656B74757220646572206E6575726F6E616C656E204E65747A65}
\abx@aux@segm{0}{0}{arXiv:end_to_end_udacity}
\abx@aux@segm{0}{0}{arXiv:end_to_end_udacity}
\@writefile{toc}{\defcounter {refsection}{0}\relax }\@writefile{toc}{\contentsline {section}{\numberline {4.3}Architektur der neuronalen Netze}{30}{section.4.3}}
\@writefile{lof}{\defcounter {refsection}{0}\relax }\@writefile{lof}{\contentsline {figure}{\numberline {\relax 4.1}{\ignorespaces  Netzarchitektur des Geschwindigkeitsnetzes\relax }}{32}{figure.caption.18}}
\newlabel{fig:nnSpeed}{{\relax 4.1}{32}{Netzarchitektur des Geschwindigkeitsnetzes\relax }{figure.caption.18}{}}
\@writefile{lof}{\defcounter {refsection}{0}\relax }\@writefile{lof}{\contentsline {figure}{\numberline {\relax 4.2}{\ignorespaces  Netzarchitektur des Netzes welches beide Werte ausgibt\relax }}{33}{figure.caption.19}}
\newlabel{fig:nnBoth}{{\relax 4.2}{33}{Netzarchitektur des Netzes welches beide Werte ausgibt\relax }{figure.caption.19}{}}
\@writefile{lof}{\defcounter {refsection}{0}\relax }\@writefile{lof}{\contentsline {figure}{\numberline {\relax 4.3}{\ignorespaces  Netzarchitektur des Netzes welches beide Werte ausgibt mit separaten LSTM-Pfaden\relax }}{33}{figure.caption.20}}
\newlabel{fig:nnBothLstm}{{\relax 4.3}{33}{Netzarchitektur des Netzes welches beide Werte ausgibt mit separaten LSTM-Pfaden\relax }{figure.caption.20}{}}
\BKM@entry{id=25,dest={636861707465722E35},srcline={1}}{496D706C656D656E74696572756E67}
\abx@aux@segm{0}{0}{web:forschB}
\BKM@entry{id=26,dest={73656374696F6E2E352E31},srcline={6}}{486561746D6170}
\@writefile{toc}{\defcounter {refsection}{0}\relax }\@writefile{toc}{\contentsline {chapter}{\numberline {5}Implementierung}{35}{chapter.5}}
\@writefile{lof}{\defcounter {refsection}{0}\relax }\@writefile{lof}{\addvspace {10\p@ }}
\@writefile{lot}{\defcounter {refsection}{0}\relax }\@writefile{lot}{\addvspace {10\p@ }}
\@writefile{lol}{\defcounter {refsection}{0}\relax }\@writefile{lol}{\addvspace {10\p@ }}
\newlabel{cha:implmentation}{{5}{35}{Implementierung}{chapter.5}{}}
\@writefile{toc}{\defcounter {refsection}{0}\relax }\@writefile{toc}{\contentsline {section}{\numberline {5.1}Heatmap}{35}{section.5.1}}
\@writefile{lof}{\defcounter {refsection}{0}\relax }\@writefile{lof}{\contentsline {figure}{\numberline {\relax 5.1}{\ignorespaces Bitmask Batch f\IeC {\"u}r die Vektorisierung\relax }}{36}{figure.caption.21}}
\newlabel{fig:heatBitmask}{{\relax 5.1}{36}{Bitmask Batch für die Vektorisierung\relax }{figure.caption.21}{}}
\newlabel{lst:heatmap}{{5.1}{37}{Pseudocode Heatmap}{lstlisting.5.1}{}}
\@writefile{lol}{\defcounter {refsection}{0}\relax }\@writefile{lol}{\contentsline {lstlisting}{\numberline {5.1}Pseudocode Heatmap}{37}{lstlisting.5.1}}
\BKM@entry{id=27,dest={73656374696F6E2E352E32},srcline={103}}{5365636F6E642048616E64205465616368657220466F7263696E67}
\@writefile{toc}{\defcounter {refsection}{0}\relax }\@writefile{toc}{\contentsline {section}{\numberline {5.2}Second Hand Teacher Forcing}{38}{section.5.2}}
\newlabel{lst:teacherForcing}{{5.2}{39}{Pseudocode Teacher Forcing}{lstlisting.5.2}{}}
\@writefile{lol}{\defcounter {refsection}{0}\relax }\@writefile{lol}{\contentsline {lstlisting}{\numberline {5.2}Pseudocode Teacher Forcing}{39}{lstlisting.5.2}}
\BKM@entry{id=28,dest={636861707465722E36},srcline={1}}{54657374}
\BKM@entry{id=29,dest={73656374696F6E2E362E31},srcline={4}}{5465737473797374656D}
\gdef \LT@i {\LT@entry 
    {1}{87.81395pt}\LT@entry 
    {1}{187.40257pt}}
\BKM@entry{id=30,dest={73656374696F6E2E362E32},srcline={29}}{466168727465737473}
\@writefile{toc}{\defcounter {refsection}{0}\relax }\@writefile{toc}{\contentsline {chapter}{\numberline {6}Test}{40}{chapter.6}}
\@writefile{lof}{\defcounter {refsection}{0}\relax }\@writefile{lof}{\addvspace {10\p@ }}
\@writefile{lot}{\defcounter {refsection}{0}\relax }\@writefile{lot}{\addvspace {10\p@ }}
\@writefile{lol}{\defcounter {refsection}{0}\relax }\@writefile{lol}{\addvspace {10\p@ }}
\newlabel{chap:test}{{6}{40}{Test}{chapter.6}{}}
\@writefile{toc}{\defcounter {refsection}{0}\relax }\@writefile{toc}{\contentsline {section}{\numberline {6.1}Testsystem}{40}{section.6.1}}
\@writefile{lot}{\defcounter {refsection}{0}\relax }\@writefile{lot}{\contentsline {table}{\numberline {\relax 6.1}{\ignorespaces Hard- und Softwarekomponenten des Testsystems\relax }}{40}{table.6.1}}
\newlabel{tab:testsystem}{{\relax 6.1}{40}{Hard- und Softwarekomponenten des Testsystems\relax }{table.6.1}{}}
\@writefile{toc}{\defcounter {refsection}{0}\relax }\@writefile{toc}{\contentsline {section}{\numberline {6.2}Fahrtests}{40}{section.6.2}}
\BKM@entry{id=31,dest={636861707465722E37},srcline={1}}{4576616C756174696F6E}
\BKM@entry{id=32,dest={73656374696F6E2E372E31},srcline={39}}{476573636877696E6469676B656974736B6C6173736966697A696572756E67}
\abx@aux@segm{0}{0}{arXiv:end_to_end_udacity}
\BKM@entry{id=33,dest={73656374696F6E2E372E32},srcline={43}}{524E4E20537461746573}
\abx@aux@segm{0}{0}{arXiv:end_to_end_nvidia}
\abx@aux@segm{0}{0}{web:forschA}
\@writefile{toc}{\defcounter {refsection}{0}\relax }\@writefile{toc}{\contentsline {chapter}{\numberline {7}Evaluation}{42}{chapter.7}}
\@writefile{lof}{\defcounter {refsection}{0}\relax }\@writefile{lof}{\addvspace {10\p@ }}
\@writefile{lot}{\defcounter {refsection}{0}\relax }\@writefile{lot}{\addvspace {10\p@ }}
\@writefile{lol}{\defcounter {refsection}{0}\relax }\@writefile{lol}{\addvspace {10\p@ }}
\newlabel{chap:evaluation}{{7}{42}{Evaluation}{chapter.7}{}}
\@writefile{toc}{\defcounter {refsection}{0}\relax }\@writefile{toc}{\contentsline {section}{\numberline {7.1}Geschwindigkeitsklassifizierung}{42}{section.7.1}}
\@writefile{toc}{\defcounter {refsection}{0}\relax }\@writefile{toc}{\contentsline {section}{\numberline {7.2}RNN States}{43}{section.7.2}}
\@writefile{lot}{\defcounter {refsection}{0}\relax }\@writefile{lot}{\contentsline {table}{\numberline {\relax 7.1}{\ignorespaces State-Einfluss auf Ausgabe von neuronalem Netz zur Steuerung der Lenkung\relax }}{44}{table.caption.22}}
\newlabel{table:steerVal}{{\relax 7.1}{44}{State-Einfluss auf Ausgabe von neuronalem Netz zur Steuerung der Lenkung\relax }{table.caption.22}{}}
\@writefile{lot}{\defcounter {refsection}{0}\relax }\@writefile{lot}{\contentsline {table}{\numberline {\relax 7.2}{\ignorespaces State-Einfluss auf Ausgabe von neuronalem Netz zur Steuerung der Geschwindigkeit\relax }}{44}{table.caption.23}}
\newlabel{table:speedVal}{{\relax 7.2}{44}{State-Einfluss auf Ausgabe von neuronalem Netz zur Steuerung der Geschwindigkeit\relax }{table.caption.23}{}}
\BKM@entry{id=34,dest={73656374696F6E2E372E33},srcline={85}}{5365636F6E642048616E64205465616368657220466F7263696E67}
\BKM@entry{id=35,dest={73656374696F6E2E372E34},srcline={89}}{4F76657273616D706C696E67}
\abx@aux@cite{web:masteryResampleTime}
\abx@aux@segm{0}{0}{web:masteryResampleTime}
\@writefile{toc}{\defcounter {refsection}{0}\relax }\@writefile{toc}{\contentsline {section}{\numberline {7.3}Second Hand Teacher Forcing}{45}{section.7.3}}
\@writefile{toc}{\defcounter {refsection}{0}\relax }\@writefile{toc}{\contentsline {section}{\numberline {7.4}Oversampling}{45}{section.7.4}}
\BKM@entry{id=36,dest={73656374696F6E2E372E35},srcline={93}}{4175676D656E74696572756E67}
\BKM@entry{id=37,dest={73656374696F6E2E372E36},srcline={97}}{4E6575726F6E616C65204E65747A65}
\@writefile{toc}{\defcounter {refsection}{0}\relax }\@writefile{toc}{\contentsline {section}{\numberline {7.5}Augmentierung}{46}{section.7.5}}
\@writefile{toc}{\defcounter {refsection}{0}\relax }\@writefile{toc}{\contentsline {section}{\numberline {7.6}Neuronale Netze}{47}{section.7.6}}
\@writefile{lot}{\defcounter {refsection}{0}\relax }\@writefile{lot}{\contentsline {table}{\numberline {\relax 7.3}{\ignorespaces Einfluss der Eingabedaten auf Ausgabe von neuronalem Netz zur Steuerung der Lenkung\relax }}{47}{table.caption.24}}
\newlabel{table:steerValInput}{{\relax 7.3}{47}{Einfluss der Eingabedaten auf Ausgabe von neuronalem Netz zur Steuerung der Lenkung\relax }{table.caption.24}{}}
\BKM@entry{id=38,dest={73656374696F6E2E372E37},srcline={139}}{53657175656E7A6C5C3334346E676520756E64204672657175656E7A}
\@writefile{lot}{\defcounter {refsection}{0}\relax }\@writefile{lot}{\contentsline {table}{\numberline {\relax 7.4}{\ignorespaces Einfluss der Eingabedaten auf Ausgabe von neuronalem Netz zur Steuerung der Geschwindigkeit\relax }}{48}{table.caption.25}}
\newlabel{table:speedValInput}{{\relax 7.4}{48}{Einfluss der Eingabedaten auf Ausgabe von neuronalem Netz zur Steuerung der Geschwindigkeit\relax }{table.caption.25}{}}
\@writefile{toc}{\defcounter {refsection}{0}\relax }\@writefile{toc}{\contentsline {section}{\numberline {7.7}Sequenzl\IeC {\"a}nge und Frequenz}{48}{section.7.7}}
\BKM@entry{id=39,dest={73656374696F6E2E372E38},srcline={142}}{4261746368204C6561726E696E67}
\@writefile{toc}{\defcounter {refsection}{0}\relax }\@writefile{toc}{\contentsline {section}{\numberline {7.8}Batch Learning}{49}{section.7.8}}
\BKM@entry{id=40,dest={636861707465722E38},srcline={1}}{46617A6974}
\BKM@entry{id=41,dest={73656374696F6E2E382E31},srcline={2}}{5A7573616D6D656E66617373756E67}
\@writefile{toc}{\defcounter {refsection}{0}\relax }\@writefile{toc}{\contentsline {chapter}{\numberline {8}Fazit}{50}{chapter.8}}
\@writefile{lof}{\defcounter {refsection}{0}\relax }\@writefile{lof}{\addvspace {10\p@ }}
\@writefile{lot}{\defcounter {refsection}{0}\relax }\@writefile{lot}{\addvspace {10\p@ }}
\@writefile{lol}{\defcounter {refsection}{0}\relax }\@writefile{lol}{\addvspace {10\p@ }}
\@writefile{toc}{\defcounter {refsection}{0}\relax }\@writefile{toc}{\contentsline {section}{\numberline {8.1}Zusammenfassung}{50}{section.8.1}}
\BKM@entry{id=42,dest={73656374696F6E2E382E32},srcline={22}}{4B72697469736368657220525C333734636B626C69636B}
\BKM@entry{id=43,dest={73656374696F6E2E382E33},srcline={27}}{417573626C69636B}
\@writefile{toc}{\defcounter {refsection}{0}\relax }\@writefile{toc}{\contentsline {section}{\numberline {8.2}Kritischer R\IeC {\"u}ckblick}{52}{section.8.2}}
\@writefile{toc}{\defcounter {refsection}{0}\relax }\@writefile{toc}{\contentsline {section}{\numberline {8.3}Ausblick}{52}{section.8.3}}
\BKM@entry{id=44,dest={636861707465722A2E3236},srcline={63}}{416262696C64756E67737665727A656963686E6973}
\@writefile{toc}{\defcounter {refsection}{0}\relax }\@writefile{toc}{\contentsline {chapter}{\nonumberline Abbildungsverzeichnis}{54}{chapter*.26}}
\BKM@entry{id=45,dest={636861707465722A2E3237},srcline={65}}{546162656C6C656E7665727A656963686E6973}
\@writefile{toc}{\defcounter {refsection}{0}\relax }\@writefile{toc}{\contentsline {chapter}{\nonumberline Tabellenverzeichnis}{55}{chapter*.27}}
\BKM@entry{id=46,dest={636861707465722A2E3238},srcline={67}}{536F7572636520436F646520436F6E74656E74}
\@writefile{toc}{\defcounter {refsection}{0}\relax }\@writefile{toc}{\contentsline {chapter}{\nonumberline Source Code Content}{56}{chapter*.28}}
\BKM@entry{id=47,dest={636861707465722A2E3239},srcline={84}}{4C69746572617475727665727A656963686E6973}
\@writefile{toc}{\defcounter {refsection}{0}\relax }\@writefile{toc}{\contentsline {chapter}{\nonumberline Literaturverzeichnis}{57}{chapter*.29}}
\@writefile{lof}{\defcounter {refsection}{0}\relax }\@writefile{lof}{\addvspace {10\p@ }}
\@writefile{lot}{\defcounter {refsection}{0}\relax }\@writefile{lot}{\addvspace {10\p@ }}
\@writefile{lol}{\defcounter {refsection}{0}\relax }\@writefile{lol}{\addvspace {10\p@ }}
\BKM@entry{id=48,dest={636861707465722A2E3330},srcline={85}}{4F6E6C696E657265666572656E7A656E}
\@writefile{toc}{\defcounter {refsection}{0}\relax }\@writefile{toc}{\contentsline {chapter}{\nonumberline Onlinereferenzen}{58}{chapter*.30}}
\@writefile{lof}{\defcounter {refsection}{0}\relax }\@writefile{lof}{\addvspace {10\p@ }}
\@writefile{lot}{\defcounter {refsection}{0}\relax }\@writefile{lot}{\addvspace {10\p@ }}
\@writefile{lol}{\defcounter {refsection}{0}\relax }\@writefile{lol}{\addvspace {10\p@ }}
\BKM@entry{id=49,dest={636861707465722A2E3331},srcline={86}}{42696C647265666572656E7A656E}
\@writefile{toc}{\defcounter {refsection}{0}\relax }\@writefile{toc}{\contentsline {chapter}{\nonumberline Bildreferenzen}{59}{chapter*.31}}
\@writefile{lof}{\defcounter {refsection}{0}\relax }\@writefile{lof}{\addvspace {10\p@ }}
\@writefile{lot}{\defcounter {refsection}{0}\relax }\@writefile{lot}{\addvspace {10\p@ }}
\@writefile{lol}{\defcounter {refsection}{0}\relax }\@writefile{lol}{\addvspace {10\p@ }}
\BKM@entry{id=50,dest={636861707465722A2E3331},srcline={2}}{416E68616E67}
\BKM@entry{id=51,dest={73656374696F6E2E412E31},srcline={15}}{47617A65626F205465737473747265636B65}
\@writefile{toc}{\defcounter {refsection}{0}\relax }\@writefile{toc}{\contentsline {chapter}{Anhang}{60}{chapter*.31}}
\@writefile{lof}{\defcounter {refsection}{0}\relax }\@writefile{lof}{\addvspace {10\p@ }}
\@writefile{lot}{\defcounter {refsection}{0}\relax }\@writefile{lot}{\addvspace {10\p@ }}
\@writefile{lol}{\defcounter {refsection}{0}\relax }\@writefile{lol}{\addvspace {10\p@ }}
\@writefile{toc}{\defcounter {refsection}{0}\relax }\@writefile{toc}{\contentsline {section}{\numberline {A.1}Gazebo Teststrecke}{60}{section.A.1}}
\newlabel{anhang:a1}{{A.1}{60}{Gazebo Teststrecke}{section.A.1}{}}
\newlabel{img:gazebo_track}{{\caption@xref {img:gazebo_track}{ on input line 20}}{60}{Gazebo Teststrecke}{figure.caption.33}{}}
\BKM@entry{id=52,dest={636861707465722A2E3334},srcline={1}}{456967656E73745C3334346E6469676B6569747365726B6C5C33343472756E67}
\abx@aux@refcontextdefaultsdone
\abx@aux@defaultrefcontext{0}{arXiv:end_to_end_nvidia}{anyt/global//global/global}
\abx@aux@defaultrefcontext{0}{arXiv:interpretable_learning}{anyt/global//global/global}
\abx@aux@defaultrefcontext{0}{lamb2016professor}{anyt/global//global/global}
\abx@aux@defaultrefcontext{0}{DBLP:journals/corr/SantanaH16}{anyt/global//global/global}
\abx@aux@defaultrefcontext{0}{DBLP:journals/corr/XuGYD16}{anyt/global//global/global}
\abx@aux@defaultrefcontext{0}{arXiv:end_to_end_vid_data}{anyt/global//global/global}
\abx@aux@defaultrefcontext{0}{arXiv:end_to_end_udacity}{anyt/global//global/global}
\abx@aux@defaultrefcontext{0}{DBLP:journals/corr/ZeilerF13}{anyt/global//global/global}
\abx@aux@defaultrefcontext{0}{1549828}{anyt/global//global/global}
\abx@aux@defaultrefcontext{0}{web:masteryTeacher}{anyt/global//global/global}
\abx@aux@defaultrefcontext{0}{web:masteryResampleTime}{anyt/global//global/global}
\abx@aux@defaultrefcontext{0}{web:cs231n}{anyt/global//global/global}
\abx@aux@defaultrefcontext{0}{web:neuroRace:Git}{anyt/global//global/global}
\abx@aux@defaultrefcontext{0}{web:gazebo}{anyt/global//global/global}
\abx@aux@defaultrefcontext{0}{web:keras}{anyt/global//global/global}
\abx@aux@defaultrefcontext{0}{web:forschA}{anyt/global//global/global}
\abx@aux@defaultrefcontext{0}{web:forschB}{anyt/global//global/global}
\abx@aux@defaultrefcontext{0}{web:icw1}{anyt/global//global/global}
\abx@aux@defaultrefcontext{0}{web:icw2}{anyt/global//global/global}
\abx@aux@defaultrefcontext{0}{web:mitGazebo}{anyt/global//global/global}
\abx@aux@defaultrefcontext{0}{img:same_padding_no_strides}{anyt/global//global/global}
\@writefile{toc}{\defcounter {refsection}{0}\relax }\@writefile{toc}{\contentsline {chapter}{\nonumberline Eigenst\IeC {\"a}ndigkeitserkl\IeC {\"a}rung}{61}{chapter*.34}}
\@writefile{lof}{\defcounter {refsection}{0}\relax }\@writefile{lof}{\addvspace {10\p@ }}
\@writefile{lot}{\defcounter {refsection}{0}\relax }\@writefile{lot}{\addvspace {10\p@ }}
\@writefile{lol}{\defcounter {refsection}{0}\relax }\@writefile{lol}{\addvspace {10\p@ }}
\global\csname @altsecnumformattrue\endcsname
\global\@namedef{scr@dte@chapter@lastmaxnumwidth}{12.14992pt}
\global\@namedef{scr@dte@section@lastmaxnumwidth}{22.64684pt}
\global\@namedef{scr@dte@table@lastmaxnumwidth}{19.71382pt}
\global\@namedef{scr@dte@figure@lastmaxnumwidth}{25.5888pt}
