\relax 
\providecommand\hyper@newdestlabel[2]{}
\catcode `"\active 
\AC@reset@newl@bel
\providecommand\HyperFirstAtBeginDocument{\AtBeginDocument}
\HyperFirstAtBeginDocument{\ifx\hyper@anchor\@undefined
\global\let\oldcontentsline\contentsline
\gdef\contentsline#1#2#3#4{\oldcontentsline{#1}{#2}{#3}}
\global\let\oldnewlabel\newlabel
\gdef\newlabel#1#2{\newlabelxx{#1}#2}
\gdef\newlabelxx#1#2#3#4#5#6{\oldnewlabel{#1}{{#2}{#3}}}
\AtEndDocument{\ifx\hyper@anchor\@undefined
\let\contentsline\oldcontentsline
\let\newlabel\oldnewlabel
\fi}
\fi}
\global\let\hyper@last\relax 
\gdef\HyperFirstAtBeginDocument#1{#1}
\providecommand\HyField@AuxAddToFields[1]{}
\providecommand\HyField@AuxAddToCoFields[2]{}
\abx@aux@refcontext{anyt/global//global/global}
\abx@aux@cite{neuroRace:Git}
\abx@aux@segm{0}{0}{neuroRace:Git}
\abx@aux@cite{udacity:Git}
\abx@aux@segm{0}{0}{udacity:Git}
\abx@aux@cite{arXiv:end_to_end_udacity}
\abx@aux@segm{0}{0}{arXiv:end_to_end_udacity}
\abx@aux@cite{arXiv:interpretable_learning}
\abx@aux@segm{0}{0}{arXiv:interpretable_learning}
\abx@aux@cite{arXiv:end_to_end_nvidia}
\abx@aux@segm{0}{0}{arXiv:end_to_end_nvidia}
\abx@aux@cite{arXiv:end_to_end_vid_data}
\abx@aux@segm{0}{0}{arXiv:end_to_end_vid_data}
\@writefile{toc}{\boolfalse {citerequest}\boolfalse {citetracker}\boolfalse {pagetracker}\boolfalse {backtracker}\relax }
\@writefile{lof}{\boolfalse {citerequest}\boolfalse {citetracker}\boolfalse {pagetracker}\boolfalse {backtracker}\relax }
\@writefile{lot}{\boolfalse {citerequest}\boolfalse {citetracker}\boolfalse {pagetracker}\boolfalse {backtracker}\relax }
\babel@aux{ngerman}{}
\babel@aux{ngerman}{}
\babel@aux{ngerman}{}
\@writefile{toc}{\defcounter {refsection}{0}\relax }\@writefile{toc}{\contentsline {section}{\numberline {1}Motivation}{1}{section.1}}
\abx@aux@segm{0}{0}{udacity:Git}
\abx@aux@cite{ros}
\abx@aux@segm{0}{0}{ros}
\@writefile{toc}{\defcounter {refsection}{0}\relax }\@writefile{toc}{\contentsline {section}{\numberline {2}Zielsetzung}{2}{section.2}}
\abx@aux@segm{0}{0}{arXiv:end_to_end_udacity}
\abx@aux@segm{0}{0}{arXiv:interpretable_learning}
\abx@aux@segm{0}{0}{arXiv:end_to_end_nvidia}
\@writefile{toc}{\defcounter {refsection}{0}\relax }\@writefile{toc}{\contentsline {section}{\numberline {3}Vorgehen}{3}{section.3}}
\@writefile{toc}{\defcounter {refsection}{0}\relax }\@writefile{toc}{\contentsline {section}{\numberline {4}Erfordernisse und Randbedingungen}{3}{section.4}}
\@writefile{toc}{\defcounter {refsection}{0}\relax }\@writefile{toc}{\contentsline {section}{\numberline {5}Zeitplan}{4}{section.5}}
\@writefile{lof}{\defcounter {refsection}{0}\relax }\@writefile{lof}{\contentsline {figure}{\numberline {1}{\ignorespaces Zeitplan}}{4}{figure.caption.1}}
\@writefile{toc}{\defcounter {refsection}{0}\relax }\@writefile{toc}{\contentsline {section}{\numberline {6}Erwartete Ergebnisse}{4}{section.6}}
\abx@aux@refcontextdefaultsdone
\abx@aux@defaultrefcontext{0}{arXiv:end_to_end_nvidia}{anyt/global//global/global}
\abx@aux@defaultrefcontext{0}{neuroRace:Git}{anyt/global//global/global}
\abx@aux@defaultrefcontext{0}{udacity:Git}{anyt/global//global/global}
\abx@aux@defaultrefcontext{0}{arXiv:interpretable_learning}{anyt/global//global/global}
\abx@aux@defaultrefcontext{0}{ros}{anyt/global//global/global}
\abx@aux@defaultrefcontext{0}{arXiv:end_to_end_vid_data}{anyt/global//global/global}
\abx@aux@defaultrefcontext{0}{arXiv:end_to_end_udacity}{anyt/global//global/global}
\@writefile{toc}{\defcounter {refsection}{0}\relax }\@writefile{toc}{\contentsline {section}{\numberline {7}Vorl\IeC {\"a}ufige Gliederung}{5}{section.7}}
\@writefile{toc}{\defcounter {refsection}{0}\relax }\@writefile{toc}{\contentsline {section}{Literaturangaben}{5}{section*.2}}
