[0] Config.pm:302> INFO - This is Biber 2.11
[0] Config.pm:305> INFO - Logfile is 'main.blg'
[26] biber-MSWIN64:313> INFO - === 
[53] Biber.pm:371> INFO - Reading 'main.bcf'
[133] Biber.pm:857> INFO - Found 21 citekeys in bib section 0
[147] Biber.pm:3976> INFO - Processing section 0
[158] Biber.pm:4136> INFO - Looking for bibtex format file 'references/references.bib' for section 0
[174] bibtex.pm:1500> INFO - LaTeX decoding ...
[208] bibtex.pm:1316> INFO - Found BibTeX data source 'references/references.bib'
[210] Utils.pm:193> WARN - Duplicate entry key: 'DBLP:journals/corr/ZeilerF13' in file 'references/references.bib', skipping ...
[339] UCollate.pm:68> INFO - Overriding locale 'de-DE' defaults 'variable = shifted' with 'variable = non-ignorable'
[339] UCollate.pm:68> INFO - Overriding locale 'de-DE' defaults 'normalization = NFD' with 'normalization = prenormalized'
[339] Biber.pm:3804> INFO - Sorting list 'anyt/global//global/global' of type 'entry' with template 'anyt' and locale 'de-DE'
[340] Biber.pm:3810> INFO - No sort tailoring available for locale 'de-DE'
[363] bbl.pm:617> INFO - Writing 'main.bbl' with encoding 'UTF-8'
[371] bbl.pm:720> INFO - Output to main.bbl
[376] Biber.pm:110> INFO - WARNINGS: 1
