\relax 
\providecommand\hyper@newdestlabel[2]{}
\providecommand*\new@tpo@label[2]{}
\catcode `"\active 
\AC@reset@newl@bel
\providecommand\HyperFirstAtBeginDocument{\AtBeginDocument}
\HyperFirstAtBeginDocument{\ifx\hyper@anchor\@undefined
\global\let\oldcontentsline\contentsline
\gdef\contentsline#1#2#3#4{\oldcontentsline{#1}{#2}{#3}}
\global\let\oldnewlabel\newlabel
\gdef\newlabel#1#2{\newlabelxx{#1}#2}
\gdef\newlabelxx#1#2#3#4#5#6{\oldnewlabel{#1}{{#2}{#3}}}
\AtEndDocument{\ifx\hyper@anchor\@undefined
\let\contentsline\oldcontentsline
\let\newlabel\oldnewlabel
\fi}
\fi}
\global\let\hyper@last\relax 
\gdef\HyperFirstAtBeginDocument#1{#1}
\providecommand\HyField@AuxAddToFields[1]{}
\providecommand\HyField@AuxAddToCoFields[2]{}
\providecommand\BKM@entry[2]{}
\abx@aux@refcontext{anyt/global//global/global}
\@writefile{toc}{\boolfalse {citerequest}\boolfalse {citetracker}\boolfalse {pagetracker}\boolfalse {backtracker}\relax }
\@writefile{lof}{\boolfalse {citerequest}\boolfalse {citetracker}\boolfalse {pagetracker}\boolfalse {backtracker}\relax }
\@writefile{lot}{\boolfalse {citerequest}\boolfalse {citetracker}\boolfalse {pagetracker}\boolfalse {backtracker}\relax }
\babel@aux{ngerman}{}
\providecommand\@gls@reference[3]{}
\@input{chapter/Abstract.aux}
\abx@aux@cite{neuroRace:Git}
\abx@aux@segm{0}{0}{neuroRace:Git}
\BKM@entry{id=1,dest={636861707465722E31},srcline={1}}{45696E6C656974756E67}
\BKM@entry{id=2,dest={73656374696F6E2E312E31},srcline={3}}{4D6F7469766174696F6E}
\BKM@entry{id=3,dest={73656374696F6E2E312E32},srcline={6}}{5A69656C7365747A756E67}
\BKM@entry{id=4,dest={73656374696F6E2E312E33},srcline={9}}{566F72676568656E73776569736520756E64204175666261752064657220417262656974}
\abx@aux@cite{rnn:2015}
\abx@aux@segm{0}{0}{rnn:2015}
\abx@aux@cite{arXiv:EtEDrivingVD}
\abx@aux@segm{0}{0}{arXiv:EtEDrivingVD}
\abx@aux@cite{DBLP:journals/corr/abs-1801-06734}
\abx@aux@segm{0}{0}{DBLP:journals/corr/abs-1801-06734}
\@writefile{toc}{\defcounter {refsection}{0}\relax }\@writefile{toc}{\contentsline {chapter}{\numberline {1}Einleitung}{1}{chapter.1}}
\@writefile{lof}{\defcounter {refsection}{0}\relax }\@writefile{lof}{\addvspace {10\p@ }}
\@writefile{lot}{\defcounter {refsection}{0}\relax }\@writefile{lot}{\addvspace {10\p@ }}
\@writefile{lol}{\defcounter {refsection}{0}\relax }\@writefile{lol}{\addvspace {10\p@ }}
\@writefile{toc}{\defcounter {refsection}{0}\relax }\@writefile{toc}{\contentsline {section}{\numberline {1.1}Motivation}{1}{section.1.1}}
\@writefile{toc}{\defcounter {refsection}{0}\relax }\@writefile{toc}{\contentsline {section}{\numberline {1.2}Zielsetzung}{1}{section.1.2}}
\@writefile{toc}{\defcounter {refsection}{0}\relax }\@writefile{toc}{\contentsline {section}{\numberline {1.3}Vorgehensweise und Aufbau der Arbeit}{2}{section.1.3}}
\BKM@entry{id=5,dest={636861707465722E32},srcline={1}}{4772756E646C6167656E}
\@writefile{toc}{\defcounter {refsection}{0}\relax }\@writefile{toc}{\contentsline {chapter}{\numberline {2}Grundlagen}{3}{chapter.2}}
\@writefile{lof}{\defcounter {refsection}{0}\relax }\@writefile{lof}{\addvspace {10\p@ }}
\@writefile{lot}{\defcounter {refsection}{0}\relax }\@writefile{lot}{\addvspace {10\p@ }}
\@writefile{lol}{\defcounter {refsection}{0}\relax }\@writefile{lol}{\addvspace {10\p@ }}
\BKM@entry{id=6,dest={636861707465722E33},srcline={1}}{416E616C797365}
\BKM@entry{id=7,dest={73656374696F6E2E332E31},srcline={4}}{4E6575726F526163652050726F6A656B74}
\BKM@entry{id=8,dest={73656374696F6E2E332E32},srcline={14}}{42697368657269676520456E74736368656964756E677366696E64756E67}
\@writefile{toc}{\defcounter {refsection}{0}\relax }\@writefile{toc}{\contentsline {chapter}{\numberline {3}Analyse}{4}{chapter.3}}
\@writefile{lof}{\defcounter {refsection}{0}\relax }\@writefile{lof}{\addvspace {10\p@ }}
\@writefile{lot}{\defcounter {refsection}{0}\relax }\@writefile{lot}{\addvspace {10\p@ }}
\@writefile{lol}{\defcounter {refsection}{0}\relax }\@writefile{lol}{\addvspace {10\p@ }}
\newlabel{chap:analyse}{{3}{4}{Analyse}{chapter.3}{}}
\@writefile{toc}{\defcounter {refsection}{0}\relax }\@writefile{toc}{\contentsline {section}{\numberline {3.1}NeuroRace Projekt}{4}{section.3.1}}
\@writefile{lof}{\defcounter {refsection}{0}\relax }\@writefile{lof}{\contentsline {figure}{\numberline {\relax 3.1}{\ignorespaces Steuerung durch Einzelentscheidungen\relax }}{4}{figure.caption.4}}
\providecommand*\caption@xref[2]{\@setref\relax\@undefined{#1}}
\newlabel{img:anal_control_single}{{\relax 3.1}{4}{Steuerung durch Einzelentscheidungen\relax }{figure.caption.4}{}}
\@writefile{toc}{\defcounter {refsection}{0}\relax }\@writefile{toc}{\contentsline {section}{\numberline {3.2}Bisherige Entscheidungsfindung}{5}{section.3.2}}
\BKM@entry{id=9,dest={636861707465722E34},srcline={1}}{4B6F6E7A657074696F6E}
\BKM@entry{id=10,dest={73656374696F6E2E342E31},srcline={7}}{496D706C656D656E74696572756E67}
\@writefile{toc}{\defcounter {refsection}{0}\relax }\@writefile{toc}{\contentsline {chapter}{\numberline {4}Konzeption}{6}{chapter.4}}
\@writefile{lof}{\defcounter {refsection}{0}\relax }\@writefile{lof}{\addvspace {10\p@ }}
\@writefile{lot}{\defcounter {refsection}{0}\relax }\@writefile{lot}{\addvspace {10\p@ }}
\@writefile{lol}{\defcounter {refsection}{0}\relax }\@writefile{lol}{\addvspace {10\p@ }}
\newlabel{chap:conception}{{4}{6}{Konzeption}{chapter.4}{}}
\@writefile{toc}{\defcounter {refsection}{0}\relax }\@writefile{toc}{\contentsline {section}{\numberline {4.1}Implementierung}{6}{section.4.1}}
\@writefile{lof}{\defcounter {refsection}{0}\relax }\@writefile{lof}{\contentsline {figure}{\numberline {\relax 4.1}{\ignorespaces Konzept des RNN-Datengenerators\relax }}{6}{figure.caption.5}}
\newlabel{img:rnn_generator_concept}{{\relax 4.1}{6}{Konzept des RNN-Datengenerators\relax }{figure.caption.5}{}}
\BKM@entry{id=11,dest={73656374696F6E2E342E32},srcline={24}}{526563757272656E74204E657572616C204E6574776F726B}
\@writefile{toc}{\defcounter {refsection}{0}\relax }\@writefile{toc}{\contentsline {section}{\numberline {4.2}Recurrent Neural Network}{7}{section.4.2}}
\@writefile{lof}{\defcounter {refsection}{0}\relax }\@writefile{lof}{\contentsline {figure}{\numberline {\relax 4.2}{\ignorespaces Entscheidungsfindung auf Basis von RNNs\relax }}{7}{figure.caption.6}}
\newlabel{img:entscheidung_rnn_concept}{{\relax 4.2}{7}{Entscheidungsfindung auf Basis von RNNs\relax }{figure.caption.6}{}}
\abx@aux@cite{DBLP:journals/corr/ShiBY15}
\abx@aux@segm{0}{0}{DBLP:journals/corr/ShiBY15}
\@writefile{lof}{\defcounter {refsection}{0}\relax }\@writefile{lof}{\contentsline {figure}{\numberline {\relax 4.3}{\ignorespaces Konzept der RNN-Ausgabe\relax }}{9}{figure.caption.7}}
\newlabel{img:rnn_output_concept}{{\relax 4.3}{9}{Konzept der RNN-Ausgabe\relax }{figure.caption.7}{}}
\@writefile{lof}{\defcounter {refsection}{0}\relax }\@writefile{lof}{\contentsline {figure}{\numberline {\relax 4.4}{\ignorespaces Konzept des RNN-Aufbaus\relax }}{10}{figure.caption.8}}
\newlabel{img:rnn_concept}{{\relax 4.4}{10}{Konzept des RNN-Aufbaus\relax }{figure.caption.8}{}}
\BKM@entry{id=12,dest={636861707465722E35},srcline={1}}{496D706C656D656E74696572756E67}
\BKM@entry{id=13,dest={73656374696F6E2E352E31},srcline={5}}{416E70617373756E67656E206465722059414D4C2D4B6F6E66696775726174696F6E736461746569}
\BKM@entry{id=14,dest={73656374696F6E2E352E32},srcline={20}}{5175656C6C636F6465616E70617373756E67656E206E6575726F72616365722D6169}
\@writefile{toc}{\defcounter {refsection}{0}\relax }\@writefile{toc}{\contentsline {chapter}{\numberline {5}Implementierung}{11}{chapter.5}}
\@writefile{lof}{\defcounter {refsection}{0}\relax }\@writefile{lof}{\addvspace {10\p@ }}
\@writefile{lot}{\defcounter {refsection}{0}\relax }\@writefile{lot}{\addvspace {10\p@ }}
\@writefile{lol}{\defcounter {refsection}{0}\relax }\@writefile{lol}{\addvspace {10\p@ }}
\newlabel{cha:implmentation}{{5}{11}{Implementierung}{chapter.5}{}}
\@writefile{toc}{\defcounter {refsection}{0}\relax }\@writefile{toc}{\contentsline {section}{\numberline {5.1}Anpassungen der YAML-Konfigurationsdatei}{11}{section.5.1}}
\newlabel{lst:yaml-backend-config}{{5.1}{11}{YAML-Konfigurationsdatei mit neuen Backend-Parameter}{lstlisting.5.1}{}}
\@writefile{lol}{\defcounter {refsection}{0}\relax }\@writefile{lol}{\contentsline {lstlisting}{\numberline {5.1}YAML-Konfigurationsdatei mit neuen Backend-Parameter}{11}{lstlisting.5.1}}
\@writefile{toc}{\defcounter {refsection}{0}\relax }\@writefile{toc}{\contentsline {section}{\numberline {5.2}Quellcodeanpassungen neuroracer-ai}{12}{section.5.2}}
\@writefile{lof}{\defcounter {refsection}{0}\relax }\@writefile{lof}{\contentsline {figure}{\numberline {\relax 5.1}{\ignorespaces Klassendiagramm KerasBaseModelRNN\relax }}{12}{figure.caption.9}}
\newlabel{img:class_dig_kerasBaseModelRNN}{{\relax 5.1}{12}{Klassendiagramm KerasBaseModelRNN\relax }{figure.caption.9}{}}
\@writefile{lof}{\defcounter {refsection}{0}\relax }\@writefile{lof}{\contentsline {figure}{\numberline {\relax 5.2}{\ignorespaces RNN Eingabesequenz Deque-Beispiel\relax }}{12}{figure.caption.10}}
\newlabel{img:deque_example}{{\relax 5.2}{12}{RNN Eingabesequenz Deque-Beispiel\relax }{figure.caption.10}{}}
\BKM@entry{id=15,dest={73656374696F6E2E352E33},srcline={44}}{5175656C6C636F6465616E70617373756E67656E206E6575726F72616365722D61692D736C}
\@writefile{toc}{\defcounter {refsection}{0}\relax }\@writefile{toc}{\contentsline {section}{\numberline {5.3}Quellcodeanpassungen neuroracer-ai-sl}{13}{section.5.3}}
\BKM@entry{id=16,dest={73656374696F6E2E352E34},srcline={61}}{526563757272656E74204E657572616C204E6574776F726B}
\abx@aux@segm{0}{0}{DBLP:journals/corr/abs-1801-06734}
\abx@aux@cite{DBLP:journals/corr/IoffeS15}
\abx@aux@segm{0}{0}{DBLP:journals/corr/IoffeS15}
\@writefile{lof}{\defcounter {refsection}{0}\relax }\@writefile{lof}{\contentsline {figure}{\numberline {\relax 5.3}{\ignorespaces Klassendiagramm KerasModelSLRNN und KerasSequenceRNN\relax }}{14}{figure.caption.11}}
\newlabel{img:class_dig_kerasModelRNN_kerasSeqRNN}{{\relax 5.3}{14}{Klassendiagramm KerasModelSLRNN und KerasSequenceRNN\relax }{figure.caption.11}{}}
\@writefile{toc}{\defcounter {refsection}{0}\relax }\@writefile{toc}{\contentsline {section}{\numberline {5.4}Recurrent Neural Network}{14}{section.5.4}}
\abx@aux@segm{0}{0}{DBLP:journals/corr/abs-1801-06734}
\@writefile{lof}{\defcounter {refsection}{0}\relax }\@writefile{lof}{\contentsline {figure}{\numberline {\relax 5.4}{\ignorespaces RNN mit LSTM-Zelle\relax }}{15}{figure.caption.12}}
\newlabel{img:rnn_w_lstm}{{\relax 5.4}{15}{RNN mit LSTM-Zelle\relax }{figure.caption.12}{}}
\@writefile{lof}{\defcounter {refsection}{0}\relax }\@writefile{lof}{\contentsline {figure}{\numberline {\relax 5.5}{\ignorespaces CNN-Architektur zum Vergleich\relax }}{15}{figure.caption.13}}
\newlabel{img:cnn_for_tests}{{\relax 5.5}{15}{CNN-Architektur zum Vergleich\relax }{figure.caption.13}{}}
\BKM@entry{id=17,dest={636861707465722E36},srcline={1}}{54657374}
\BKM@entry{id=18,dest={73656374696F6E2E362E31},srcline={4}}{5465737473797374656D}
\gdef \LT@i {\LT@entry 
    {1}{87.81395pt}\LT@entry 
    {1}{187.40257pt}}
\BKM@entry{id=19,dest={73656374696F6E2E362E32},srcline={25}}{466168727465737473}
\@writefile{toc}{\defcounter {refsection}{0}\relax }\@writefile{toc}{\contentsline {chapter}{\numberline {6}Test}{16}{chapter.6}}
\@writefile{lof}{\defcounter {refsection}{0}\relax }\@writefile{lof}{\addvspace {10\p@ }}
\@writefile{lot}{\defcounter {refsection}{0}\relax }\@writefile{lot}{\addvspace {10\p@ }}
\@writefile{lol}{\defcounter {refsection}{0}\relax }\@writefile{lol}{\addvspace {10\p@ }}
\newlabel{chap:test}{{6}{16}{Test}{chapter.6}{}}
\@writefile{toc}{\defcounter {refsection}{0}\relax }\@writefile{toc}{\contentsline {section}{\numberline {6.1}Testsystem}{16}{section.6.1}}
\@writefile{lot}{\defcounter {refsection}{0}\relax }\@writefile{lot}{\contentsline {table}{\numberline {\relax 6.1}{\ignorespaces Hard- und Softwarekomponenten des Testsystems\relax }}{16}{table.6.1}}
\newlabel{tab:testsystem}{{\relax 6.1}{16}{Hard- und Softwarekomponenten des Testsystems\relax }{table.6.1}{}}
\@writefile{toc}{\defcounter {refsection}{0}\relax }\@writefile{toc}{\contentsline {section}{\numberline {6.2}Fahrtests}{16}{section.6.2}}
\BKM@entry{id=20,dest={636861707465722E37},srcline={1}}{4576616C756174696F6E}
\BKM@entry{id=21,dest={73656374696F6E2E372E31},srcline={4}}{446174656E}
\gdef \LT@ii {\LT@entry 
    {1}{104.903pt}\LT@entry 
    {1}{76.85982pt}}
\BKM@entry{id=22,dest={73656374696F6E2E372E32},srcline={21}}{506172616D65746572616E7A61686C}
\abx@aux@cite{DBLP:journals/corr/BojarskiTDFFGJM16}
\abx@aux@segm{0}{0}{DBLP:journals/corr/BojarskiTDFFGJM16}
\@writefile{toc}{\defcounter {refsection}{0}\relax }\@writefile{toc}{\contentsline {chapter}{\numberline {7}Evaluation}{18}{chapter.7}}
\@writefile{lof}{\defcounter {refsection}{0}\relax }\@writefile{lof}{\addvspace {10\p@ }}
\@writefile{lot}{\defcounter {refsection}{0}\relax }\@writefile{lot}{\addvspace {10\p@ }}
\@writefile{lol}{\defcounter {refsection}{0}\relax }\@writefile{lol}{\addvspace {10\p@ }}
\newlabel{chap:evaluation}{{7}{18}{Evaluation}{chapter.7}{}}
\@writefile{toc}{\defcounter {refsection}{0}\relax }\@writefile{toc}{\contentsline {section}{\numberline {7.1}Daten}{18}{section.7.1}}
\@writefile{lot}{\defcounter {refsection}{0}\relax }\@writefile{lot}{\contentsline {table}{\numberline {\relax 7.1}{\ignorespaces Verwendete Anzahl an Daten\relax }}{18}{table.7.1}}
\newlabel{tab:data_count}{{\relax 7.1}{18}{Verwendete Anzahl an Daten\relax }{table.7.1}{}}
\BKM@entry{id=23,dest={73656374696F6E2E372E33},srcline={28}}{53657175656E7A6C5C3334346E6765}
\@writefile{toc}{\defcounter {refsection}{0}\relax }\@writefile{toc}{\contentsline {section}{\numberline {7.2}Parameteranzahl}{19}{section.7.2}}
\@writefile{toc}{\defcounter {refsection}{0}\relax }\@writefile{toc}{\contentsline {section}{\numberline {7.3}Sequenzl\IeC {\"a}nge}{19}{section.7.3}}
\@writefile{lof}{\defcounter {refsection}{0}\relax }\@writefile{lof}{\contentsline {figure}{\numberline {\relax 7.1}{\ignorespaces Berechnungen pro Sekunde mit LSTM \IeC {\"u}ber verschiedene Sequenzl\IeC {\"a}ngen\relax }}{20}{figure.caption.14}}
\newlabel{img:dig_lstm_hz}{{\relax 7.1}{20}{Berechnungen pro Sekunde mit LSTM über verschiedene Sequenzlängen\relax }{figure.caption.14}{}}
\BKM@entry{id=24,dest={73656374696F6E2E372E34},srcline={44}}{434E4E204B65726E656C}
\abx@aux@segm{0}{0}{DBLP:journals/corr/abs-1801-06734}
\BKM@entry{id=25,dest={73656374696F6E2E372E35},srcline={47}}{4175676D656E74696572756E67}
\@writefile{toc}{\defcounter {refsection}{0}\relax }\@writefile{toc}{\contentsline {section}{\numberline {7.4}CNN Kernel}{21}{section.7.4}}
\@writefile{toc}{\defcounter {refsection}{0}\relax }\@writefile{toc}{\contentsline {section}{\numberline {7.5}Augmentierung}{21}{section.7.5}}
\BKM@entry{id=26,dest={73656374696F6E2E372E36},srcline={52}}{524E4E2076732E20434E4E}
\abx@aux@cite{DBLP:journals/corr/GreffSKSS15}
\abx@aux@segm{0}{0}{DBLP:journals/corr/GreffSKSS15}
\@writefile{toc}{\defcounter {refsection}{0}\relax }\@writefile{toc}{\contentsline {section}{\numberline {7.6}RNN vs. CNN}{22}{section.7.6}}
\BKM@entry{id=27,dest={636861707465722E38},srcline={1}}{46617A6974}
\BKM@entry{id=28,dest={73656374696F6E2E382E31},srcline={2}}{5A7573616D6D656E66617373756E67}
\BKM@entry{id=29,dest={73656374696F6E2E382E32},srcline={5}}{4B72697469736368657220525C333734636B626C69636B}
\@writefile{toc}{\defcounter {refsection}{0}\relax }\@writefile{toc}{\contentsline {chapter}{\numberline {8}Fazit}{23}{chapter.8}}
\@writefile{lof}{\defcounter {refsection}{0}\relax }\@writefile{lof}{\addvspace {10\p@ }}
\@writefile{lot}{\defcounter {refsection}{0}\relax }\@writefile{lot}{\addvspace {10\p@ }}
\@writefile{lol}{\defcounter {refsection}{0}\relax }\@writefile{lol}{\addvspace {10\p@ }}
\@writefile{toc}{\defcounter {refsection}{0}\relax }\@writefile{toc}{\contentsline {section}{\numberline {8.1}Zusammenfassung}{23}{section.8.1}}
\@writefile{toc}{\defcounter {refsection}{0}\relax }\@writefile{toc}{\contentsline {section}{\numberline {8.2}Kritischer R\IeC {\"u}ckblick}{23}{section.8.2}}
\BKM@entry{id=30,dest={73656374696F6E2E382E33},srcline={12}}{417573626C69636B}
\abx@aux@segm{0}{0}{DBLP:journals/corr/abs-1801-06734}
\@writefile{toc}{\defcounter {refsection}{0}\relax }\@writefile{toc}{\contentsline {section}{\numberline {8.3}Ausblick}{24}{section.8.3}}
\BKM@entry{id=31,dest={636861707465722A2E3135},srcline={63}}{416262696C64756E67737665727A656963686E6973}
\@writefile{toc}{\defcounter {refsection}{0}\relax }\@writefile{toc}{\contentsline {chapter}{\nonumberline Abbildungsverzeichnis}{26}{chapter*.15}}
\BKM@entry{id=32,dest={636861707465722A2E3136},srcline={65}}{546162656C6C656E7665727A656963686E6973}
\@writefile{toc}{\defcounter {refsection}{0}\relax }\@writefile{toc}{\contentsline {chapter}{\nonumberline Tabellenverzeichnis}{27}{chapter*.16}}
\BKM@entry{id=33,dest={636861707465722A2E3137},srcline={67}}{536F7572636520436F646520436F6E74656E74}
\@writefile{toc}{\defcounter {refsection}{0}\relax }\@writefile{toc}{\contentsline {chapter}{\nonumberline Source Code Content}{28}{chapter*.17}}
\BKM@entry{id=34,dest={636861707465722A2E3138},srcline={84}}{4C69746572617475727665727A656963686E6973}
\@writefile{toc}{\defcounter {refsection}{0}\relax }\@writefile{toc}{\contentsline {chapter}{\nonumberline Literaturverzeichnis}{29}{chapter*.18}}
\@writefile{lof}{\defcounter {refsection}{0}\relax }\@writefile{lof}{\addvspace {10\p@ }}
\@writefile{lot}{\defcounter {refsection}{0}\relax }\@writefile{lot}{\addvspace {10\p@ }}
\@writefile{lol}{\defcounter {refsection}{0}\relax }\@writefile{lol}{\addvspace {10\p@ }}
\BKM@entry{id=35,dest={636861707465722A2E3139},srcline={85}}{4F6E6C696E657265666572656E7A656E}
\@writefile{toc}{\defcounter {refsection}{0}\relax }\@writefile{toc}{\contentsline {chapter}{\nonumberline Onlinereferenzen}{30}{chapter*.19}}
\@writefile{lof}{\defcounter {refsection}{0}\relax }\@writefile{lof}{\addvspace {10\p@ }}
\@writefile{lot}{\defcounter {refsection}{0}\relax }\@writefile{lot}{\addvspace {10\p@ }}
\@writefile{lol}{\defcounter {refsection}{0}\relax }\@writefile{lol}{\addvspace {10\p@ }}
\BKM@entry{id=36,dest={636861707465722A2E3139},srcline={2}}{416E68616E67}
\BKM@entry{id=37,dest={73656374696F6E2E412E31},srcline={15}}{47617A65626F205465737473747265636B65}
\@writefile{toc}{\defcounter {refsection}{0}\relax }\@writefile{toc}{\contentsline {chapter}{Anhang}{31}{chapter*.19}}
\@writefile{lof}{\defcounter {refsection}{0}\relax }\@writefile{lof}{\addvspace {10\p@ }}
\@writefile{lot}{\defcounter {refsection}{0}\relax }\@writefile{lot}{\addvspace {10\p@ }}
\@writefile{lol}{\defcounter {refsection}{0}\relax }\@writefile{lol}{\addvspace {10\p@ }}
\@writefile{toc}{\defcounter {refsection}{0}\relax }\@writefile{toc}{\contentsline {section}{\numberline {A.1}Gazebo Teststrecke}{31}{section.A.1}}
\newlabel{anhang:a1}{{A.1}{31}{Gazebo Teststrecke}{section.A.1}{}}
\newlabel{img:gazebo_track}{{\caption@xref {img:gazebo_track}{ on input line 20}}{31}{Gazebo Teststrecke}{figure.caption.21}{}}
\BKM@entry{id=38,dest={636861707465722A2E3232},srcline={1}}{456967656E73745C3334346E6469676B6569747365726B6C5C33343472756E67}
\abx@aux@refcontextdefaultsdone
\abx@aux@defaultrefcontext{0}{DBLP:journals/corr/BojarskiTDFFGJM16}{anyt/global//global/global}
\abx@aux@defaultrefcontext{0}{DBLP:journals/corr/GreffSKSS15}{anyt/global//global/global}
\abx@aux@defaultrefcontext{0}{DBLP:journals/corr/IoffeS15}{anyt/global//global/global}
\abx@aux@defaultrefcontext{0}{rnn:2015}{anyt/global//global/global}
\abx@aux@defaultrefcontext{0}{DBLP:journals/corr/ShiBY15}{anyt/global//global/global}
\abx@aux@defaultrefcontext{0}{arXiv:EtEDrivingVD}{anyt/global//global/global}
\abx@aux@defaultrefcontext{0}{DBLP:journals/corr/abs-1801-06734}{anyt/global//global/global}
\abx@aux@defaultrefcontext{0}{neuroRace:Git}{anyt/global//global/global}
\@writefile{toc}{\defcounter {refsection}{0}\relax }\@writefile{toc}{\contentsline {chapter}{\nonumberline Eigenst\IeC {\"a}ndigkeitserkl\IeC {\"a}rung}{32}{chapter*.22}}
\@writefile{lof}{\defcounter {refsection}{0}\relax }\@writefile{lof}{\addvspace {10\p@ }}
\@writefile{lot}{\defcounter {refsection}{0}\relax }\@writefile{lot}{\addvspace {10\p@ }}
\@writefile{lol}{\defcounter {refsection}{0}\relax }\@writefile{lol}{\addvspace {10\p@ }}
\global\csname @altsecnumformattrue\endcsname
\global\@namedef{scr@dte@chapter@lastmaxnumwidth}{12.14992pt}
\global\@namedef{scr@dte@section@lastmaxnumwidth}{22.64684pt}
\global\@namedef{scr@dte@table@lastmaxnumwidth}{19.71382pt}
\global\@namedef{scr@dte@figure@lastmaxnumwidth}{19.71382pt}
