\boolfalse {citerequest}\boolfalse {citetracker}\boolfalse {pagetracker}\boolfalse {backtracker}\relax 
\babel@toc {ngerman}{}
\defcounter {refsection}{0}\relax 
\addvspace {10\p@ }
\defcounter {refsection}{0}\relax 
\addvspace {10\p@ }
\defcounter {refsection}{0}\relax 
\addvspace {10\p@ }
\defcounter {refsection}{0}\relax 
\contentsline {figure}{\numberline {\relax 3.1}{\ignorespaces Steuerung durch Einzelentscheidungen\relax }}{4}{figure.caption.4}
\defcounter {refsection}{0}\relax 
\addvspace {10\p@ }
\defcounter {refsection}{0}\relax 
\contentsline {figure}{\numberline {\relax 4.1}{\ignorespaces Konzept des RNN-Datengenerators\relax }}{6}{figure.caption.5}
\defcounter {refsection}{0}\relax 
\contentsline {figure}{\numberline {\relax 4.2}{\ignorespaces Entscheidungsfindung auf Basis von RNNs\relax }}{7}{figure.caption.6}
\defcounter {refsection}{0}\relax 
\contentsline {figure}{\numberline {\relax 4.3}{\ignorespaces Konzept der RNN-Ausgabe\relax }}{9}{figure.caption.7}
\defcounter {refsection}{0}\relax 
\contentsline {figure}{\numberline {\relax 4.4}{\ignorespaces Konzept des RNN-Aufbaus\relax }}{10}{figure.caption.8}
\defcounter {refsection}{0}\relax 
\addvspace {10\p@ }
\defcounter {refsection}{0}\relax 
\contentsline {figure}{\numberline {\relax 5.1}{\ignorespaces Klassendiagramm KerasBaseModelRNN\relax }}{12}{figure.caption.9}
\defcounter {refsection}{0}\relax 
\contentsline {figure}{\numberline {\relax 5.2}{\ignorespaces RNN Eingabesequenz Deque-Beispiel\relax }}{12}{figure.caption.10}
\defcounter {refsection}{0}\relax 
\contentsline {figure}{\numberline {\relax 5.3}{\ignorespaces Klassendiagramm KerasModelSLRNN und KerasSequenceRNN\relax }}{14}{figure.caption.11}
\defcounter {refsection}{0}\relax 
\contentsline {figure}{\numberline {\relax 5.4}{\ignorespaces RNN mit LSTM-Zelle\relax }}{15}{figure.caption.12}
\defcounter {refsection}{0}\relax 
\contentsline {figure}{\numberline {\relax 5.5}{\ignorespaces CNN-Architektur zum Vergleich\relax }}{15}{figure.caption.13}
\defcounter {refsection}{0}\relax 
\addvspace {10\p@ }
\defcounter {refsection}{0}\relax 
\addvspace {10\p@ }
\defcounter {refsection}{0}\relax 
\contentsline {figure}{\numberline {\relax 7.1}{\ignorespaces Berechnungen pro Sekunde mit LSTM \IeC {\"u}ber verschiedene Sequenzl\IeC {\"a}ngen\relax }}{20}{figure.caption.14}
\defcounter {refsection}{0}\relax 
\addvspace {10\p@ }
\defcounter {refsection}{0}\relax 
\addvspace {10\p@ }
\defcounter {refsection}{0}\relax 
\addvspace {10\p@ }
\defcounter {refsection}{0}\relax 
\addvspace {10\p@ }
\defcounter {refsection}{0}\relax 
\addvspace {10\p@ }
