\relax 
\providecommand\hyper@newdestlabel[2]{}
\catcode `"\active 
\AC@reset@newl@bel
\providecommand\HyperFirstAtBeginDocument{\AtBeginDocument}
\HyperFirstAtBeginDocument{\ifx\hyper@anchor\@undefined
\global\let\oldcontentsline\contentsline
\gdef\contentsline#1#2#3#4{\oldcontentsline{#1}{#2}{#3}}
\global\let\oldnewlabel\newlabel
\gdef\newlabel#1#2{\newlabelxx{#1}#2}
\gdef\newlabelxx#1#2#3#4#5#6{\oldnewlabel{#1}{{#2}{#3}}}
\AtEndDocument{\ifx\hyper@anchor\@undefined
\let\contentsline\oldcontentsline
\let\newlabel\oldnewlabel
\fi}
\fi}
\global\let\hyper@last\relax 
\gdef\HyperFirstAtBeginDocument#1{#1}
\providecommand\HyField@AuxAddToFields[1]{}
\providecommand\HyField@AuxAddToCoFields[2]{}
\abx@aux@refcontext{anyt/global//global/global}
\abx@aux@cite{colah:lstm2018}
\abx@aux@segm{0}{0}{colah:lstm2018}
\abx@aux@cite{Goodfellow-et-al-2016}
\abx@aux@segm{0}{0}{Goodfellow-et-al-2016}
\abx@aux@cite{lstm:1997}
\abx@aux@segm{0}{0}{lstm:1997}
\abx@aux@cite{neuroRace:Git}
\abx@aux@segm{0}{0}{neuroRace:Git}
\@writefile{toc}{\boolfalse {citerequest}\boolfalse {citetracker}\boolfalse {pagetracker}\boolfalse {backtracker}\relax }
\@writefile{lof}{\boolfalse {citerequest}\boolfalse {citetracker}\boolfalse {pagetracker}\boolfalse {backtracker}\relax }
\@writefile{lot}{\boolfalse {citerequest}\boolfalse {citetracker}\boolfalse {pagetracker}\boolfalse {backtracker}\relax }
\babel@aux{ngerman}{}
\babel@aux{ngerman}{}
\babel@aux{ngerman}{}
\@writefile{toc}{\defcounter {refsection}{0}\relax }\@writefile{toc}{\contentsline {section}{\numberline {1}Motivation}{1}{section.1}}
\@writefile{toc}{\defcounter {refsection}{0}\relax }\@writefile{toc}{\contentsline {section}{\numberline {2}Zielsetzung}{1}{section.2}}
\abx@aux@cite{rnn:2015}
\abx@aux@segm{0}{0}{rnn:2015}
\abx@aux@cite{arXiv:EtEDrivingVD}
\abx@aux@segm{0}{0}{arXiv:EtEDrivingVD}
\abx@aux@cite{arXiv:EtE_MM_VC}
\abx@aux@segm{0}{0}{arXiv:EtE_MM_VC}
\@writefile{toc}{\defcounter {refsection}{0}\relax }\@writefile{toc}{\contentsline {section}{\numberline {3}Vorgehen}{2}{section.3}}
\@writefile{lof}{\defcounter {refsection}{0}\relax }\@writefile{lof}{\contentsline {figure}{\numberline {1}{\ignorespaces Erster RNN Ansatz}}{3}{figure.caption.1}}
\providecommand*\caption@xref[2]{\@setref\relax\@undefined{#1}}
\newlabel{fig:rnnAnsatz}{{1}{3}{Erster RNN Ansatz}{figure.caption.1}{}}
\@writefile{toc}{\defcounter {refsection}{0}\relax }\@writefile{toc}{\contentsline {section}{\numberline {4}Erfordernisse und Randbedingungen}{4}{section.4}}
\@writefile{toc}{\defcounter {refsection}{0}\relax }\@writefile{toc}{\contentsline {section}{\numberline {5}Zeitplan}{4}{section.5}}
\@writefile{lof}{\defcounter {refsection}{0}\relax }\@writefile{lof}{\contentsline {figure}{\numberline {2}{\ignorespaces Zeitplan}}{4}{figure.caption.2}}
\@writefile{toc}{\defcounter {refsection}{0}\relax }\@writefile{toc}{\contentsline {section}{\numberline {6}Erwartete Ergebnisse}{5}{section.6}}
\@writefile{toc}{\defcounter {refsection}{0}\relax }\@writefile{toc}{\contentsline {section}{\numberline {7}Vorl\IeC {\"a}ufige Gliederung}{5}{section.7}}
\@writefile{toc}{\defcounter {refsection}{0}\relax }\@writefile{toc}{\contentsline {section}{Literaturangaben}{5}{section*.3}}
\abx@aux@refcontextdefaultsdone
\abx@aux@defaultrefcontext{0}{neuroRace:Git}{anyt/global//global/global}
\abx@aux@defaultrefcontext{0}{Goodfellow-et-al-2016}{anyt/global//global/global}
\abx@aux@defaultrefcontext{0}{lstm:1997}{anyt/global//global/global}
\abx@aux@defaultrefcontext{0}{rnn:2015}{anyt/global//global/global}
\abx@aux@defaultrefcontext{0}{colah:lstm2018}{anyt/global//global/global}
\abx@aux@defaultrefcontext{0}{arXiv:EtEDrivingVD}{anyt/global//global/global}
\abx@aux@defaultrefcontext{0}{arXiv:EtE_MM_VC}{anyt/global//global/global}
