\headcommand {\slideentry {0}{0}{1}{1/1}{}{0}}
\headcommand {\beamer@framepages {1}{1}}
\headcommand {\slideentry {0}{0}{2}{2/2}{}{0}}
\headcommand {\beamer@framepages {2}{2}}
\headcommand {\beamer@sectionpages {1}{2}}
\headcommand {\beamer@subsectionpages {1}{2}}
\headcommand {\sectionentry {1}{Architectures}{3}{Architectures}{0}}
\headcommand {\slideentry {1}{0}{1}{3/3}{}{0}}
\headcommand {\beamer@framepages {3}{3}}
\headcommand {\slideentry {1}{0}{2}{4/4}{}{0}}
\headcommand {\beamer@framepages {4}{4}}
\headcommand {\beamer@sectionpages {3}{4}}
\headcommand {\beamer@subsectionpages {3}{4}}
\headcommand {\sectionentry {2}{Problem: Long term dependencies}{5}{Problem: Long term dependencies}{0}}
\headcommand {\slideentry {2}{0}{1}{5/5}{}{0}}
\headcommand {\beamer@framepages {5}{5}}
\headcommand {\slideentry {2}{0}{2}{6/6}{}{0}}
\headcommand {\beamer@framepages {6}{6}}
\headcommand {\slideentry {2}{0}{3}{7/7}{}{0}}
\headcommand {\beamer@framepages {7}{7}}
\headcommand {\slideentry {2}{0}{4}{8/8}{}{0}}
\headcommand {\beamer@framepages {8}{8}}
\headcommand {\beamer@sectionpages {5}{8}}
\headcommand {\beamer@subsectionpages {5}{8}}
\headcommand {\sectionentry {3}{Propopsed solutions}{9}{Propopsed solutions}{0}}
\headcommand {\slideentry {3}{0}{1}{9/9}{}{0}}
\headcommand {\beamer@framepages {9}{9}}
\headcommand {\slideentry {3}{0}{2}{10/10}{}{0}}
\headcommand {\beamer@framepages {10}{10}}
\headcommand {\beamer@sectionpages {9}{10}}
\headcommand {\beamer@subsectionpages {9}{10}}
\headcommand {\sectionentry {4}{LSTMs}{11}{LSTMs}{0}}
\headcommand {\slideentry {4}{0}{1}{11/11}{}{0}}
\headcommand {\beamer@framepages {11}{11}}
\headcommand {\slideentry {4}{0}{2}{12/12}{}{0}}
\headcommand {\beamer@framepages {12}{12}}
\headcommand {\slideentry {4}{0}{3}{13/13}{}{0}}
\headcommand {\beamer@framepages {13}{13}}
\headcommand {\slideentry {4}{0}{4}{14/14}{}{0}}
\headcommand {\beamer@framepages {14}{14}}
\headcommand {\slideentry {4}{0}{5}{15/15}{}{0}}
\headcommand {\beamer@framepages {15}{15}}
\headcommand {\slideentry {4}{0}{6}{16/16}{}{0}}
\headcommand {\beamer@framepages {16}{16}}
\headcommand {\slideentry {4}{0}{7}{17/17}{}{0}}
\headcommand {\beamer@framepages {17}{17}}
\headcommand {\beamer@sectionpages {11}{17}}
\headcommand {\beamer@subsectionpages {11}{17}}
\headcommand {\sectionentry {5}{Optimization for Long-term dependencies}{18}{Optimization for Long-term dependencies}{0}}
\headcommand {\slideentry {5}{0}{1}{18/18}{}{0}}
\headcommand {\beamer@framepages {18}{18}}
\headcommand {\slideentry {5}{0}{2}{19/19}{}{0}}
\headcommand {\beamer@framepages {19}{19}}
\headcommand {\beamer@sectionpages {18}{19}}
\headcommand {\beamer@subsectionpages {18}{19}}
\headcommand {\sectionentry {6}{Explicit Memory}{20}{Explicit Memory}{0}}
\headcommand {\slideentry {6}{0}{1}{20/20}{}{0}}
\headcommand {\beamer@framepages {20}{20}}
\headcommand {\slideentry {6}{0}{2}{21/21}{}{0}}
\headcommand {\beamer@framepages {21}{21}}
\headcommand {\slideentry {6}{0}{3}{22/22}{}{0}}
\headcommand {\beamer@framepages {22}{22}}
\headcommand {\slideentry {6}{0}{4}{23/23}{}{0}}
\headcommand {\beamer@framepages {23}{23}}
\headcommand {\slideentry {6}{0}{5}{24/24}{}{0}}
\headcommand {\beamer@framepages {24}{24}}
\headcommand {\beamer@partpages {1}{24}}
\headcommand {\beamer@subsectionpages {20}{24}}
\headcommand {\beamer@sectionpages {20}{24}}
\headcommand {\beamer@documentpages {24}}
\headcommand {\def \inserttotalframenumber {24}}
