/home/programues/PrimaNota/Serveri/Serveri/src/main/java/net/unnitech/primanotafacile/Company.java
/home/programues/PrimaNota/Serveri/Serveri/src/main/java/net/unnitech/primanotafacile/Reminder.java
/home/programues/PrimaNota/Serveri/Serveri/src/main/java/net/unnitech/primanotafacile/DeleteEntryRequest.java
/home/programues/PrimaNota/Serveri/Serveri/src/main/java/net/unnitech/primanotafacile/UpdateSqliteSequenceResponse.java
/home/programues/PrimaNota/Serveri/Serveri/src/main/java/net/unnitech/primanotafacile/GetSqliteSequenceResponse.java
/home/programues/PrimaNota/Serveri/Serveri/src/main/java/net/unnitech/primanotafacile/AddCompanyResponse.java
/home/programues/PrimaNota/Serveri/Serveri/src/main/java/net/unnitech/primanotafacile/GetOperationTypeRequest.java
/home/programues/PrimaNota/Serveri/Serveri/src/main/java/net/unnitech/primanotafacile/UpdateContactResponse.java
/home/programues/PrimaNota/Serveri/Serveri/src/main/java/net/unnitech/primanotafacile/GetCompanyRequest.java
/home/programues/PrimaNota/Serveri/Serveri/src/main/java/net/unnitech/primanotafacile/GetBanksByArchiveResponse.java
/home/programues/PrimaNota/Serveri/Serveri/src/main/java/net/unnitech/primanotafacile/GetAllRemindersBetweenDatesRequest.java
/home/programues/PrimaNota/Serveri/Serveri/src/main/java/net/unnitech/primanotafacile/Bank.java
/home/programues/PrimaNota/Serveri/Serveri/src/main/java/net/unnitech/primanotafacile/GetBanksLikeNameRequest.java
/home/programues/PrimaNota/Serveri/Serveri/src/main/java/net/unnitech/primanotafacile/GetCompanyResponse.java
/home/programues/PrimaNota/Serveri/Serveri/src/main/java/net/unnitech/primanotafacile/GetAllRemindersByContactResponse.java
/home/programues/PrimaNota/Serveri/Serveri/src/main/java/net/unnitech/primanotafacile/AddContactRequest.java
/home/programues/PrimaNota/Serveri/Serveri/src/main/java/net/unnitech/primanotafacile/GetBanksByArchiveRequest.java
/home/programues/PrimaNota/Serveri/Serveri/src/main/java/net/unnitech/primanotafacile/GetAllRemindersCustomRequest.java
/home/programues/PrimaNota/Serveri/Serveri/src/main/java/net/unnitech/primanotafacile/GetAllEntriesRequest.java
/home/programues/PrimaNota/Serveri/Serveri/src/main/java/net/unnitech/primanotafacile/GetAllBankCustomResponse.java
/home/programues/PrimaNota/Serveri/Serveri/src/main/java/net/unnitech/primanotafacile/GetAllArchiveRequest.java
/home/programues/PrimaNota/Serveri/Serveri/src/main/java/net/unnitech/primanotafacile/EntryBalance.java
/home/programues/PrimaNota/Serveri/Serveri/src/main/java/net/unnitech/primanotafacile/GetSqliteSequenceRequest.java
/home/programues/PrimaNota/Serveri/Serveri/src/main/java/net/unnitech/primanotafacile/DeleteBankRequest.java
/home/programues/PrimaNota/Serveri/Serveri/src/main/java/net/unnitech/primanotafacile/GetAllBankRequest.java
/home/programues/PrimaNota/Serveri/Serveri/src/main/java/net/unnitech/primanotafacile/GetAllArchiveResponse.java
/home/programues/PrimaNota/Serveri/Serveri/src/main/java/net/unnitech/primanotafacile/GetOperationTypeResponse.java
/home/programues/PrimaNota/Serveri/Serveri/src/main/java/net/unnitech/primanotafacile/GetEntriesBeforeDateResponse.java
/home/programues/PrimaNota/Serveri/Serveri/src/main/java/net/unnitech/primanotafacile/GetAllCompaniesCustomResponse.java
/home/programues/PrimaNota/Serveri/Serveri/src/main/java/net/unnitech/primanotafacile/UpdateEntryResponse.java
/home/programues/PrimaNota/Serveri/Serveri/src/main/java/net/unnitech/primanotafacile/AddEntryResponse.java
/home/programues/PrimaNota/Serveri/Serveri/src/main/java/net/unnitech/primanotafacile/GetAllCompaniesResponse.java
/home/programues/PrimaNota/Serveri/Serveri/src/main/java/net/unnitech/primanotafacile/GetAllOperationTypesCustomResponse.java
/home/programues/PrimaNota/Serveri/Serveri/src/main/java/net/unnitech/primanotafacile/DeleteCompanyResponse.java
/home/programues/PrimaNota/Serveri/Serveri/src/main/java/net/unnitech/primanotafacile/GetEntriesByBankResponse.java
/home/programues/PrimaNota/Serveri/Serveri/src/main/java/net/unnitech/primanotafacile/GetEntriesByDateResponse.java
/home/programues/PrimaNota/Serveri/Serveri/src/main/java/net/unnitech/primanotafacile/UpdateOperationTypeResponse.java
/home/programues/PrimaNota/Serveri/Serveri/src/main/java/net/unnitech/primanotafacile/GetBankResponse.java
/home/programues/PrimaNota/Serveri/Serveri/src/main/java/net/unnitech/primanotafacile/GetAllRemindersLikeDescriptionResponse.java
/home/programues/PrimaNota/Serveri/Serveri/src/main/java/net/unnitech/primanotafacile/GetEntriesAfterDateRequest.java
/home/programues/PrimaNota/Serveri/Serveri/src/main/java/net/unnitech/primanotafacile/DeleteCompanyRequest.java
/home/programues/PrimaNota/Serveri/Serveri/src/main/java/net/unnitech/primanotafacile/DeleteArchiveResponse.java
/home/programues/PrimaNota/Serveri/Serveri/src/main/java/net/unnitech/primanotafacile/GetAllContactsCustomRequest.java
/home/programues/PrimaNota/Serveri/Serveri/src/main/java/net/unnitech/primanotafacile/GetAllRemindersCustomResponse.java
/home/programues/PrimaNota/Serveri/Serveri/src/main/java/net/unnitech/primanotafacile/GetAllOperationTypesCustomRequest.java
/home/programues/PrimaNota/Serveri/Serveri/src/main/java/net/unnitech/primanotafacile/GetAllOperationTypesResponse.java
/home/programues/PrimaNota/Serveri/Serveri/src/main/java/net/unnitech/primanotafacile/GetEntriesAfterDateResponse.java
/home/programues/PrimaNota/Serveri/Serveri/src/main/java/net/unnitech/primanotafacile/GetAllRemindersBeforeDateRequest.java
/home/programues/PrimaNota/Serveri/Serveri/src/main/java/net/unnitech/primanotafacile/GetAllRemindersAfterDateResponse.java
/home/programues/PrimaNota/Serveri/Serveri/src/main/java/net/unnitech/primanotafacile/AddContactResponse.java
/home/programues/PrimaNota/Serveri/Serveri/src/main/java/net/unnitech/primanotafacile/AddOperationTypeRequest.java
/home/programues/PrimaNota/Serveri/Serveri/src/main/java/net/unnitech/primanotafacile/AddCompanyRequest.java
/home/programues/PrimaNota/Serveri/Serveri/src/main/java/net/unnitech/primanotafacile/GetContactRequest.java
/home/programues/PrimaNota/Serveri/Serveri/src/main/java/net/unnitech/primanotafacile/AddArchiveResponse.java
/home/programues/PrimaNota/Serveri/Serveri/src/main/java/net/unnitech/primanotafacile/AddOperationTypeResponse.java
/home/programues/PrimaNota/Serveri/Serveri/src/main/java/net/unnitech/primanotafacile/GetAllEntriesResponse.java
/home/programues/PrimaNota/Serveri/Serveri/src/main/java/net/unnitech/primanotafacile/DeleteContactRequest.java
/home/programues/PrimaNota/Serveri/Serveri/src/main/java/net/unnitech/primanotafacile/OperationType.java
/home/programues/PrimaNota/Serveri/Serveri/src/main/java/net/unnitech/primanotafacile/GetAllRemindersBetweenDatesResponse.java
/home/programues/PrimaNota/Serveri/Serveri/src/main/java/net/unnitech/primanotafacile/GetEntriesByDateRequest.java
/home/programues/PrimaNota/Serveri/Serveri/src/main/java/net/unnitech/primanotafacile/DeleteSqliteSequenceRequest.java
/home/programues/PrimaNota/Serveri/Serveri/src/main/java/net/unnitech/primanotafacile/UpdateCompanyResponse.java
/home/programues/PrimaNota/Serveri/Serveri/src/main/java/net/unnitech/primanotafacile/GetAllCompaniesCustomRequest.java
/home/programues/PrimaNota/Serveri/Serveri/src/main/java/net/unnitech/primanotafacile/CopyArchiveRequest.java
/home/programues/PrimaNota/Serveri/Serveri/src/main/java/net/unnitech/primanotafacile/AddBankRequest.java
/home/programues/PrimaNota/Serveri/Serveri/src/main/java/net/unnitech/primanotafacile/GetAllContactsCustomResponse.java
/home/programues/PrimaNota/Serveri/Serveri/src/main/java/net/unnitech/primanotafacile/GetContactsLikeNameResponse.java
/home/programues/PrimaNota/Serveri/Serveri/src/main/java/net/unnitech/primanotafacile/GetAllSqliteSequenciesRequest.java
/home/programues/PrimaNota/Serveri/Serveri/src/main/java/net/unnitech/primanotafacile/DeleteOperationTypeRequest.java
/home/programues/PrimaNota/Serveri/Serveri/src/main/java/net/unnitech/primanotafacile/Contact.java
/home/programues/PrimaNota/Serveri/Serveri/src/main/java/net/unnitech/primanotafacile/AddSqliteSequenceRequest.java
/home/programues/PrimaNota/Serveri/Serveri/src/main/java/net/unnitech/primanotafacile/SqliteSequence.java
/home/programues/PrimaNota/Serveri/Serveri/src/main/java/primaNotaFacile/WebServiceConfig.java
/home/programues/PrimaNota/Serveri/Serveri/src/main/java/net/unnitech/primanotafacile/GetAllRemindersAfterDateRequest.java
/home/programues/PrimaNota/Serveri/Serveri/src/main/java/net/unnitech/primanotafacile/UpdateBankRequest.java
/home/programues/PrimaNota/Serveri/Serveri/src/main/java/net/unnitech/primanotafacile/GetEntriesByBankRequest.java
/home/programues/PrimaNota/Serveri/Serveri/src/main/java/net/unnitech/primanotafacile/GetAllRemindersResponse.java
/home/programues/PrimaNota/Serveri/Serveri/src/main/java/net/unnitech/primanotafacile/Archive.java
/home/programues/PrimaNota/Serveri/Serveri/src/main/java/primaNotaFacile/ArchiveRepository.java
/home/programues/PrimaNota/Serveri/Serveri/src/main/java/net/unnitech/primanotafacile/GetAllContactsRequest.java
/home/programues/PrimaNota/Serveri/Serveri/src/main/java/net/unnitech/primanotafacile/DeleteBankResponse.java
/home/programues/PrimaNota/Serveri/Serveri/src/main/java/net/unnitech/primanotafacile/DeleteContactResponse.java
/home/programues/PrimaNota/Serveri/Serveri/src/main/java/net/unnitech/primanotafacile/GetAllBankResponse.java
/home/programues/PrimaNota/Serveri/Serveri/src/main/java/net/unnitech/primanotafacile/GetBankRequest.java
/home/programues/PrimaNota/Serveri/Serveri/src/main/java/net/unnitech/primanotafacile/GetEntriesBetweenDatesRequest.java
/home/programues/PrimaNota/Serveri/Serveri/src/main/java/net/unnitech/primanotafacile/AddReminderRequest.java
/home/programues/PrimaNota/Serveri/Serveri/src/main/java/net/unnitech/primanotafacile/GetAllSqliteSequenciesResponse.java
/home/programues/PrimaNota/Serveri/Serveri/src/main/java/net/unnitech/primanotafacile/UpdateSqliteSequenceRequest.java
/home/programues/PrimaNota/Serveri/Serveri/src/main/java/net/unnitech/primanotafacile/GetReminderRequest.java
/home/programues/PrimaNota/Serveri/Serveri/src/main/java/net/unnitech/primanotafacile/GetAllEntriesCustomResponse.java
/home/programues/PrimaNota/Serveri/Serveri/src/main/java/net/unnitech/primanotafacile/UpdateContactRequest.java
/home/programues/PrimaNota/Serveri/Serveri/src/main/java/net/unnitech/primanotafacile/GetAllCompaniesRequest.java
/home/programues/PrimaNota/Serveri/Serveri/src/main/java/net/unnitech/primanotafacile/GetAllOperationTypesRequest.java
/home/programues/PrimaNota/Serveri/Serveri/src/main/java/net/unnitech/primanotafacile/UpdateBankResponse.java
/home/programues/PrimaNota/Serveri/Serveri/src/main/java/net/unnitech/primanotafacile/AddEntryRequest.java
/home/programues/PrimaNota/Serveri/Serveri/src/main/java/net/unnitech/primanotafacile/UpdateArchiveRequest.java
/home/programues/PrimaNota/Serveri/Serveri/src/main/java/net/unnitech/primanotafacile/GetAllContactsResponse.java
/home/programues/PrimaNota/Serveri/Serveri/src/main/java/net/unnitech/primanotafacile/GetAllRemindersBeforeDateResponse.java
/home/programues/PrimaNota/Serveri/Serveri/src/main/java/net/unnitech/primanotafacile/UpdateOperationTypeRequest.java
/home/programues/PrimaNota/Serveri/Serveri/src/main/java/net/unnitech/primanotafacile/GetEntryRequest.java
/home/programues/PrimaNota/Serveri/Serveri/src/main/java/primaNotaFacile/Application.java
/home/programues/PrimaNota/Serveri/Serveri/src/main/java/net/unnitech/primanotafacile/GetAllEntriesPreviousPeriodResponse.java
/home/programues/PrimaNota/Serveri/Serveri/src/main/java/net/unnitech/primanotafacile/GetBanksLikeNameResponse.java
/home/programues/PrimaNota/Serveri/Serveri/src/main/java/net/unnitech/primanotafacile/DeleteEntryResponse.java
/home/programues/PrimaNota/Serveri/Serveri/src/main/java/net/unnitech/primanotafacile/UpdateReminderRequest.java
/home/programues/PrimaNota/Serveri/Serveri/src/main/java/net/unnitech/primanotafacile/package-info.java
/home/programues/PrimaNota/Serveri/Serveri/src/main/java/net/unnitech/primanotafacile/GetCompaniesLikeNameResponse.java
/home/programues/PrimaNota/Serveri/Serveri/src/main/java/net/unnitech/primanotafacile/UpdateCompanyRequest.java
/home/programues/PrimaNota/Serveri/Serveri/src/main/java/net/unnitech/primanotafacile/GetContactResponse.java
/home/programues/PrimaNota/Serveri/Serveri/src/main/java/net/unnitech/primanotafacile/AddArchiveRequest.java
/home/programues/PrimaNota/Serveri/Serveri/src/main/java/net/unnitech/primanotafacile/GetEntriesBeforeDateRequest.java
/home/programues/PrimaNota/Serveri/Serveri/src/main/java/net/unnitech/primanotafacile/GetAllRemindersRequest.java
/home/programues/PrimaNota/Serveri/Serveri/src/main/java/net/unnitech/primanotafacile/GetCompaniesLikeNameRequest.java
/home/programues/PrimaNota/Serveri/Serveri/src/main/java/net/unnitech/primanotafacile/AddReminderResponse.java
/home/programues/PrimaNota/Serveri/Serveri/src/main/java/net/unnitech/primanotafacile/DeleteReminderRequest.java
/home/programues/PrimaNota/Serveri/Serveri/src/main/java/net/unnitech/primanotafacile/UpdateReminderResponse.java
/home/programues/PrimaNota/Serveri/Serveri/src/main/java/net/unnitech/primanotafacile/GetAllRemindersByContactRequest.java
/home/programues/PrimaNota/Serveri/Serveri/src/main/java/net/unnitech/primanotafacile/DeleteOperationTypeResponse.java
/home/programues/PrimaNota/Serveri/Serveri/src/main/java/net/unnitech/primanotafacile/UpdateArchiveResponse.java
/home/programues/PrimaNota/Serveri/Serveri/src/main/java/primaNotaFacile/ArchiveEndpoint.java
/home/programues/PrimaNota/Serveri/Serveri/src/main/java/net/unnitech/primanotafacile/UpdateEntryRequest.java
/home/programues/PrimaNota/Serveri/Serveri/src/main/java/net/unnitech/primanotafacile/GetEntriesBetweenDatesResponse.java
/home/programues/PrimaNota/Serveri/Serveri/src/main/java/net/unnitech/primanotafacile/GetArchiveRequest.java
/home/programues/PrimaNota/Serveri/Serveri/src/main/java/net/unnitech/primanotafacile/GetAllBankCustomRequest.java
/home/programues/PrimaNota/Serveri/Serveri/src/main/java/net/unnitech/primanotafacile/GetReminderResponse.java
/home/programues/PrimaNota/Serveri/Serveri/src/main/java/net/unnitech/primanotafacile/EntryPreviousPeriod.java
/home/programues/PrimaNota/Serveri/Serveri/src/main/java/net/unnitech/primanotafacile/Entry.java
/home/programues/PrimaNota/Serveri/Serveri/src/main/java/net/unnitech/primanotafacile/DeleteReminderResponse.java
/home/programues/PrimaNota/Serveri/Serveri/src/main/java/net/unnitech/primanotafacile/GetEntryResponse.java
/home/programues/PrimaNota/Serveri/Serveri/src/main/java/net/unnitech/primanotafacile/AddBankResponse.java
/home/programues/PrimaNota/Serveri/Serveri/src/main/java/net/unnitech/primanotafacile/GetEntriesByOperationTypeResponse.java
/home/programues/PrimaNota/Serveri/Serveri/src/main/java/net/unnitech/primanotafacile/DeleteArchiveRequest.java
/home/programues/PrimaNota/Serveri/Serveri/src/main/java/net/unnitech/primanotafacile/AddSqliteSequenceResponse.java
/home/programues/PrimaNota/Serveri/Serveri/src/main/java/net/unnitech/primanotafacile/GetEntriesByOperationTypeRequest.java
/home/programues/PrimaNota/Serveri/Serveri/src/main/java/net/unnitech/primanotafacile/CopyArchiveResponse.java
/home/programues/PrimaNota/Serveri/Serveri/src/main/java/net/unnitech/primanotafacile/ObjectFactory.java
/home/programues/PrimaNota/Serveri/Serveri/src/main/java/net/unnitech/primanotafacile/GetArchiveResponse.java
/home/programues/PrimaNota/Serveri/Serveri/src/main/java/net/unnitech/database/OjdbcConnection.java
/home/programues/PrimaNota/Serveri/Serveri/src/main/java/net/unnitech/primanotafacile/GetAllRemindersLikeDescriptionRequest.java
/home/programues/PrimaNota/Serveri/Serveri/src/main/java/net/unnitech/primanotafacile/GetAllEntriesPreviousPeriodRequest.java
/home/programues/PrimaNota/Serveri/Serveri/src/main/java/net/unnitech/primanotafacile/GetContactsLikeNameRequest.java
/home/programues/PrimaNota/Serveri/Serveri/src/main/java/net/unnitech/primanotafacile/DeleteSqliteSequenceResponse.java
/home/programues/PrimaNota/Serveri/Serveri/src/main/java/net/unnitech/primanotafacile/GetAllEntriesCustomRequest.java
