net/unnitech/primanotafacile/DeleteReminderResponse.class
net/unnitech/primanotafacile/UpdateCompanyRequest.class
net/unnitech/primanotafacile/DeleteEntryResponse.class
net/unnitech/primanotafacile/AddCompanyRequest.class
net/unnitech/primanotafacile/GetEntriesBeforeDateResponse.class
net/unnitech/primanotafacile/UpdateSqliteSequenceRequest.class
net/unnitech/primanotafacile/GetArchiveRequest.class
net/unnitech/primanotafacile/AddOperationTypeRequest.class
net/unnitech/primanotafacile/UpdateArchiveRequest.class
primaNotaFacile/WebServiceConfig.class
net/unnitech/primanotafacile/GetCompanyRequest.class
net/unnitech/primanotafacile/DeleteReminderRequest.class
net/unnitech/primanotafacile/AddSqliteSequenceResponse.class
net/unnitech/primanotafacile/GetBanksLikeNameRequest.class
net/unnitech/primanotafacile/AddArchiveRequest.class
net/unnitech/primanotafacile/UpdateOperationTypeRequest.class
net/unnitech/primanotafacile/DeleteSqliteSequenceResponse.class
net/unnitech/primanotafacile/GetEntriesAfterDateRequest.class
net/unnitech/primanotafacile/GetAllOperationTypesResponse.class
net/unnitech/primanotafacile/UpdateOperationTypeResponse.class
net/unnitech/primanotafacile/GetAllRemindersRequest.class
net/unnitech/primanotafacile/AddEntryRequest.class
net/unnitech/primanotafacile/Contact.class
net/unnitech/primanotafacile/GetContactResponse.class
net/unnitech/primanotafacile/GetSqliteSequenceResponse.class
net/unnitech/primanotafacile/Reminder.class
net/unnitech/primanotafacile/DeleteContactResponse.class
net/unnitech/primanotafacile/GetEntriesByDateRequest.class
net/unnitech/primanotafacile/AddContactResponse.class
net/unnitech/primanotafacile/GetAllEntriesResponse.class
net/unnitech/primanotafacile/GetArchiveResponse.class
net/unnitech/primanotafacile/GetAllArchiveResponse.class
net/unnitech/primanotafacile/UpdateSqliteSequenceResponse.class
net/unnitech/primanotafacile/GetContactsLikeNameRequest.class
net/unnitech/primanotafacile/UpdateContactRequest.class
net/unnitech/primanotafacile/GetBanksLikeNameResponse.class
net/unnitech/primanotafacile/UpdateReminderResponse.class
net/unnitech/primanotafacile/GetCompaniesLikeNameRequest.class
net/unnitech/primanotafacile/AddBankResponse.class
net/unnitech/primanotafacile/AddContactRequest.class
net/unnitech/primanotafacile/GetEntriesBeforeDateRequest.class
net/unnitech/primanotafacile/AddSqliteSequenceRequest.class
net/unnitech/primanotafacile/ObjectFactory.class
net/unnitech/primanotafacile/GetOperationTypeRequest.class
net/unnitech/primanotafacile/DeleteArchiveResponse.class
net/unnitech/primanotafacile/SqliteSequence.class
net/unnitech/primanotafacile/GetBankResponse.class
net/unnitech/primanotafacile/GetOperationTypeResponse.class
net/unnitech/primanotafacile/DeleteArchiveRequest.class
net/unnitech/primanotafacile/UpdateArchiveResponse.class
net/unnitech/primanotafacile/GetEntriesByDateResponse.class
net/unnitech/primanotafacile/DeleteContactRequest.class
net/unnitech/primanotafacile/GetBanksByArchiveRequest.class
net/unnitech/primanotafacile/GetAllEntriesRequest.class
net/unnitech/primanotafacile/GetEntryRequest.class
primaNotaFacile/Application.class
net/unnitech/primanotafacile/AddBankRequest.class
net/unnitech/primanotafacile/DeleteSqliteSequenceRequest.class
net/unnitech/primanotafacile/Company.class
net/unnitech/primanotafacile/UpdateContactResponse.class
net/unnitech/primanotafacile/GetEntryResponse.class
net/unnitech/primanotafacile/AddEntryResponse.class
net/unnitech/primanotafacile/Entry.class
net/unnitech/primanotafacile/UpdateEntryResponse.class
net/unnitech/primanotafacile/DeleteBankRequest.class
net/unnitech/primanotafacile/GetAllBankRequest.class
net/unnitech/primanotafacile/GetContactsLikeNameResponse.class
net/unnitech/primanotafacile/GetEntriesByOperationTypeRequest.class
net/unnitech/primanotafacile/GetAllCompaniesResponse.class
primaNotaFacile/ArchiveRepository.class
net/unnitech/primanotafacile/GetAllSqliteSequenciesResponse.class
net/unnitech/primanotafacile/UpdateBankRequest.class
net/unnitech/primanotafacile/AddArchiveResponse.class
net/unnitech/primanotafacile/GetEntriesByBankRequest.class
net/unnitech/primanotafacile/UpdateEntryRequest.class
net/unnitech/database/OjdbcConnection.class
net/unnitech/primanotafacile/DeleteCompanyRequest.class
net/unnitech/primanotafacile/AddReminderResponse.class
net/unnitech/primanotafacile/GetAllRemindersResponse.class
net/unnitech/primanotafacile/UpdateCompanyResponse.class
net/unnitech/primanotafacile/UpdateBankResponse.class
net/unnitech/primanotafacile/UpdateReminderRequest.class
net/unnitech/primanotafacile/GetContactRequest.class
net/unnitech/primanotafacile/package-info.class
net/unnitech/primanotafacile/GetAllArchiveRequest.class
net/unnitech/primanotafacile/AddReminderRequest.class
net/unnitech/primanotafacile/DeleteEntryRequest.class
net/unnitech/primanotafacile/DeleteOperationTypeResponse.class
net/unnitech/primanotafacile/OperationType.class
net/unnitech/primanotafacile/CopyArchiveResponse.class
net/unnitech/primanotafacile/DeleteCompanyResponse.class
net/unnitech/primanotafacile/GetAllSqliteSequenciesRequest.class
net/unnitech/primanotafacile/GetAllContactsResponse.class
net/unnitech/primanotafacile/GetAllOperationTypesRequest.class
net/unnitech/primanotafacile/GetBanksByArchiveResponse.class
net/unnitech/primanotafacile/GetAllContactsRequest.class
net/unnitech/primanotafacile/GetEntriesByBankResponse.class
net/unnitech/primanotafacile/GetEntriesByOperationTypeResponse.class
net/unnitech/primanotafacile/GetAllCompaniesRequest.class
net/unnitech/primanotafacile/DeleteOperationTypeRequest.class
net/unnitech/primanotafacile/GetAllBankResponse.class
net/unnitech/primanotafacile/CopyArchiveRequest.class
net/unnitech/primanotafacile/GetReminderRequest.class
net/unnitech/primanotafacile/Bank.class
net/unnitech/primanotafacile/GetCompaniesLikeNameResponse.class
net/unnitech/primanotafacile/AddCompanyResponse.class
net/unnitech/primanotafacile/GetSqliteSequenceRequest.class
net/unnitech/primanotafacile/GetEntriesAfterDateResponse.class
primaNotaFacile/ArchiveRepository$1.class
net/unnitech/primanotafacile/Archive.class
net/unnitech/primanotafacile/GetBankRequest.class
net/unnitech/primanotafacile/DeleteBankResponse.class
net/unnitech/primanotafacile/AddOperationTypeResponse.class
net/unnitech/primanotafacile/GetCompanyResponse.class
net/unnitech/primanotafacile/GetReminderResponse.class
