{
"อาการ":[
 {
  "No": 1,
  "Keyword อาการ": "ไข้"
 },
 {
  "No": 2,
  "Keyword อาการ": "หวัด"
 },
 {
  "No": 3,
  "Keyword อาการ": "ไอ"
 },
 {
  "No": 4,
  "Keyword อาการ": "มีน้ำมูก"
 },
 {
  "No": 5,
  "Keyword อาการ": "หายใจลำบาก"
 },
 {
  "No": 6,
  "Keyword อาการ": "จุดแดง"
 },
 {
  "No": 7,
  "Keyword อาการ": "จ้ำเขียว"
 },
 {
  "No": 8,
  "Keyword อาการ": "ผื่นแดง"
 },
 {
  "No": 9,
  "Keyword อาการ": "ตุ่ม"
 },
 {
  "No": 10,
  "Keyword อาการ": "เหนื่อยง่าย"
 },
 {
  "No": 11,
  "Keyword อาการ": "เพลีย"
 },
 {
  "No": 12,
  "Keyword อาการ": "ผอมลง"
 },
 {
  "No": 13,
  "Keyword อาการ": "อ้วนขึ้น"
 },
 {
  "No": 14,
  "Keyword อาการ": "ซีด"
 },
 {
  "No": 15,
  "Keyword อาการ": "ฟกช้ำ"
 },
 {
  "No": 16,
  "Keyword อาการ": "ตัวเหลือง"
 },
 {
  "No": 17,
  "Keyword อาการ": "ปัสสาวะเหลือง"
 },
 {
  "No": 18,
  "Keyword อาการ": "บวม"
 },
 {
  "No": 19,
  "Keyword อาการ": "ก้อน"
 },
 {
  "No": 20,
  "Keyword อาการ": "หน้ามืด"
 },
 {
  "No": 21,
  "Keyword อาการ": "สลบ"
 },
 {
  "No": 22,
  "Keyword อาการ": "หายใจเร็ว"
 },
 {
  "No": 23,
  "Keyword อาการ": "ตาค้าง"
 },
 {
  "No": 24,
  "Keyword อาการ": "หมดสติ"
 },
 {
  "No": 25,
  "Keyword อาการ": "ชัก"
 },
 {
  "No": 26,
  "Keyword อาการ": "ปวดน่อง"
 },
 {
  "No": 27,
  "Keyword อาการ": "ต่อมน้ำเหลืองโต"
 },
 {
  "No": 28,
  "Keyword อาการ": "ขยับเขยื้อนไม่ได้"
 },
 {
  "No": 29,
  "Keyword อาการ": "ไม่มีแรง"
 },
 {
  "No": 30,
  "Keyword อาการ": "เหน็บ"
 },
 {
  "No": 31,
  "Keyword อาการ": "ชา"
 },
 {
  "No": 32,
  "Keyword อาการ": "ปวดหัว"
 },
 {
  "No": 33,
  "Keyword อาการ": "เวียนหัว"
 },
 {
  "No": 34,
  "Keyword อาการ": "ปวดตา"
 },
 {
  "No": 35,
  "Keyword อาการ": "เจ็บตา"
 },
 {
  "No": 36,
  "Keyword อาการ": "มองเห็นไม่ชัด"
 },
 {
  "No": 37,
  "Keyword อาการ": "เห็นภาพซ้อน"
 },
 {
  "No": 38,
  "Keyword อาการ": "ขี้ตาแฉะ"
 },
 {
  "No": 39,
  "Keyword อาการ": "ฝุ่นเข้าตา"
 },
 {
  "No": 40,
  "Keyword อาการ": "เจ็บหู"
 },
 {
  "No": 41,
  "Keyword อาการ": "ไม่ได้ยินเสียง"
 },
 {
  "No": 42,
  "Keyword อาการ": "ได้ยินไม่ชัด"
 },
 {
  "No": 43,
  "Keyword อาการ": "หูอักเสบ"
 },
 {
  "No": 44,
  "Keyword อาการ": "แน่นจมูก"
 },
 {
  "No": 45,
  "Keyword อาการ": "เลือดออกจมูก"
 },
 {
  "No": 46,
  "Keyword อาการ": "ปวดฟัน"
 },
 {
  "No": 47,
  "Keyword อาการ": "เลือดออกจากไรฟัน"
 },
 {
  "No": 48,
  "Keyword อาการ": "ฟันผุ"
 },
 {
  "No": 49,
  "Keyword อาการ": "เหงือกอักเสบ"
 },
 {
  "No": 50,
  "Keyword อาการ": "กลืนอาหารไม่ลง"
 },
 {
  "No": 51,
  "Keyword อาการ": "เจ็บคอ"
 },
 {
  "No": 52,
  "Keyword อาการ": "แผล"
 },
 {
  "No": 53,
  "Keyword อาการ": "เสียงแหบ"
 },
 {
  "No": 54,
  "Keyword อาการ": "กระดูกซี่โครงหัก"
 },
 {
  "No": 55,
  "Keyword อาการ": "จุกแน่น"
 },
 {
  "No": 56,
  "Keyword อาการ": "ใจเต้นเร็ว"
 },
 {
  "No": 57,
  "Keyword อาการ": "อาเจียน"
 },
 {
  "No": 58,
  "Keyword อาการ": "เจ็บท้อง"
 },
 {
  "No": 59,
  "Keyword อาการ": "ท้องอืด"
 },
 {
  "No": 60,
  "Keyword อาการ": "ท้องเฟ้อ"
 },
 {
  "No": 61,
  "Keyword อาการ": "ปวดบิด"
 },
 {
  "No": 62,
  "Keyword อาการ": "ปวดท้องน้อย"
 },
 {
  "No": 63,
  "Keyword อาการ": "ปวดประจำเดือน"
 },
 {
  "No": 64,
  "Keyword อาการ": "ท้องเสีย"
 },
 {
  "No": 65,
  "Keyword อาการ": "ถ่ายเหลว"
 },
 {
  "No": 66,
  "Keyword อาการ": "ถ่ายเป็นเลือด"
 },
 {
  "No": 67,
  "Keyword อาการ": "ถ่ายไม่ออก"
 },
 {
  "No": 68,
  "Keyword อาการ": "ปวดข้อ"
 },
 {
  "No": 69,
  "Keyword อาการ": "ปวดตัว"
 },
 {
  "No": 70,
  "Keyword อาการ": "เจ็บกล้ามเนื้อ"
 },
 {
  "No": 71,
  "Keyword อาการ": "กล้ามเนื้ออักเสบ"
 },
 {
  "No": 72,
  "Keyword อาการ": "ฉี่ไม่ออก"
 },
 {
  "No": 73,
  "Keyword อาการ": "ฉี่บ่อย"
 },
 {
  "No": 74,
  "Keyword อาการ": "ฉี่ไม่ใส"
 },
 {
  "No": 75,
  "Keyword อาการ": "ประจำเดือนขาด"
 },
 {
  "No": 76,
  "Keyword อาการ": "ประจำเดือนขาว"
 },
 {
  "No": 77,
  "Keyword อาการ": "ตกเลือด"
 },
 {
  "No": 78,
  "Keyword อาการ": "เลือดออก"
 },
 {
  "No": 79,
  "Keyword อาการ": "เป็นแผลที่อวัยวะเพศ"
 },
 {
  "No": 80,
  "Keyword อาการ": "ตุ่มที่อวัยวะเพศ"
 },
 {
  "No": 81,
  "Keyword อาการ": "ผื่น"
 },
 {
  "No": 82,
  "Keyword อาการ": "คัน"
 },
 {
  "No": 83,
  "Keyword อาการ": "หัวล้าน"
 },
 {
  "No": 84,
  "Keyword อาการ": "แมลงกัด"
 },
 {
  "No": 85,
  "Keyword อาการ": "แมลงต่อย"
 },
 {
  "No": 86,
  "Keyword อาการ": "งูกัด"
 },
 {
  "No": 87,
  "Keyword อาการ": "ตาบวม"
 },
 {
  "No": 88,
  "Keyword อาการ": "คอพอก"
 },
 {
  "No": 89,
  "Keyword อาการ": "ต่อมไทรอยด์โต"
 },
 {
  "No": 90,
  "Keyword อาการ": "อัณฑะบวม"
 },
 {
  "No": 91,
  "Keyword อาการ": "นอนไม่หลับ"
 },
 {
  "No": 92,
  "Keyword อาการ": "เบื่ออาหาร"
 },
 {
  "No": 93,
  "Keyword อาการ": "ปวดแขนขา"
 },
 {
  "No": 94,
  "Keyword อาการ": "ปวดคอ"
 },
 {
  "No": 95,
  "Keyword อาการ": "มือสั่น"
 },
 {
  "No": 96,
  "Keyword อาการ": "เหงื่อออกมาก"
 },
 {
  "No": 97,
  "Keyword อาการ": "ทรงตัวไม่ได้"
 }
],
"โรค":[
 {
  "No": 1,
  "Keyword โรค": "ไข้หวัด"
 },
 {
  "No": 2,
  "Keyword โรค": "ไข้หวัดใหญ่"
 },
 {
  "No": 3,
  "Keyword โรค": "หัด"
 },
 {
  "No": 4,
  "Keyword โรค": "หัดเยอรมัน"
 },
 {
  "No": 5,
  "Keyword โรค": "ไข้ผื่นกุหลาบในทารก"
 },
 {
  "No": 6,
  "Keyword โรค": "อีสุกอีใส"
 },
 {
  "No": 7,
  "Keyword โรค": "คางทูม"
 },
 {
  "No": 8,
  "Keyword โรค": "คอหอยอักเสบ"
 },
 {
  "No": 9,
  "Keyword โรค": "ทอนซิลอักเสบ"
 },
 {
  "No": 10,
  "Keyword โรค": "อีดำอีแดง"
 },
 {
  "No": 11,
  "Keyword โรค": "คอตีบ"
 },
 {
  "No": 12,
  "Keyword โรค": "ครู้ป"
 },
 {
  "No": 13,
  "Keyword โรค": "กล่องเสียงอักเสบ"
 },
 {
  "No": 14,
  "Keyword โรค": "ไอกรน"
 },
 {
  "No": 15,
  "Keyword โรค": "วัณโรคปอด"
 },
 {
  "No": 16,
  "Keyword โรค": "หลอดลมอักเสบเฉียบพลัน"
 },
 {
  "No": 17,
  "Keyword โรค": "ภาวะปอดอุดกั้นเรื้อรัง"
 },
 {
  "No": 18,
  "Keyword โรค": "หลอดลมอักเสบเรื้อรัง"
 },
 {
  "No": 19,
  "Keyword โรค": "ถุงลมปอดโป่งพอง"
 },
 {
  "No": 20,
  "Keyword โรค": "หลอดลมพอง"
 },
 {
  "No": 21,
  "Keyword โรค": "หลอดลมฝอยอักเสบ"
 },
 {
  "No": 22,
  "Keyword โรค": "ปอดอักเสบ"
 },
 {
  "No": 23,
  "Keyword โรค": "ภาวะมีหนองในโพรงเยื่อหุ้มปอด"
 },
 {
  "No": 24,
  "Keyword โรค": "ภาวะมีน้ำในโพรงเยื่อหุ้มปอด"
 },
 {
  "No": 25,
  "Keyword โรค": "เยื่อหุ้มปอดอักเสบ"
 },
 {
  "No": 26,
  "Keyword โรค": "ปอดทะลุ"
 },
 {
  "No": 27,
  "Keyword โรค": "สำลักอาหาร"
 },
 {
  "No": 28,
  "Keyword โรค": "ทางเดินหายใจอุดกั้นจากสิ่งแปลกปลอม"
 },
 {
  "No": 29,
  "Keyword โรค": "หืด"
 },
 {
  "No": 30,
  "Keyword โรค": "หวัดภูมิแพ้"
 },
 {
  "No": 31,
  "Keyword โรค": "ไซนัสอักเสบ"
 },
 {
  "No": 32,
  "Keyword โรค": "เยื่อจมูกอักเสบเป็นหนอง"
 },
 {
  "No": 33,
  "Keyword โรค": "ติ่งเนื้อเมือกจมูก"
 },
 {
  "No": 34,
  "Keyword โรค": "ผนังกั้นจมูกคด"
 },
 {
  "No": 35,
  "Keyword โรค": "เลือดกำเดา"
 },
 {
  "No": 36,
  "Keyword โรค": "สิ่งแปลกปลอมเข้าจมูก"
 },
 {
  "No": 37,
  "Keyword โรค": "ภาวะหยุดหายใจขณะหลับ"
 },
 {
  "No": 38,
  "Keyword โรค": "ท้องเดิน"
 },
 {
  "No": 39,
  "Keyword โรค": "ท้องเดินจากไวรัส"
 },
 {
  "No": 40,
  "Keyword โรค": "ท้องเดินจากเชื้อไกอาร์เดีย"
 },
 {
  "No": 41,
  "Keyword โรค": "โรคลำไส้แปรปรวน"
 },
 {
  "No": 42,
  "Keyword โรค": "ภาวะพร่องแล็กเทส"
 },
 {
  "No": 43,
  "Keyword โรค": "อาหารเป็นพิษ"
 },
 {
  "No": 44,
  "Keyword โรค": "อาหารเป็นพิษจากเชื้อโรค"
 },
 {
  "No": 45,
  "Keyword โรค": "อหิวาต์"
 },
 {
  "No": 46,
  "Keyword โรค": "บิด"
 },
 {
  "No": 47,
  "Keyword โรค": "บิดชิเกลลา"
 },
 {
  "No": 48,
  "Keyword โรค": "บิดอะมีบา"
 },
 {
  "No": 49,
  "Keyword โรค": "ไทฟอยด์"
 },
 {
  "No": 50,
  "Keyword โรค": "ตับอักเสบจากไวรัส"
 },
 {
  "No": 51,
  "Keyword โรค": "ฝีตับอะมีบา"
 },
 {
  "No": 52,
  "Keyword โรค": "นิ่วน้ำดี"
 },
 {
  "No": 53,
  "Keyword โรค": "ถุงน้ำดีอักเสบ"
 },
 {
  "No": 54,
  "Keyword โรค": "ท่อน้ำดีอักเสบ"
 },
 {
  "No": 55,
  "Keyword โรค": "ดีซ่านสรีระในทารกแรกเกิด"
 },
 {
  "No": 56,
  "Keyword โรค": "ท่อน้ำดีตีบตันในทารก"
 },
 {
  "No": 57,
  "Keyword โรค": "ตับแข็ง"
 },
 {
  "No": 58,
  "Keyword โรค": "มะเร็งตับ"
 },
 {
  "No": 59,
  "Keyword โรค": "โรคพยาธิใบไม้ตับ"
 },
 {
  "No": 60,
  "Keyword โรค": "ไส้ติ่งอักเสบ"
 },
 {
  "No": 61,
  "Keyword โรค": "เยื่อบุช่องท้องอักเสบ"
 },
 {
  "No": 62,
  "Keyword โรค": "ตับอ่อนอักเสบเฉียบพลัน"
 },
 {
  "No": 63,
  "Keyword โรค": "อาหารไม่ย่อย"
 },
 {
  "No": 64,
  "Keyword โรค": "โรคกรดไหลย้อน"
 },
 {
  "No": 65,
  "Keyword โรค": "กระเพาะอาหารอักเสบ"
 },
 {
  "No": 66,
  "Keyword โรค": "แผลเพ็ปติก"
 },
 {
  "No": 67,
  "Keyword โรค": "กระเพาะอาหารทะลุ"
 },
 {
  "No": 68,
  "Keyword โรค": "กระเพาะอาหารแตก"
 },
 {
  "No": 69,
  "Keyword โรค": "กระเพาะอาหารอุดกั้น"
 },
 {
  "No": 70,
  "Keyword โรค": "ลำไส้อุดกั้น"
 },
 {
  "No": 71,
  "Keyword โรค": "อาเจียนในเด็ก"
 },
 {
  "No": 72,
  "Keyword โรค": "ตับฉีกขาด"
 },
 {
  "No": 73,
  "Keyword โรค": "ม้ามฉีกขาด"
 },
 {
  "No": 74,
  "Keyword โรค": "ไตฉีกขาด"
 },
 {
  "No": 75,
  "Keyword โรค": "เลือดตกใน"
 },
 {
  "No": 76,
  "Keyword โรค": "ไส้เลื่อน"
 },
 {
  "No": 77,
  "Keyword โรค": "ริดสีดวงทวาร"
 },
 {
  "No": 78,
  "Keyword โรค": "แผลปริที่ปากทวาร"
 },
 {
  "No": 79,
  "Keyword โรค": "ฝีรอบทวารหนัก"
 },
 {
  "No": 80,
  "Keyword โรค": "ฝีคัณฑสูตร"
 },
 {
  "No": 81,
  "Keyword โรค": "แผลเปื่อยที่ปาก"
 },
 {
  "No": 82,
  "Keyword โรค": "แผลแอฟทัส"
 },
 {
  "No": 83,
  "Keyword โรค": "แผลเปื่อยที่เกิดจากการบาดเจ็บ"
 },
 {
  "No": 84,
  "Keyword โรค": "เริมในช่องปากชนิดเฉียบพลัน"
 },
 {
  "No": 85,
  "Keyword โรค": "เฮอร์แปงไจนา"
 },
 {
  "No": 86,
  "Keyword โรค": "ปากนกกระจอก"
 },
 {
  "No": 87,
  "Keyword โรค": "โรคเชื้อราในช่องปาก"
 },
 {
  "No": 88,
  "Keyword โรค": "มุมปากเปื่อยจากเชื้อรา"
 },
 {
  "No": 89,
  "Keyword โรค": "มะเร็งช่องปาก"
 },
 {
  "No": 90,
  "Keyword โรค": "ปวดฟันฟันผุ"
 },
 {
  "No": 91,
  "Keyword โรค": "เหงือกอักเสบ"
 },
 {
  "No": 92,
  "Keyword โรค": "ฟันเหลืองดำ"
 },
 {
  "No": 93,
  "Keyword โรค": "โปลิโอ"
 },
 {
  "No": 94,
  "Keyword โรค": "กลุ่มอาการกิลเลนบาร์เร"
 },
 {
  "No": 95,
  "Keyword โรค": "โรคพิษสุนัขบ้า"
 },
 {
  "No": 96,
  "Keyword โรค": "สมองอักเสบ"
 },
 {
  "No": 97,
  "Keyword โรค": "โรคเรย์ซินโดรม"
 },
 {
  "No": 98,
  "Keyword โรค": "เยื่อหุ้มสมองอักเสบ"
 },
 {
  "No": 99,
  "Keyword โรค": "ไข้กาฬหลังแอ่น"
 },
 {
  "No": 100,
  "Keyword โรค": "บาดทะยัก"
 },
 {
  "No": 101,
  "Keyword โรค": "โบทูลิซึม"
 },
 {
  "No": 102,
  "Keyword โรค": "ชักจากไข้"
 },
 {
  "No": 103,
  "Keyword โรค": "ชักในทารกแรกเกิด"
 },
 {
  "No": 104,
  "Keyword โรค": "โรคลมชักลมบ้าหมู"
 },
 {
  "No": 105,
  "Keyword โรค": "ไมเกรน"
 },
 {
  "No": 106,
  "Keyword โรค": "ปวดศีรษะคลัสเตอร์"
 },
 {
  "No": 107,
  "Keyword โรค": "ปวดศีรษะจากความเครียด"
 },
 {
  "No": 108,
  "Keyword โรค": "หลอดเลือดแดงขมับอักเสบ"
 },
 {
  "No": 109,
  "Keyword โรค": "เวียนศีรษะบ้านหมุน"
 },
 {
  "No": 110,
  "Keyword โรค": "เมารถเมาเรือ"
 },
 {
  "No": 111,
  "Keyword โรค": "เป็นลม"
 },
 {
  "No": 112,
  "Keyword โรค": "หมดสติ"
 },
 {
  "No": 113,
  "Keyword โรค": "โรคหลอดเลือดสมอง"
 },
 {
  "No": 114,
  "Keyword โรค": "สมองขาดเลือดชั่วขณะ"
 },
 {
  "No": 115,
  "Keyword โรค": "อัมพาตครึ่งซีก"
 },
 {
  "No": 116,
  "Keyword โรค": "อัมพาตเบลล์"
 },
 {
  "No": 117,
  "Keyword โรค": "เบลล์พัลซี"
 },
 {
  "No": 118,
  "Keyword โรค": "โรคปวดเส้นประสาทใบหน้า"
 },
 {
  "No": 119,
  "Keyword โรค": "ภาวะโพแทสเซียมในเลือดต่ำ"
 },
 {
  "No": 120,
  "Keyword โรค": "อัมพาตครั้งคราว"
 },
 {
  "No": 121,
  "Keyword โรค": "ไมแอสทีเนียเกรวิส"
 },
 {
  "No": 122,
  "Keyword โรค": "โรคพาร์กินสัน"
 },
 {
  "No": 123,
  "Keyword โรค": "สมองพิการ"
 },
 {
  "No": 124,
  "Keyword โรค": "ศีรษะได้รับบาดเจ็บ"
 },
 {
  "No": 125,
  "Keyword โรค": "เลือดออกในสมอง"
 },
 {
  "No": 126,
  "Keyword โรค": "ฝีสมอง"
 },
 {
  "No": 127,
  "Keyword โรค": "เนื้องอกสมอง"
 },
 {
  "No": 128,
  "Keyword โรค": "ไขสันหลังอักเสบเฉียบพลัน"
 },
 {
  "No": 129,
  "Keyword โรค": "ไขสันหลังได้รับบาดเจ็บ"
 },
 {
  "No": 130,
  "Keyword โรค": "เนื้องอกไขสันหลัง"
 },
 {
  "No": 131,
  "Keyword โรค": "ปลายประสาทอักเสบ"
 },
 {
  "No": 132,
  "Keyword โรค": "โรควิตกกังวลโรคกังวลทั่วไป"
 },
 {
  "No": 133,
  "Keyword โรค": "โรคแพนิก"
 },
 {
  "No": 134,
  "Keyword โรค": "โรคอารมณ์แปรปรวนโรคซึมเศร้า"
 },
 {
  "No": 135,
  "Keyword โรค": "กลุ่มอาการระบายลมหายใจเกิน"
 },
 {
  "No": 136,
  "Keyword โรค": "เด็กไม่อยากไปโรงเรียน"
 },
 {
  "No": 137,
  "Keyword โรค": "ช็อก"
 },
 {
  "No": 138,
  "Keyword โรค": "ความดันโลหิตสูง"
 },
 {
  "No": 139,
  "Keyword โรค": "หลอดเลือดแดงใหญ่โป่งพอง"
 },
 {
  "No": 140,
  "Keyword โรค": "ภาวะเลือดเซาะผนังหลอดเลือดแดงใหญ่"
 },
 {
  "No": 141,
  "Keyword โรค": "ความดันตกในท่ายืน"
 },
 {
  "No": 142,
  "Keyword โรค": "ไข้รูมาติก"
 },
 {
  "No": 143,
  "Keyword โรค": "โรคหัวใจรูมาติก"
 },
 {
  "No": 144,
  "Keyword โรค": "เยื่อบุหัวใจอักเสบ"
 },
 {
  "No": 145,
  "Keyword โรค": "โรคหัวใจขาดเลือด"
 },
 {
  "No": 146,
  "Keyword โรค": "โรคหลอดเลือดหัวใจตีบ"
 },
 {
  "No": 147,
  "Keyword โรค": "โรคหัวใจขาดเลือดชั่วขณะ"
 },
 {
  "No": 148,
  "Keyword โรค": "โรคกล้ามเนื้อหัวใจตาย"
 },
 {
  "No": 149,
  "Keyword โรค": "หลอดเลือดแดงขาตีบ"
 },
 {
  "No": 150,
  "Keyword โรค": "โรคหัวใจเต้นผิดจังหวะ"
 },
 {
  "No": 151,
  "Keyword โรค": "หัวใจวาย"
 },
 {
  "No": 152,
  "Keyword โรค": "หลอดเลือดขอดที่ขา"
 },
 {
  "No": 153,
  "Keyword โรค": "ภาวะหลอดเลือดดำส่วนลึกมีลิ่มเลือด"
 },
 {
  "No": 154,
  "Keyword โรค": "ภาวะสิ่งหลุดอุดตันหลอดเลือดแดงปอด"
 },
 {
  "No": 155,
  "Keyword โรค": "โลหิตจางจากภาวะขาดธาตุเหล็ก"
 },
 {
  "No": 156,
  "Keyword โรค": "โลหิตจางจากเม็ดเลือดแดงแตก"
 },
 {
  "No": 157,
  "Keyword โรค": "ภาวะพร่องเอนไซม์จี-6-พีดี"
 },
 {
  "No": 158,
  "Keyword โรค": "เม็ดเลือดแดงแตกในทารกแรกเกิด"
 },
 {
  "No": 159,
  "Keyword โรค": "โลหิตจางจากไขกระดูกฝ่อ"
 },
 {
  "No": 160,
  "Keyword โรค": "ไอทีพี"
 },
 {
  "No": 161,
  "Keyword โรค": "ฮีโมฟิเลีย"
 },
 {
  "No": 162,
  "Keyword โรค": "ธาลัสซีเมีย"
 },
 {
  "No": 163,
  "Keyword โรค": "มะเร็งเม็ดเลือดขาว"
 },
 {
  "No": 164,
  "Keyword โรค": "มะเร็งต่อมน้ำเหลือง"
 },
 {
  "No": 165,
  "Keyword โรค": "ปวดกล้ามเนื้อหลัง"
 },
 {
  "No": 166,
  "Keyword โรค": "รากประสาทถูกกด"
 },
 {
  "No": 167,
  "Keyword โรค": "หมอนรองกระดูกสันหลังเคลื่อน"
 },
 {
  "No": 168,
  "Keyword โรค": "โพรงกระดูกสันหลังแคบ"
 },
 {
  "No": 169,
  "Keyword โรค": "กระดูกคอเสื่อม"
 },
 {
  "No": 170,
  "Keyword โรค": "กระดูกคองอกกดรากประสาท"
 },
 {
  "No": 171,
  "Keyword โรค": "ข้อเสื่อม"
 },
 {
  "No": 172,
  "Keyword โรค": "ข้อเข่าเสื่อม"
 },
 {
  "No": 173,
  "Keyword โรค": "โรคข้ออักเสบรูมาตอยด์"
 },
 {
  "No": 174,
  "Keyword โรค": "ข้อสันหลังอักเสบเรื้อรัง"
 },
 {
  "No": 175,
  "Keyword โรค": "เอสแอลอี"
 },
 {
  "No": 176,
  "Keyword โรค": "ข้ออักเสบชนิดติดเชื้อเฉียบพลัน"
 },
 {
  "No": 177,
  "Keyword โรค": "ข้อเคล็ด"
 },
 {
  "No": 178,
  "Keyword โรค": "เส้นเอ็นอักเสบ"
 },
 {
  "No": 179,
  "Keyword โรค": "ปลอกหุ้มเอ็นอักเสบ"
 },
 {
  "No": 180,
  "Keyword โรค": "พังผืดส้นเท้าอักเสบ"
 },
 {
  "No": 181,
  "Keyword โรค": "เส้นประสาทมือถูกพังผืดรัดแน่น"
 },
 {
  "No": 182,
  "Keyword โรค": "ตะคริว"
 },
 {
  "No": 183,
  "Keyword โรค": "เบาหวาน"
 },
 {
  "No": 184,
  "Keyword โรค": "เบาจืด"
 },
 {
  "No": 185,
  "Keyword โรค": "ไขมันในเลือดผิดปกติ"
 },
 {
  "No": 186,
  "Keyword โรค": "ภาวะน้ำตาลในเลือดต่ำ"
 },
 {
  "No": 187,
  "Keyword โรค": "ภาวะแคลเซียมในเลือดต่ำ"
 },
 {
  "No": 188,
  "Keyword โรค": "คอพอก"
 },
 {
  "No": 189,
  "Keyword โรค": "ต่อมไทรอยด์โต"
 },
 {
  "No": 190,
  "Keyword โรค": "ภาวะต่อมไทรอยด์ทำงานเกิน"
 },
 {
  "No": 191,
  "Keyword โรค": "พิษจากไทรอยด์"
 },
 {
  "No": 192,
  "Keyword โรค": "คอพอกเป็นพิษ"
 },
 {
  "No": 193,
  "Keyword โรค": "ต่อมไทรอยด์อักเสบ"
 },
 {
  "No": 194,
  "Keyword โรค": "มะเร็งไทรอยด์"
 },
 {
  "No": 195,
  "Keyword โรค": "ภาวะขาดไทรอยด์"
 },
 {
  "No": 196,
  "Keyword โรค": "ต่อมไทรอยด์ทำงานน้อย"
 },
 {
  "No": 197,
  "Keyword โรค": "โรคคุชชิง"
 },
 {
  "No": 198,
  "Keyword โรค": "โรคแอดดิสัน"
 },
 {
  "No": 199,
  "Keyword โรค": "โรคชีแฮน"
 },
 {
  "No": 200,
  "Keyword โรค": "โรคเกาต์"
 },
 {
  "No": 201,
  "Keyword โรค": "โรคของหญิงวัยหมดประจำเดือน"
 },
 {
  "No": 202,
  "Keyword โรค": "กระดูกพรุน"
 },
 {
  "No": 203,
  "Keyword โรค": "โรคขาดอาหารในเด็ก"
 },
 {
  "No": 204,
  "Keyword โรค": "โรคขาดวิตามินเอ"
 },
 {
  "No": 205,
  "Keyword โรค": "โรคเหน็บชา"
 },
 {
  "No": 206,
  "Keyword โรค": "โรคลักปิดลักเปิด"
 },
 {
  "No": 207,
  "Keyword โรค": "ภาวะไตวาย"
 },
 {
  "No": 208,
  "Keyword โรค": "โรคไตเนโฟรติก"
 },
 {
  "No": 209,
  "Keyword โรค": "หน่วยไตอักเสบเฉียบพลัน"
 },
 {
  "No": 210,
  "Keyword โรค": "กรวยไตอักเสบ"
 },
 {
  "No": 211,
  "Keyword โรค": "กรวยไตอักเสบเฉียบพลัน"
 },
 {
  "No": 212,
  "Keyword โรค": "กรวยไตอักเสบเรื้อรัง"
 },
 {
  "No": 213,
  "Keyword โรค": "นิ่วไต"
 },
 {
  "No": 214,
  "Keyword โรค": "นิ่วท่อไต"
 },
 {
  "No": 215,
  "Keyword โรค": "นิ่วกระเพาะปัสสาวะ"
 },
 {
  "No": 216,
  "Keyword โรค": "กระเพาะปัสสาวะอักเสบ"
 },
 {
  "No": 217,
  "Keyword โรค": "ท่อปัสสาวะตีบ"
 },
 {
  "No": 218,
  "Keyword โรค": "ต่อมลูกหมากโต"
 },
 {
  "No": 219,
  "Keyword โรค": "ต่อมลูกหมากอักเสบ"
 },
 {
  "No": 220,
  "Keyword โรค": "หนังหุ้มปลายองคชาตตีบ"
 },
 {
  "No": 221,
  "Keyword โรค": "ถุงน้ำที่ถุงอัณฑะ"
 },
 {
  "No": 222,
  "Keyword โรค": "หลอดเลือดอัณฑะขอด"
 },
 {
  "No": 223,
  "Keyword โรค": "อัณฑะบิดตัว"
 },
 {
  "No": 224,
  "Keyword โรค": "ปีกมดลูกอักเสบ"
 },
 {
  "No": 225,
  "Keyword โรค": "เยื่อบุมดลูกอักเสบ"
 },
 {
  "No": 226,
  "Keyword โรค": "ตกขาวธรรมดา"
 },
 {
  "No": 227,
  "Keyword โรค": "ช่องคลอดอักเสบ"
 },
 {
  "No": 228,
  "Keyword โรค": "ช่องคลอดอักเสบจากเชื้อรา"
 },
 {
  "No": 229,
  "Keyword โรค": "ช่องคลอดอักเสบจากเชื้อทริโคโมแนส"
 },
 {
  "No": 230,
  "Keyword โรค": "ปวดประจำเดือน"
 },
 {
  "No": 231,
  "Keyword โรค": "ประจำเดือนไม่มา"
 },
 {
  "No": 232,
  "Keyword โรค": "ดียูบี"
 },
 {
  "No": 233,
  "Keyword โรค": "เนื้องอกมดลูก"
 },
 {
  "No": 234,
  "Keyword โรค": "เยื่อบุมดลูกต่างที่"
 },
 {
  "No": 235,
  "Keyword โรค": "เนื้องอกรังไข่"
 },
 {
  "No": 236,
  "Keyword โรค": "ถุงน้ำรังไข่"
 },
 {
  "No": 237,
  "Keyword โรค": "กลุ่มอาการถุงน้ำรังไข่ชนิดหลายถุง"
 },
 {
  "No": 238,
  "Keyword โรค": "ภาวะตั้งครรภ์"
 },
 {
  "No": 239,
  "Keyword โรค": "แพ้ท้อง"
 },
 {
  "No": 240,
  "Keyword โรค": "ครรภ์เป็นพิษ"
 },
 {
  "No": 241,
  "Keyword โรค": "แท้งบุตร"
 },
 {
  "No": 242,
  "Keyword โรค": "ครรภ์นอกมดลูก"
 },
 {
  "No": 243,
  "Keyword โรค": "ครรภ์ไข่ปลาอุก"
 },
 {
  "No": 244,
  "Keyword โรค": "รกเกาะต่ำ"
 },
 {
  "No": 245,
  "Keyword โรค": "รกลอกตัวก่อนกำหนด"
 },
 {
  "No": 246,
  "Keyword โรค": "หูชั้นนอกอักเสบ"
 },
 {
  "No": 247,
  "Keyword โรค": "โรคเชื้อราในช่องหู"
 },
 {
  "No": 248,
  "Keyword โรค": "หูชั้นกลางอักเสบ"
 },
 {
  "No": 249,
  "Keyword โรค": "หูชั้นในอักเสบเฉียบพลัน"
 },
 {
  "No": 250,
  "Keyword โรค": "เส้นประสาทการทรงตัวอักเสบ"
 },
 {
  "No": 251,
  "Keyword โรค": "บ้านหมุนจากการเปลี่ยนท่า"
 },
 {
  "No": 252,
  "Keyword โรค": "เนื้องอกประสาทหู"
 },
 {
  "No": 253,
  "Keyword โรค": "โรคเมเนียส์"
 },
 {
  "No": 254,
  "Keyword โรค": "หูตึง"
 },
 {
  "No": 255,
  "Keyword โรค": "หูหนวก"
 },
 {
  "No": 256,
  "Keyword โรค": "เยื่อแก้วหูทะลุ"
 },
 {
  "No": 257,
  "Keyword โรค": "แผลถลอกในช่องหู"
 },
 {
  "No": 258,
  "Keyword โรค": "ขี้หูอุดตันรูหู"
 },
 {
  "No": 259,
  "Keyword โรค": "สิ่งแปลกปลอมเข้าหู"
 },
 {
  "No": 260,
  "Keyword โรค": "หูบาดเจ็บจากความกดดันอากาศ"
 },
 {
  "No": 261,
  "Keyword โรค": "เยื่อตาขาวอักเสบจากเชื้อแบคทีเรีย"
 },
 {
  "No": 262,
  "Keyword โรค": "เยื่อตาขาวอักเสบจากไวรัส"
 },
 {
  "No": 263,
  "Keyword โรค": "เยื่อตาขาวอักเสบจากการแพ้"
 },
 {
  "No": 264,
  "Keyword โรค": "ตาอักเสบจากเชื้อหนองใน"
 },
 {
  "No": 265,
  "Keyword โรค": "ริดสีดวงตา"
 },
 {
  "No": 266,
  "Keyword โรค": "กุ้งยิง"
 },
 {
  "No": 267,
  "Keyword โรค": "หนังตาอักเสบ"
 },
 {
  "No": 268,
  "Keyword โรค": "ท่อน้ำตาอุดตัน"
 },
 {
  "No": 269,
  "Keyword โรค": "ถุงน้ำตาอักเสบ"
 },
 {
  "No": 270,
  "Keyword โรค": "สายตาผิดปกติ"
 },
 {
  "No": 271,
  "Keyword โรค": "สายตาสั้น"
 },
 {
  "No": 272,
  "Keyword โรค": "สายตายาว"
 },
 {
  "No": 273,
  "Keyword โรค": "สายตาผู้สูงอายุ"
 },
 {
  "No": 274,
  "Keyword โรค": "สายตาเอียง"
 },
 {
  "No": 275,
  "Keyword โรค": "ตาเข"
 },
 {
  "No": 276,
  "Keyword โรค": "ต้อเนื้อ"
 },
 {
  "No": 277,
  "Keyword โรค": "ต้อกระจก"
 },
 {
  "No": 278,
  "Keyword โรค": "ต้อหิน"
 },
 {
  "No": 279,
  "Keyword โรค": "จอตาลอก"
 },
 {
  "No": 280,
  "Keyword โรค": "จุดภาพชัดที่จอตาเสื่อมในผู้สูงอายุ"
 },
 {
  "No": 281,
  "Keyword โรค": "หลอดเลือดแดงหลักของจอตาอุดตัน"
 },
 {
  "No": 282,
  "Keyword โรค": "กระจกตาอักเสบ"
 },
 {
  "No": 283,
  "Keyword โรค": "แผลกระจกตา"
 },
 {
  "No": 284,
  "Keyword โรค": "ม่านตาอักเสบ"
 },
 {
  "No": 285,
  "Keyword โรค": "เลือดออกใต้ตาขาว"
 },
 {
  "No": 286,
  "Keyword โรค": "ตาได้รับบาดเจ็บรุนแรง"
 },
 {
  "No": 287,
  "Keyword โรค": "สิ่งแปลกปลอมเข้าตา"
 },
 {
  "No": 288,
  "Keyword โรค": "เริม"
 },
 {
  "No": 289,
  "Keyword โรค": "งูสวัด"
 },
 {
  "No": 290,
  "Keyword โรค": "หูด"
 },
 {
  "No": 291,
  "Keyword โรค": "หงอนไก่"
 },
 {
  "No": 292,
  "Keyword โรค": "หูดข้าวสุก"
 },
 {
  "No": 293,
  "Keyword โรค": "กลาก"
 },
 {
  "No": 294,
  "Keyword โรค": "เกลื้อน"
 },
 {
  "No": 295,
  "Keyword โรค": "โรคเชื้อราแคนดิดา"
 },
 {
  "No": 296,
  "Keyword โรค": "โรคติดเชื้อแบคทีเรียของผิวหนัง"
 },
 {
  "No": 297,
  "Keyword โรค": "ฝี"
 },
 {
  "No": 298,
  "Keyword โรค": "แผลผุพอง"
 },
 {
  "No": 299,
  "Keyword โรค": "แผลอักเสบ"
 },
 {
  "No": 300,
  "Keyword โรค": "เนื้อเยื่อใต้ผิวหนังชั้นลึกอักเสบ"
 },
 {
  "No": 301,
  "Keyword โรค": "ไฟลามทุ่ง"
 },
 {
  "No": 302,
  "Keyword โรค": "ฝีเต้านม"
 },
 {
  "No": 303,
  "Keyword โรค": "ต่อมน้ำเหลืองอักเสบ"
 },
 {
  "No": 304,
  "Keyword โรค": "หิด"
 },
 {
  "No": 305,
  "Keyword โรค": "เหา"
 },
 {
  "No": 306,
  "Keyword โรค": "โรคเรื้อน"
 },
 {
  "No": 307,
  "Keyword โรค": "ลมพิษ"
 },
 {
  "No": 308,
  "Keyword โรค": "ผิวหนังอักเสบจากการสัมผัส"
 },
 {
  "No": 309,
  "Keyword โรค": "ผิวหนังอักเสบจากภูมิแพ้"
 },
 {
  "No": 310,
  "Keyword โรค": "ผิวหนังอักเสบชนิดเกล็ดรังแค"
 },
 {
  "No": 311,
  "Keyword โรค": "รังแค"
 },
 {
  "No": 312,
  "Keyword โรค": "ผมร่วงผมบาง"
 },
 {
  "No": 313,
  "Keyword โรค": "ผมร่วงตามธรรมชาติ"
 },
 {
  "No": 314,
  "Keyword โรค": "ผมร่วงกรรมพันธุ์"
 },
 {
  "No": 315,
  "Keyword โรค": "ผมร่วงจากซิฟิลิส"
 },
 {
  "No": 316,
  "Keyword โรค": "ผมร่วงเนื่องจากผมหยุดเจริญชั่วคราว"
 },
 {
  "No": 317,
  "Keyword โรค": "ผมร่วงจากโรคอื่นๆ"
 },
 {
  "No": 318,
  "Keyword โรค": "ผมร่วงจากยาและการฉายรังสี"
 },
 {
  "No": 319,
  "Keyword โรค": "โรคผมร่วงหย่อมไม่ทราบสาเหตุ"
 },
 {
  "No": 320,
  "Keyword โรค": "ผมร่วงจากเชื้อรา"
 },
 {
  "No": 321,
  "Keyword โรค": "ผมร่วงจากการถอนผม"
 },
 {
  "No": 322,
  "Keyword โรค": "รอยแผลเป็นที่หนังศีรษะ"
 },
 {
  "No": 323,
  "Keyword โรค": "ผมร่วงจากการทำผม"
 },
 {
  "No": 324,
  "Keyword โรค": "กลากน้ำนม"
 },
 {
  "No": 325,
  "Keyword โรค": "โรคด่างขาว"
 },
 {
  "No": 326,
  "Keyword โรค": "ผื่นพีอาร์"
 },
 {
  "No": 327,
  "Keyword โรค": "โซริอาซิสโรคสะเก็ดเงิน"
 },
 {
  "No": 328,
  "Keyword โรค": "กลากน้ำนม"
 },
 {
  "No": 329,
  "Keyword โรค": "โรคด่างขาว"
 },
 {
  "No": 330,
  "Keyword โรค": "สิว"
 },
 {
  "No": 331,
  "Keyword โรค": "ฝ้า"
 },
 {
  "No": 332,
  "Keyword โรค": "คีลอยด์"
 },
 {
  "No": 333,
  "Keyword โรค": "ตาปลา"
 },
 {
  "No": 334,
  "Keyword โรค": "หนังหนาด้าน"
 },
 {
  "No": 335,
  "Keyword โรค": "กลุ่มอาการสตีเวนส์จอห์นสัน"
 },
 {
  "No": 336,
  "Keyword โรค": "หนองใน"
 },
 {
  "No": 337,
  "Keyword โรค": "หนองในเทียม"
 },
 {
  "No": 338,
  "Keyword โรค": "แผลริมอ่อน"
 },
 {
  "No": 339,
  "Keyword โรค": "ซิฟิลิส"
 },
 {
  "No": 340,
  "Keyword โรค": "ฝีมะม่วง"
 },
 {
  "No": 341,
  "Keyword โรค": "กระดูกหัก"
 },
 {
  "No": 342,
  "Keyword โรค": "กระดูกซี่โครงหัก"
 },
 {
  "No": 343,
  "Keyword โรค": "กระดูกติดคอ"
 },
 {
  "No": 344,
  "Keyword โรค": "จมน้ำ"
 },
 {
  "No": 345,
  "Keyword โรค": "ไฟฟ้าช็อต"
 },
 {
  "No": 346,
  "Keyword โรค": "บาดแผลไฟไหม้น้ำร้อนลวก"
 },
 {
  "No": 347,
  "Keyword โรค": "โรคลมจากความร้อน"
 },
 {
  "No": 348,
  "Keyword โรค": "ภาวะตัวเย็นเกิน"
 },
 {
  "No": 349,
  "Keyword โรค": "กินสารพิษ"
 },
 {
  "No": 350,
  "Keyword โรค": "พิษปลาปักเป้า"
 },
 {
  "No": 351,
  "Keyword โรค": "พิษแมงดาถ้วย"
 },
 {
  "No": 352,
  "Keyword โรค": "พิษปลาทะเล"
 },
 {
  "No": 353,
  "Keyword โรค": "พิษหอยทะเล"
 },
 {
  "No": 354,
  "Keyword โรค": "พิษคางคก"
 },
 {
  "No": 355,
  "Keyword โรค": "พิษเห็ด"
 },
 {
  "No": 356,
  "Keyword โรค": "ตะกั่วเป็นพิษ"
 },
 {
  "No": 357,
  "Keyword โรค": "งูกัด"
 },
 {
  "No": 358,
  "Keyword โรค": "สัตว์กัด"
 },
 {
  "No": 359,
  "Keyword โรค": "แมลงต่อย"
 },
 {
  "No": 360,
  "Keyword โรค": "พิษจากแมลง"
 },
 {
  "No": 361,
  "Keyword โรค": "เห็บกัด"
 },
 {
  "No": 362,
  "Keyword โรค": "แมงมุมกัด"
 },
 {
  "No": 363,
  "Keyword โรค": "แมงป่องต่อย"
 },
 {
  "No": 364,
  "Keyword โรค": "ตะขาบกัด"
 },
 {
  "No": 365,
  "Keyword โรค": "พิษแมงกะพรุน"
 },
 {
  "No": 366,
  "Keyword โรค": "ปลิงเข้าอวัยวะ"
 },
 {
  "No": 367,
  "Keyword โรค": "มาลาเรีย"
 },
 {
  "No": 368,
  "Keyword โรค": "ไข้เลือดออก"
 },
 {
  "No": 369,
  "Keyword โรค": "ไข้ปวดข้อยุงลาย"
 },
 {
  "No": 370,
  "Keyword โรค": "ไข้ซิกา"
 },
 {
  "No": 371,
  "Keyword โรค": "สครับไทฟัส"
 },
 {
  "No": 372,
  "Keyword โรค": "ไข้ฉี่หนู"
 },
 {
  "No": 373,
  "Keyword โรค": "โลหิตเป็นพิษ"
 },
 {
  "No": 374,
  "Keyword โรค": "โลหิตเป็นพิษในทารกแรกเกิด"
 },
 {
  "No": 375,
  "Keyword โรค": "โรคมือ-เท้า-ปาก"
 },
 {
  "No": 376,
  "Keyword โรค": "เมลิออยโดซิส"
 },
 {
  "No": 377,
  "Keyword โรค": "แอนแทรกซ์"
 },
 {
  "No": 378,
  "Keyword โรค": "บรูเซลโลซิส"
 },
 {
  "No": 379,
  "Keyword โรค": "โรคพยาธิไส้เดือน"
 },
 {
  "No": 380,
  "Keyword โรค": "โรคพยาธิเส้นด้าย"
 },
 {
  "No": 381,
  "Keyword โรค": "โรคพยาธิตัวตืด"
 },
 {
  "No": 382,
  "Keyword โรค": "โรคพยาธิปากขอ"
 },
 {
  "No": 383,
  "Keyword โรค": "โรคพยาธิแส้ม้า"
 },
 {
  "No": 384,
  "Keyword โรค": "ทริคิโนซิส"
 },
 {
  "No": 385,
  "Keyword โรค": "โรคพยาธิตัวจี๊ด"
 },
 {
  "No": 386,
  "Keyword โรค": "มะเร็ง"
 },
 {
  "No": 387,
  "Keyword โรค": "มะเร็งผิวหนัง"
 },
 {
  "No": 388,
  "Keyword โรค": "มะเร็งเต้านม"
 },
 {
  "No": 389,
  "Keyword โรค": "มะเร็งปากมดลูก"
 },
 {
  "No": 390,
  "Keyword โรค": "มะเร็งเยื่อบุมดลูก"
 },
 {
  "No": 391,
  "Keyword โรค": "มะเร็งรังไข่"
 },
 {
  "No": 392,
  "Keyword โรค": "มะเร็งปอด"
 },
 {
  "No": 393,
  "Keyword โรค": "มะเร็งกล่องเสียง"
 },
 {
  "No": 394,
  "Keyword โรค": "มะเร็งโพรงหลังจมูก"
 },
 {
  "No": 395,
  "Keyword โรค": "มะเร็งทอนซิล"
 },
 {
  "No": 396,
  "Keyword โรค": "มะเร็งหลอดอาหาร"
 },
 {
  "No": 397,
  "Keyword โรค": "มะเร็งกระเพาะอาหาร"
 },
 {
  "No": 398,
  "Keyword โรค": "มะเร็งลำไส้เล็ก"
 },
 {
  "No": 399,
  "Keyword โรค": "มะเร็งลำไส้ใหญ่และไส้ตรง"
 },
 {
  "No": 400,
  "Keyword โรค": "มะเร็งตับอ่อน"
 },
 {
  "No": 401,
  "Keyword โรค": "มะเร็งต่อมลูกหมาก"
 },
 {
  "No": 402,
  "Keyword โรค": "มะเร็งกระเพาะปัสสาวะ"
 },
 {
  "No": 403,
  "Keyword โรค": "มะเร็งอัณฑะ"
 },
 {
  "No": 404,
  "Keyword โรค": "มะเร็งไต"
 },
 {
  "No": 405,
  "Keyword โรค": "มะเร็งกระดูก"
 },
 {
  "No": 406,
  "Keyword โรค": "มะเร็งลูกตาในเด็ก"
 },
 {
  "No": 407,
  "Keyword โรค": "เอดส์"
 },
 {
  "No": 408,
  "Keyword โรค": "ซาร์ส"
 },
 {
  "No": 409,
  "Keyword โรค": "ไข้หวัดนก"
 },
 {
  "No": 410,
  "Keyword โรค": "โควิด-19"
 },
 {
  "No": 411,
  "Keyword โรค": "โรคลำไส้อักเสบเรื้อรัง"
 },
 {
  "No": 412,
  "Keyword โรค": "ไขมันพอกตับ"
 },
 {
  "No": 413,
  "Keyword โรค": "โรคขาอยู่ไม่สุข"
 },
 {
  "No": 414,
  "Keyword โรค": "ฝีดาษลิง"
 },
 {
  "No": 415,
  "Keyword โรค": "ภาวะเหงื่อออกมากโดยไม่ทราบสาเหตุ"
 },
 {
  "No": 416,
  "Keyword โรค": "ตาแห้ง"
 },
 {
  "No": 417,
  "Keyword โรค": "โรคสั่นโดยไม่ทราบสาเหตุ"
 },
 {
  "No": 418,
  "Keyword โรค": "ภาวะน้ำเกินในโพรงสมอง"
 }
]
}