{
    "อาการ":[
        {"No": 1,"Keyword": "ไข้"},
        {"No": 2,"Keyword": "หวัด"},
        {"No": 3,"Keyword": "ไอ"},
        {"No": 4,"Keyword": "มีน้ำมูก"},
        {"No": 5,"Keyword": "หายใจลำบาก"},
        {"No": 6,"Keyword": "จุดแดง"},
        {"No": 7,"Keyword": "จ้ำเขียว"},
        {"No": 8,"Keyword": "ผื่นแดง"},
        {"No": 9,"Keyword": "ตุ่ม"},
        {"No": 10,"Keyword": "เหนื่อยง่าย"},
        {"No": 11,"Keyword": "เพลีย"},
        {"No": 12,"Keyword": "ผอมลง"},
        {"No": 13,"Keyword": "อ้วนขึ้น"},
        {"No": 14,"Keyword": "ซีด"},
        {"No": 15,"Keyword": "ฟกช้ำ"},
        {"No": 16,"Keyword": "ตัวเหลือง"},
        {"No": 17,"Keyword": "ปัสสาวะเหลือง"},
        {"No": 18,"Keyword": "บวม"},
        {"No": 19,"Keyword": "ก้อน"},
        {"No": 20,"Keyword": "หน้ามืด"},
        {"No": 21,"Keyword": "สลบ"},
        {"No": 22,"Keyword": "หายใจเร็ว"},
        {"No": 23,"Keyword": "ตาค้าง"},
        {"No": 24,"Keyword": "หมดสติ"},
        {"No": 25,"Keyword": "ชัก"},
        {"No": 26,"Keyword": "ปวดน่อง"},
        {"No": 27,"Keyword": "ต่อมน้ำเหลืองโต"},
        {"No": 28,"Keyword": "ขยับเขยื้อนไม่ได้"},
        {"No": 29,"Keyword": "ไม่มีแรง"},
        {"No": 30,"Keyword": "เหน็บ"},
        {"No": 31,"Keyword": "ชา"},
        {"No": 32,"Keyword": "ปวดหัว"},
        {"No": 33,"Keyword": "เวียนหัว"},
        {"No": 34,"Keyword": "ปวดตา"},
        {"No": 35,"Keyword": "เจ็บตา"},
        {"No": 36,"Keyword": "มองเห็นไม่ชัด"},
        {"No": 37,"Keyword": "เห็นภาพซ้อน"},
        {"No": 38,"Keyword": "ขี้ตาแฉะ"},
        {"No": 39,"Keyword": "ฝุ่นเข้าตา"},
        {"No": 40,"Keyword": "เจ็บหู"},
        {"No": 41,"Keyword": "ไม่ได้ยินเสียง"},
        {"No": 42,"Keyword": "ได้ยินไม่ชัด"},
        {"No": 43,"Keyword": "หูอักเสบ"},
        {"No": 44,"Keyword": "แน่นจมูก"},
        {"No": 45,"Keyword": "เลือดออกจมูก"},
        {"No": 46,"Keyword": "ปวดฟัน"},
        {"No": 47,"Keyword": "เลือดออกจากไรฟัน"},
        {"No": 48,"Keyword": "ฟันผุ"},
        {"No": 49,"Keyword": "เหงือกอักเสบ"},
        {"No": 50,"Keyword": "กลืนอาหารไม่ลง"},
        {"No": 51,"Keyword": "เจ็บคอ"},
        {"No": 52,"Keyword": "แผล"},
        {"No": 53,"Keyword": "เสียงแหบ"},
        {"No": 54,"Keyword": "กระดูกซี่โครงหัก"},
        {"No": 55,"Keyword": "จุกแน่น"},
        {"No": 56,"Keyword": "ใจเต้นเร็ว"},
        {"No": 57,"Keyword": "อาเจียน"},
        {"No": 58,"Keyword": "เจ็บท้อง"},
        {"No": 59,"Keyword": "ท้องอืด"},
        {"No": 60,"Keyword": "ท้องเฟ้อ"},
        {"No": 61,"Keyword": "ปวดบิด"},
        {"No": 62,"Keyword": "ปวดท้องน้อย"},
        {"No": 63,"Keyword": "ปวดประจำเดือน"},
        {"No": 64,"Keyword": "ท้องเสีย"},
        {"No": 65,"Keyword": "ถ่ายเหลว"},
        {"No": 66,"Keyword": "ถ่ายเป็นเลือด"},
        {"No": 67,"Keyword": "ถ่ายไม่ออก"},
        {"No": 68,"Keyword": "ปวดข้อ"},
        {"No": 69,"Keyword": "ปวดตัว"},
        {"No": 70,"Keyword": "เจ็บกล้ามเนื้อ"},
        {"No": 71,"Keyword": "กล้ามเนื้ออักเสบ"},
        {"No": 72,"Keyword": "ฉี่ไม่ออก"},
        {"No": 73,"Keyword": "ฉี่บ่อย"},
        {"No": 74,"Keyword": "ฉี่ไม่ใส"},
        {"No": 75,"Keyword": "ประจำเดือนขาด"},
        {"No": 76,"Keyword": "ประจำเดือนขาว"},
        {"No": 77,"Keyword": "ตกเลือด"},
        {"No": 78,"Keyword": "เลือดออก"},
        {"No": 79,"Keyword": "เป็นแผลที่อวัยวะเพศ"},
        {"No": 80,"Keyword": "ตุ่มที่อวัยวะเพศ"},
        {"No": 81,"Keyword": "ผื่น"},
        {"No": 82,"Keyword": "คัน"},
        {"No": 83,"Keyword": "หัวล้าน"},
        {"No": 84,"Keyword": "แมลงกัด"},
        {"No": 85,"Keyword": "แมลงต่อย"},
        {"No": 86,"Keyword": "งูกัด"},
        {"No": 87,"Keyword": "ตาบวม"},
        {"No": 88,"Keyword": "คอพอก"},
        {"No": 89,"Keyword": "ต่อมไทรอยด์โต"},
        {"No": 90,"Keyword": "อัณฑะบวม"},
        {"No": 91,"Keyword": "นอนไม่หลับ"},
        {"No": 92,"Keyword": "เบื่ออาหาร"},
        {"No": 93,"Keyword": "ปวดแขนขา"},
        {"No": 94,"Keyword": "ปวดคอ"},
        {"No": 95,"Keyword": "มือสั่น"},
        {"No": 96,"Keyword": "เหงื่อออกมาก"},
        {"No": 97,"Keyword": "ทรงตัวไม่ได้"}
    ],
    "โรค":[
        {"No": 1,"Keyword": "ไข้หวัด"},
        {"No": 2,"Keyword": "ไข้หวัดใหญ่"},
        {"No": 3,"Keyword": "หัด"},
        {"No": 4,"Keyword": "หัดเยอรมัน"},
        {"No": 5,"Keyword": "ไข้ผื่นกุหลาบในทารก"},
        {"No": 6,"Keyword": "อีสุกอีใส"},
        {"No": 7,"Keyword": "คางทูม"},
        {"No": 8,"Keyword": "คอหอยอักเสบ"},
        {"No": 9,"Keyword": "ทอนซิลอักเสบ"},
        {"No": 10,"Keyword": "อีดำอีแดง"},
        {"No": 11,"Keyword": "คอตีบ"},
        {"No": 12,"Keyword": "ครู้ป"},
        {"No": 13,"Keyword": "กล่องเสียงอักเสบ"},
        {"No": 14,"Keyword": "ไอกรน"},
        {"No": 15,"Keyword": "วัณโรคปอด"},
        {"No": 16,"Keyword": "หลอดลมอักเสบเฉียบพลัน"},
        {"No": 17,"Keyword": "ภาวะปอดอุดกั้นเรื้อรัง"},
        {"No": 18,"Keyword": "หลอดลมอักเสบเรื้อรัง"},
        {"No": 19,"Keyword": "ถุงลมปอดโป่งพอง"},
        {"No": 20,"Keyword": "หลอดลมพอง"},
        {"No": 21,"Keyword": "หลอดลมฝอยอักเสบ"},
        {"No": 22,"Keyword": "ปอดอักเสบ"},
        {"No": 23,"Keyword": "ภาวะมีหนองในโพรงเยื่อหุ้มปอด"},
        {"No": 24,"Keyword": "ภาวะมีน้ำในโพรงเยื่อหุ้มปอด"},
        {"No": 25,"Keyword": "เยื่อหุ้มปอดอักเสบ"},
        {"No": 26,"Keyword": "ปอดทะลุ"},
        {"No": 27,"Keyword": "สำลักอาหาร"},
        {"No": 28,"Keyword": "ทางเดินหายใจอุดกั้นจากสิ่งแปลกปลอม"},
        {"No": 29,"Keyword": "หืด"},
        {"No": 30,"Keyword": "หวัดภูมิแพ้"},
        {"No": 31,"Keyword": "ไซนัสอักเสบ"},
        {"No": 32,"Keyword": "เยื่อจมูกอักเสบเป็นหนอง"},
        {"No": 33,"Keyword": "ติ่งเนื้อเมือกจมูก"},
        {"No": 34,"Keyword": "ผนังกั้นจมูกคด"},
        {"No": 35,"Keyword": "เลือดกำเดา"},
        {"No": 36,"Keyword": "สิ่งแปลกปลอมเข้าจมูก"},
        {"No": 37,"Keyword": "ภาวะหยุดหายใจขณะหลับ"},
        {"No": 38,"Keyword": "ท้องเดิน"},
        {"No": 39,"Keyword": "ท้องเดินจากไวรัส"},
        {"No": 40,"Keyword": "ท้องเดินจากเชื้อไกอาร์เดีย"},
        {"No": 41,"Keyword": "โรคลำไส้แปรปรวน"},
        {"No": 42,"Keyword": "ภาวะพร่องแล็กเทส"},
        {"No": 43,"Keyword": "อาหารเป็นพิษ"},
        {"No": 44,"Keyword": "อาหารเป็นพิษจากเชื้อโรค"},
        {"No": 45,"Keyword": "อหิวาต์"},
        {"No": 46,"Keyword": "บิด"},
        {"No": 47,"Keyword": "บิดชิเกลลา"},
        {"No": 48,"Keyword": "บิดอะมีบา"},
        {"No": 49,"Keyword": "ไทฟอยด์"},
        {"No": 50,"Keyword": "ตับอักเสบจากไวรัส"},
        {"No": 51,"Keyword": "ฝีตับอะมีบา"},
        {"No": 52,"Keyword": "นิ่วน้ำดี"},
        {"No": 53,"Keyword": "ถุงน้ำดีอักเสบ"},
        {"No": 54,"Keyword": "ท่อน้ำดีอักเสบ"},
        {"No": 55,"Keyword": "ดีซ่านสรีระในทารกแรกเกิด"},
        {"No": 56,"Keyword": "ท่อน้ำดีตีบตันในทารก"},
        {"No": 57,"Keyword": "ตับแข็ง"},
        {"No": 58,"Keyword": "มะเร็งตับ"},
        {"No": 59,"Keyword": "โรคพยาธิใบไม้ตับ"},
        {"No": 60,"Keyword": "ไส้ติ่งอักเสบ"},
        {"No": 61,"Keyword": "เยื่อบุช่องท้องอักเสบ"},
        {"No": 62,"Keyword": "ตับอ่อนอักเสบเฉียบพลัน"},
        {"No": 63,"Keyword": "อาหารไม่ย่อย"},
        {"No": 64,"Keyword": "โรคกรดไหลย้อน"},
        {"No": 65,"Keyword": "กระเพาะอาหารอักเสบ"},
        {"No": 66,"Keyword": "แผลเพ็ปติก"},
        {"No": 67,"Keyword": "กระเพาะอาหารทะลุ"},
        {"No": 68,"Keyword": "กระเพาะอาหารแตก"},
        {"No": 69,"Keyword": "กระเพาะอาหารอุดกั้น"},
        {"No": 70,"Keyword": "ลำไส้อุดกั้น"},
        {"No": 71,"Keyword": "อาเจียนในเด็ก"},
        {"No": 72,"Keyword": "ตับฉีกขาด"},
        {"No": 73,"Keyword": "ม้ามฉีกขาด"},
        {"No": 74,"Keyword": "ไตฉีกขาด"},
        {"No": 75,"Keyword": "เลือดตกใน"},
        {"No": 76,"Keyword": "ไส้เลื่อน"},
        {"No": 77,"Keyword": "ริดสีดวงทวาร"},
        {"No": 78,"Keyword": "แผลปริที่ปากทวาร"},
        {"No": 79,"Keyword": "ฝีรอบทวารหนัก"},
        {"No": 80,"Keyword": "ฝีคัณฑสูตร"},
        {"No": 81,"Keyword": "แผลเปื่อยที่ปาก"},
        {"No": 82,"Keyword": "แผลแอฟทัส"},
        {"No": 83,"Keyword": "แผลเปื่อยที่เกิดจากการบาดเจ็บ"},
        {"No": 84,"Keyword": "เริมในช่องปากชนิดเฉียบพลัน"},
        {"No": 85,"Keyword": "เฮอร์แปงไจนา"},
        {"No": 86,"Keyword": "ปากนกกระจอก"},
        {"No": 87,"Keyword": "โรคเชื้อราในช่องปาก"},
        {"No": 88,"Keyword": "มุมปากเปื่อยจากเชื้อรา"},
        {"No": 89,"Keyword": "มะเร็งช่องปาก"},
        {"No": 90,"Keyword": "ปวดฟันฟันผุ"},
        {"No": 91,"Keyword": "เหงือกอักเสบ"},
        {"No": 92,"Keyword": "ฟันเหลืองดำ"},
        {"No": 93,"Keyword": "โปลิโอ"},
        {"No": 94,"Keyword": "กลุ่มอาการกิลเลนบาร์เร"},
        {"No": 95,"Keyword": "โรคพิษสุนัขบ้า"},
        {"No": 96,"Keyword": "สมองอักเสบ"},
        {"No": 97,"Keyword": "โรคเรย์ซินโดรม"},
        {"No": 98,"Keyword": "เยื่อหุ้มสมองอักเสบ"},
        {"No": 99,"Keyword": "ไข้กาฬหลังแอ่น"},
        {"No": 100,"Keyword": "บาดทะยัก"},
        {"No": 101,"Keyword": "โบทูลิซึม"},
        {"No": 102,"Keyword": "ชักจากไข้"},
        {"No": 103,"Keyword": "ชักในทารกแรกเกิด"},
        {"No": 104,"Keyword": "โรคลมชักลมบ้าหมู"},
        {"No": 105,"Keyword": "ไมเกรน"},
        {"No": 106,"Keyword": "ปวดศีรษะคลัสเตอร์"},
        {"No": 107,"Keyword": "ปวดศีรษะจากความเครียด"},
        {"No": 108,"Keyword": "หลอดเลือดแดงขมับอักเสบ"},
        {"No": 109,"Keyword": "เวียนศีรษะบ้านหมุน"},
        {"No": 110,"Keyword": "เมารถเมาเรือ"},
        {"No": 111,"Keyword": "เป็นลม"},
        {"No": 112,"Keyword": "หมดสติ"},
        {"No": 113,"Keyword": "โรคหลอดเลือดสมอง"},
        {"No": 114,"Keyword": "สมองขาดเลือดชั่วขณะ"},
        {"No": 115,"Keyword": "อัมพาตครึ่งซีก"},
        {"No": 116,"Keyword": "อัมพาตเบลล์"},
        {"No": 117,"Keyword": "เบลล์พัลซี"},
        {"No": 118,"Keyword": "โรคปวดเส้นประสาทใบหน้า"},
        {"No": 119,"Keyword": "ภาวะโพแทสเซียมในเลือดต่ำ"},
        {"No": 120,"Keyword": "อัมพาตครั้งคราว"},
        {"No": 121,"Keyword": "ไมแอสทีเนียเกรวิส"},
        {"No": 122,"Keyword": "โรคพาร์กินสัน"},
        {"No": 123,"Keyword": "สมองพิการ"},
        {"No": 124,"Keyword": "ศีรษะได้รับบาดเจ็บ"},
        {"No": 125,"Keyword": "เลือดออกในสมอง"},
        {"No": 126,"Keyword": "ฝีสมอง"},
        {"No": 127,"Keyword": "เนื้องอกสมอง"},
        {"No": 128,"Keyword": "ไขสันหลังอักเสบเฉียบพลัน"},
        {"No": 129,"Keyword": "ไขสันหลังได้รับบาดเจ็บ"},
        {"No": 130,"Keyword": "เนื้องอกไขสันหลัง"},
        {"No": 131,"Keyword": "ปลายประสาทอักเสบ"},
        {"No": 132,"Keyword": "โรควิตกกังวลโรคกังวลทั่วไป"},
        {"No": 133,"Keyword": "โรคแพนิก"},
        {"No": 134,"Keyword": "โรคอารมณ์แปรปรวนโรคซึมเศร้า"},
        {"No": 135,"Keyword": "กลุ่มอาการระบายลมหายใจเกิน"},
        {"No": 136,"Keyword": "เด็กไม่อยากไปโรงเรียน"},
        {"No": 137,"Keyword": "ช็อก"},
        {"No": 138,"Keyword": "ความดันโลหิตสูง"},
        {"No": 139,"Keyword": "หลอดเลือดแดงใหญ่โป่งพอง"},
        {"No": 140,"Keyword": "ภาวะเลือดเซาะผนังหลอดเลือดแดงใหญ่"},
        {"No": 141,"Keyword": "ความดันตกในท่ายืน"},
        {"No": 142,"Keyword": "ไข้รูมาติก"},
        {"No": 143,"Keyword": "โรคหัวใจรูมาติก"},
        {"No": 144,"Keyword": "เยื่อบุหัวใจอักเสบ"},
        {"No": 145,"Keyword": "โรคหัวใจขาดเลือด"},
        {"No": 146,"Keyword": "โรคหลอดเลือดหัวใจตีบ"},
        {"No": 147,"Keyword": "โรคหัวใจขาดเลือดชั่วขณะ"},
        {"No": 148,"Keyword": "โรคกล้ามเนื้อหัวใจตาย"},
        {"No": 149,"Keyword": "หลอดเลือดแดงขาตีบ"},
        {"No": 150,"Keyword": "โรคหัวใจเต้นผิดจังหวะ"},
        {"No": 151,"Keyword": "หัวใจวาย"},
        {"No": 152,"Keyword": "หลอดเลือดขอดที่ขา"},
        {"No": 153,"Keyword": "ภาวะหลอดเลือดดำส่วนลึกมีลิ่มเลือด"},
        {"No": 154,"Keyword": "ภาวะสิ่งหลุดอุดตันหลอดเลือดแดงปอด"},
        {"No": 155,"Keyword": "โลหิตจางจากภาวะขาดธาตุเหล็ก"},
        {"No": 156,"Keyword": "โลหิตจางจากเม็ดเลือดแดงแตก"},
        {"No": 157,"Keyword": "ภาวะพร่องเอนไซม์จี-6-พีดี"},
        {"No": 158,"Keyword": "เม็ดเลือดแดงแตกในทารกแรกเกิด"},
        {"No": 159,"Keyword": "โลหิตจางจากไขกระดูกฝ่อ"},
        {"No": 160,"Keyword": "ไอทีพี"},
        {"No": 161,"Keyword": "ฮีโมฟิเลีย"},
        {"No": 162,"Keyword": "ธาลัสซีเมีย"},
        {"No": 163,"Keyword": "มะเร็งเม็ดเลือดขาว"},
        {"No": 164,"Keyword": "มะเร็งต่อมน้ำเหลือง"},
        {"No": 165,"Keyword": "ปวดกล้ามเนื้อหลัง"},
        {"No": 166,"Keyword": "รากประสาทถูกกด"},
        {"No": 167,"Keyword": "หมอนรองกระดูกสันหลังเคลื่อน"},
        {"No": 168,"Keyword": "โพรงกระดูกสันหลังแคบ"},
        {"No": 169,"Keyword": "กระดูกคอเสื่อม"},
        {"No": 170,"Keyword": "กระดูกคองอกกดรากประสาท"},
        {"No": 171,"Keyword": "ข้อเสื่อม"},
        {"No": 172,"Keyword": "ข้อเข่าเสื่อม"},
        {"No": 173,"Keyword": "โรคข้ออักเสบรูมาตอยด์"},
        {"No": 174,"Keyword": "ข้อสันหลังอักเสบเรื้อรัง"},
        {"No": 175,"Keyword": "เอสแอลอี"},
        {"No": 176,"Keyword": "ข้ออักเสบชนิดติดเชื้อเฉียบพลัน"},
        {"No": 177,"Keyword": "ข้อเคล็ด"},
        {"No": 178,"Keyword": "เส้นเอ็นอักเสบ"},
        {"No": 179,"Keyword": "ปลอกหุ้มเอ็นอักเสบ"},
        {"No": 180,"Keyword": "พังผืดส้นเท้าอักเสบ"},
        {"No": 181,"Keyword": "เส้นประสาทมือถูกพังผืดรัดแน่น"},
        {"No": 182,"Keyword": "ตะคริว"},
        {"No": 183,"Keyword": "เบาหวาน"},
        {"No": 184,"Keyword": "เบาจืด"},
        {"No": 185,"Keyword": "ไขมันในเลือดผิดปกติ"},
        {"No": 186,"Keyword": "ภาวะน้ำตาลในเลือดต่ำ"},
        {"No": 187,"Keyword": "ภาวะแคลเซียมในเลือดต่ำ"},
        {"No": 188,"Keyword": "คอพอก"},
        {"No": 189,"Keyword": "ต่อมไทรอยด์โต"},
        {"No": 190,"Keyword": "ภาวะต่อมไทรอยด์ทำงานเกิน"},
        {"No": 191,"Keyword": "พิษจากไทรอยด์"},
        {"No": 192,"Keyword": "คอพอกเป็นพิษ"},
        {"No": 193,"Keyword": "ต่อมไทรอยด์อักเสบ"},
        {"No": 194,"Keyword": "มะเร็งไทรอยด์"},
        {"No": 195,"Keyword": "ภาวะขาดไทรอยด์"},
        {"No": 196,"Keyword": "ต่อมไทรอยด์ทำงานน้อย"},
        {"No": 197,"Keyword": "โรคคุชชิง"},
        {"No": 198,"Keyword": "โรคแอดดิสัน"},
        {"No": 199,"Keyword": "โรคชีแฮน"},
        {"No": 200,"Keyword": "โรคเกาต์"},
        {"No": 201,"Keyword": "โรคของหญิงวัยหมดประจำเดือน"},
        {"No": 202,"Keyword": "กระดูกพรุน"},
        {"No": 203,"Keyword": "โรคขาดอาหารในเด็ก"},
        {"No": 204,"Keyword": "โรคขาดวิตามินเอ"},
        {"No": 205,"Keyword": "โรคเหน็บชา"},
        {"No": 206,"Keyword": "โรคลักปิดลักเปิด"},
        {"No": 207,"Keyword": "ภาวะไตวาย"},
        {"No": 208,"Keyword": "โรคไตเนโฟรติก"},
        {"No": 209,"Keyword": "หน่วยไตอักเสบเฉียบพลัน"},
        {"No": 210,"Keyword": "กรวยไตอักเสบ"},
        {"No": 211,"Keyword": "กรวยไตอักเสบเฉียบพลัน"},
        {"No": 212,"Keyword": "กรวยไตอักเสบเรื้อรัง"},
        {"No": 213,"Keyword": "นิ่วไต"},
        {"No": 214,"Keyword": "นิ่วท่อไต"},
        {"No": 215,"Keyword": "นิ่วกระเพาะปัสสาวะ"},
        {"No": 216,"Keyword": "กระเพาะปัสสาวะอักเสบ"},
        {"No": 217,"Keyword": "ท่อปัสสาวะตีบ"},
        {"No": 218,"Keyword": "ต่อมลูกหมากโต"},
        {"No": 219,"Keyword": "ต่อมลูกหมากอักเสบ"},
        {"No": 220,"Keyword": "หนังหุ้มปลายองคชาตตีบ"},
        {"No": 221,"Keyword": "ถุงน้ำที่ถุงอัณฑะ"},
        {"No": 222,"Keyword": "หลอดเลือดอัณฑะขอด"},
        {"No": 223,"Keyword": "อัณฑะบิดตัว"},
        {"No": 224,"Keyword": "ปีกมดลูกอักเสบ"},
        {"No": 225,"Keyword": "เยื่อบุมดลูกอักเสบ"},
        {"No": 226,"Keyword": "ตกขาวธรรมดา"},
        {"No": 227,"Keyword": "ช่องคลอดอักเสบ"},
        {"No": 228,"Keyword": "ช่องคลอดอักเสบจากเชื้อรา"},
        {"No": 229,"Keyword": "ช่องคลอดอักเสบจากเชื้อทริโคโมแนส"},
        {"No": 230,"Keyword": "ปวดประจำเดือน"},
        {"No": 231,"Keyword": "ประจำเดือนไม่มา"},
        {"No": 232,"Keyword": "ดียูบี"},
        {"No": 233,"Keyword": "เนื้องอกมดลูก"},
        {"No": 234,"Keyword": "เยื่อบุมดลูกต่างที่"},
        {"No": 235,"Keyword": "เนื้องอกรังไข่"},
        {"No": 236,"Keyword": "ถุงน้ำรังไข่"},
        {"No": 237,"Keyword": "กลุ่มอาการถุงน้ำรังไข่ชนิดหลายถุง"},
        {"No": 238,"Keyword": "ภาวะตั้งครรภ์"},
        {"No": 239,"Keyword": "แพ้ท้อง"},
        {"No": 240,"Keyword": "ครรภ์เป็นพิษ"},
        {"No": 241,"Keyword": "แท้งบุตร"},
        {"No": 242,"Keyword": "ครรภ์นอกมดลูก"},
        {"No": 243,"Keyword": "ครรภ์ไข่ปลาอุก"},
        {"No": 244,"Keyword": "รกเกาะต่ำ"},
        {"No": 245,"Keyword": "รกลอกตัวก่อนกำหนด"},
        {"No": 246,"Keyword": "หูชั้นนอกอักเสบ"},
        {"No": 247,"Keyword": "โรคเชื้อราในช่องหู"},
        {"No": 248,"Keyword": "หูชั้นกลางอักเสบ"},
        {"No": 249,"Keyword": "หูชั้นในอักเสบเฉียบพลัน"},
        {"No": 250,"Keyword": "เส้นประสาทการทรงตัวอักเสบ"},
        {"No": 251,"Keyword": "บ้านหมุนจากการเปลี่ยนท่า"},
        {"No": 252,"Keyword": "เนื้องอกประสาทหู"},
        {"No": 253,"Keyword": "โรคเมเนียส์"},
        {"No": 254,"Keyword": "หูตึง"},
        {"No": 255,"Keyword": "หูหนวก"},
        {"No": 256,"Keyword": "เยื่อแก้วหูทะลุ"},
        {"No": 257,"Keyword": "แผลถลอกในช่องหู"},
        {"No": 258,"Keyword": "ขี้หูอุดตันรูหู"},
        {"No": 259,"Keyword": "สิ่งแปลกปลอมเข้าหู"},
        {"No": 260,"Keyword": "หูบาดเจ็บจากความกดดันอากาศ"},
        {"No": 261,"Keyword": "เยื่อตาขาวอักเสบจากเชื้อแบคทีเรีย"},
        {"No": 262,"Keyword": "เยื่อตาขาวอักเสบจากไวรัส"},
        {"No": 263,"Keyword": "เยื่อตาขาวอักเสบจากการแพ้"},
        {"No": 264,"Keyword": "ตาอักเสบจากเชื้อหนองใน"},
        {"No": 265,"Keyword": "ริดสีดวงตา"},
        {"No": 266,"Keyword": "กุ้งยิง"},
        {"No": 267,"Keyword": "หนังตาอักเสบ"},
        {"No": 268,"Keyword": "ท่อน้ำตาอุดตัน"},
        {"No": 269,"Keyword": "ถุงน้ำตาอักเสบ"},
        {"No": 270,"Keyword": "สายตาผิดปกติ"},
        {"No": 271,"Keyword": "สายตาสั้น"},
        {"No": 272,"Keyword": "สายตายาว"},
        {"No": 273,"Keyword": "สายตาผู้สูงอายุ"},
        {"No": 274,"Keyword": "สายตาเอียง"},
        {"No": 275,"Keyword": "ตาเข"},
        {"No": 276,"Keyword": "ต้อเนื้อ"},
        {"No": 277,"Keyword": "ต้อกระจก"},
        {"No": 278,"Keyword": "ต้อหิน"},
        {"No": 279,"Keyword": "จอตาลอก"},
        {"No": 280,"Keyword": "จุดภาพชัดที่จอตาเสื่อมในผู้สูงอายุ"},
        {"No": 281,"Keyword": "หลอดเลือดแดงหลักของจอตาอุดตัน"},
        {"No": 282,"Keyword": "กระจกตาอักเสบ"},
        {"No": 283,"Keyword": "แผลกระจกตา"},
        {"No": 284,"Keyword": "ม่านตาอักเสบ"},
        {"No": 285,"Keyword": "เลือดออกใต้ตาขาว"},
        {"No": 286,"Keyword": "ตาได้รับบาดเจ็บรุนแรง"},
        {"No": 287,"Keyword": "สิ่งแปลกปลอมเข้าตา"},
        {"No": 288,"Keyword": "เริม"},
        {"No": 289,"Keyword": "งูสวัด"},
        {"No": 290,"Keyword": "หูด"},
        {"No": 291,"Keyword": "หงอนไก่"},
        {"No": 292,"Keyword": "หูดข้าวสุก"},
        {"No": 293,"Keyword": "กลาก"},
        {"No": 294,"Keyword": "เกลื้อน"},
        {"No": 295,"Keyword": "โรคเชื้อราแคนดิดา"},
        {"No": 296,"Keyword": "โรคติดเชื้อแบคทีเรียของผิวหนัง"},
        {"No": 297,"Keyword": "ฝี"},
        {"No": 298,"Keyword": "แผลผุพอง"},
        {"No": 299,"Keyword": "แผลอักเสบ"},
        {"No": 300,"Keyword": "เนื้อเยื่อใต้ผิวหนังชั้นลึกอักเสบ"},
        {"No": 301,"Keyword": "ไฟลามทุ่ง"},
        {"No": 302,"Keyword": "ฝีเต้านม"},
        {"No": 303,"Keyword": "ต่อมน้ำเหลืองอักเสบ"},
        {"No": 304,"Keyword": "หิด"},
        {"No": 305,"Keyword": "เหา"},
        {"No": 306,"Keyword": "โรคเรื้อน"},
        {"No": 307,"Keyword": "ลมพิษ"},
        {"No": 308,"Keyword": "ผิวหนังอักเสบจากการสัมผัส"},
        {"No": 309,"Keyword": "ผิวหนังอักเสบจากภูมิแพ้"},
        {"No": 310,"Keyword": "ผิวหนังอักเสบชนิดเกล็ดรังแค"},
        {"No": 311,"Keyword": "รังแค"},
        {"No": 312,"Keyword": "ผมร่วงผมบาง"},
        {"No": 313,"Keyword": "ผมร่วงตามธรรมชาติ"},
        {"No": 314,"Keyword": "ผมร่วงกรรมพันธุ์"},
        {"No": 315,"Keyword": "ผมร่วงจากซิฟิลิส"},
        {"No": 316,"Keyword": "ผมร่วงเนื่องจากผมหยุดเจริญชั่วคราว"},
        {"No": 317,"Keyword": "ผมร่วงจากโรคอื่นๆ"},
        {"No": 318,"Keyword": "ผมร่วงจากยาและการฉายรังสี"},
        {"No": 319,"Keyword": "โรคผมร่วงหย่อมไม่ทราบสาเหตุ"},
        {"No": 320,"Keyword": "ผมร่วงจากเชื้อรา"},
        {"No": 321,"Keyword": "ผมร่วงจากการถอนผม"},
        {"No": 322,"Keyword": "รอยแผลเป็นที่หนังศีรษะ"},
        {"No": 323,"Keyword": "ผมร่วงจากการทำผม"},
        {"No": 324,"Keyword": "กลากน้ำนม"},
        {"No": 325,"Keyword": "โรคด่างขาว"},
        {"No": 326,"Keyword": "ผื่นพีอาร์"},
        {"No": 327,"Keyword": "โซริอาซิสโรคสะเก็ดเงิน"},
        {"No": 328,"Keyword": "กลากน้ำนม"},
        {"No": 329,"Keyword": "โรคด่างขาว"},
        {"No": 330,"Keyword": "สิว"},
        {"No": 331,"Keyword": "ฝ้า"},
        {"No": 332,"Keyword": "คีลอยด์"},
        {"No": 333,"Keyword": "ตาปลา"},
        {"No": 334,"Keyword": "หนังหนาด้าน"},
        {"No": 335,"Keyword": "กลุ่มอาการสตีเวนส์จอห์นสัน"},
        {"No": 336,"Keyword": "หนองใน"},
        {"No": 337,"Keyword": "หนองในเทียม"},
        {"No": 338,"Keyword": "แผลริมอ่อน"},
        {"No": 339,"Keyword": "ซิฟิลิส"},
        {"No": 340,"Keyword": "ฝีมะม่วง"},
        {"No": 341,"Keyword": "กระดูกหัก"},
        {"No": 342,"Keyword": "กระดูกซี่โครงหัก"},
        {"No": 343,"Keyword": "กระดูกติดคอ"},
        {"No": 344,"Keyword": "จมน้ำ"},
        {"No": 345,"Keyword": "ไฟฟ้าช็อต"},
        {"No": 346,"Keyword": "บาดแผลไฟไหม้น้ำร้อนลวก"},
        {"No": 347,"Keyword": "โรคลมจากความร้อน"},
        {"No": 348,"Keyword": "ภาวะตัวเย็นเกิน"},
        {"No": 349,"Keyword": "กินสารพิษ"},
        {"No": 350,"Keyword": "พิษปลาปักเป้า"},
        {"No": 351,"Keyword": "พิษแมงดาถ้วย"},
        {"No": 352,"Keyword": "พิษปลาทะเล"},
        {"No": 353,"Keyword": "พิษหอยทะเล"},
        {"No": 354,"Keyword": "พิษคางคก"},
        {"No": 355,"Keyword": "พิษเห็ด"},
        {"No": 356,"Keyword": "ตะกั่วเป็นพิษ"},
        {"No": 357,"Keyword": "งูกัด"},
        {"No": 358,"Keyword": "สัตว์กัด"},
        {"No": 359,"Keyword": "แมลงต่อย"},
        {"No": 360,"Keyword": "พิษจากแมลง"},
        {"No": 361,"Keyword": "เห็บกัด"},
        {"No": 362,"Keyword": "แมงมุมกัด"},
        {"No": 363,"Keyword": "แมงป่องต่อย"},
        {"No": 364,"Keyword": "ตะขาบกัด"},
        {"No": 365,"Keyword": "พิษแมงกะพรุน"},
        {"No": 366,"Keyword": "ปลิงเข้าอวัยวะ"},
        {"No": 367,"Keyword": "มาลาเรีย"},
        {"No": 368,"Keyword": "ไข้เลือดออก"},
        {"No": 369,"Keyword": "ไข้ปวดข้อยุงลาย"},
        {"No": 370,"Keyword": "ไข้ซิกา"},
        {"No": 371,"Keyword": "สครับไทฟัส"},
        {"No": 372,"Keyword": "ไข้ฉี่หนู"},
        {"No": 373,"Keyword": "โลหิตเป็นพิษ"},
        {"No": 374,"Keyword": "โลหิตเป็นพิษในทารกแรกเกิด"},
        {"No": 375,"Keyword": "โรคมือ-เท้า-ปาก"},
        {"No": 376,"Keyword": "เมลิออยโดซิส"},
        {"No": 377,"Keyword": "แอนแทรกซ์"},
        {"No": 378,"Keyword": "บรูเซลโลซิส"},
        {"No": 379,"Keyword": "โรคพยาธิไส้เดือน"},
        {"No": 380,"Keyword": "โรคพยาธิเส้นด้าย"},
        {"No": 381,"Keyword": "โรคพยาธิตัวตืด"},
        {"No": 382,"Keyword": "โรคพยาธิปากขอ"},
        {"No": 383,"Keyword": "โรคพยาธิแส้ม้า"},
        {"No": 384,"Keyword": "ทริคิโนซิส"},
        {"No": 385,"Keyword": "โรคพยาธิตัวจี๊ด"},
        {"No": 386,"Keyword": "มะเร็ง"},
        {"No": 387,"Keyword": "มะเร็งผิวหนัง"},
        {"No": 388,"Keyword": "มะเร็งเต้านม"},
        {"No": 389,"Keyword": "มะเร็งปากมดลูก"},
        {"No": 390,"Keyword": "มะเร็งเยื่อบุมดลูก"},
        {"No": 391,"Keyword": "มะเร็งรังไข่"},
        {"No": 392,"Keyword": "มะเร็งปอด"},
        {"No": 393,"Keyword": "มะเร็งกล่องเสียง"},
        {"No": 394,"Keyword": "มะเร็งโพรงหลังจมูก"},
        {"No": 395,"Keyword": "มะเร็งทอนซิล"},
        {"No": 396,"Keyword": "มะเร็งหลอดอาหาร"},
        {"No": 397,"Keyword": "มะเร็งกระเพาะอาหาร"},
        {"No": 398,"Keyword": "มะเร็งลำไส้เล็ก"},
        {"No": 399,"Keyword": "มะเร็งลำไส้ใหญ่และไส้ตรง"},
        {"No": 400,"Keyword": "มะเร็งตับอ่อน"},
        {"No": 401,"Keyword": "มะเร็งต่อมลูกหมาก"},
        {"No": 402,"Keyword": "มะเร็งกระเพาะปัสสาวะ"},
        {"No": 403,"Keyword": "มะเร็งอัณฑะ"},
        {"No": 404,"Keyword": "มะเร็งไต"},
        {"No": 405,"Keyword": "มะเร็งกระดูก"},
        {"No": 406,"Keyword": "มะเร็งลูกตาในเด็ก"},
        {"No": 407,"Keyword": "เอดส์"},
        {"No": 408,"Keyword": "ซาร์ส"},
        {"No": 409,"Keyword": "ไข้หวัดนก"},
        {"No": 410,"Keyword": "โควิด-19"},
        {"No": 411,"Keyword": "โรคลำไส้อักเสบเรื้อรัง"},
        {"No": 412,"Keyword": "ไขมันพอกตับ"},
        {"No": 413,"Keyword": "โรคขาอยู่ไม่สุข"},
        {"No": 414,"Keyword": "ฝีดาษลิง"},
        {"No": 415,"Keyword": "ภาวะเหงื่อออกมากโดยไม่ทราบสาเหตุ"},
        {"No": 416,"Keyword": "ตาแห้ง"},
        {"No": 417,"Keyword": "โรคสั่นโดยไม่ทราบสาเหตุ"},
        {"No": 418,"Keyword": "ภาวะน้ำเกินในโพรงสมอง"}
    ]
}