{
  "server": {
    "port": 80,
    "host": "0.0.0.0"
  },
  "logger": {
    "level": "info"
  },
  "persistence": {
    "type": "mysql",
    "host": "mysql",
    "port": 3306,
    "database": "f1_settings"
  }
}
