{
  "server": {
    "host": "0.0.0.0",
    "port": 80
  },
  "logger": {
    "level": "info"
  },
  "api": {
    "users": "http://f1-users",
    "dashboards": "http://f1-dashboards",
    "data": "http://f1-data",
    "settings": "http://f1-settings"
  }
}
