<?xml version="1.0" encoding="UTF-8" standalone="no"?><svg xmlns="http://www.w3.org/2000/svg" xmlns:xlink="http://www.w3.org/1999/xlink" contentScriptType="application/ecmascript" contentStyleType="text/css" height="352px" preserveAspectRatio="none" style="width:377px;height:352px;" version="1.1" viewBox="0 0 377 352" width="377px" zoomAndPan="magnify"><defs><filter height="300%" id="fe1zgyxcynpk0" width="300%" x="-1" y="-1"><feGaussianBlur result="blurOut" stdDeviation="2.0"/><feColorMatrix in="blurOut" result="blurOut2" type="matrix" values="0 0 0 0 0 0 0 0 0 0 0 0 0 0 0 0 0 0 .4 0"/><feOffset dx="4.0" dy="4.0" in="blurOut2" result="blurOut3"/><feBlend in="SourceGraphic" in2="blurOut3" mode="normal"/></filter></defs><g><!--MD5=[a7aa1daca01cd018f933ff241b829495]
cluster agregát--><rect fill="#FFFFFF" filter="url(#fe1zgyxcynpk0)" height="317" style="stroke: #000000; stroke-width: 1.5;" width="344" x="22" y="24"/><text fill="#000000" font-family="sans-serif" font-size="14" font-weight="bold" lengthAdjust="spacingAndGlyphs" textLength="62" x="163" y="38.9951">agregát</text><!--MD5=[5231c689fac8befaf6ebbf7bd7433b7f]
cluster 1:1--><rect fill="#FFFFFF" filter="url(#fe1zgyxcynpk0)" height="81" style="stroke: #000000; stroke-width: 1.5;" width="95" x="148" y="236"/><path d="M184,237 L184,245.2969 L174,255.2969 L148,255.2969 " fill="none" style="stroke: #000000; stroke-width: 1.5;"/><text fill="#000000" font-family="sans-serif" font-size="14" font-weight="bold" lengthAdjust="spacingAndGlyphs" textLength="26" x="151" y="249.9951">1:1</text><!--MD5=[fe90abaf074774b0922a876b26bdf149]
cluster 1:n--><rect fill="#FFFFFF" filter="url(#fe1zgyxcynpk0)" height="145" style="stroke: #000000; stroke-width: 1.5;" width="95" x="148" y="67"/><path d="M184,68 L184,76.2969 L174,86.2969 L148,86.2969 " fill="none" style="stroke: #000000; stroke-width: 1.5;"/><text fill="#000000" font-family="sans-serif" font-size="14" font-weight="bold" lengthAdjust="spacingAndGlyphs" textLength="26" x="151" y="80.9951">1:n</text><ellipse cx="70.9206" cy="180.8575" fill="#FEFECE" filter="url(#fe1zgyxcynpk0)" rx="32.9206" ry="26.3575" style="stroke: #A80036; stroke-width: 1.5;"/><text fill="#000000" font-family="sans-serif" font-size="14" font-weight="bold" lengthAdjust="spacingAndGlyphs" textLength="34" x="53.9206" y="174.4332">root</text><line style="stroke: #A80036; stroke-width: 1.0;" x1="39.2318" x2="102.6094" y1="177.735" y2="177.735"/><text fill="#000000" font-family="sans-serif" font-size="14" lengthAdjust="spacingAndGlyphs" textLength="40" x="50.9206" y="194.7301">Entity</text><ellipse cx="318.2843" cy="213.0236" fill="#FEFECE" filter="url(#fe1zgyxcynpk0)" rx="31.2843" ry="14.5236" style="stroke: #A80036; stroke-width: 1.5;"/><text fill="#000000" font-family="sans-serif" font-size="14" lengthAdjust="spacingAndGlyphs" textLength="40" x="298.2843" y="217.6721">Entity</text><ellipse cx="318.2843" cy="149.0236" fill="#FEFECE" filter="url(#fe1zgyxcynpk0)" rx="31.2843" ry="14.5236" style="stroke: #A80036; stroke-width: 1.5;"/><text fill="#000000" font-family="sans-serif" font-size="14" lengthAdjust="spacingAndGlyphs" textLength="40" x="298.2843" y="153.6721">Entity</text><ellipse cx="195.2843" cy="286.0236" fill="#FEFECE" filter="url(#fe1zgyxcynpk0)" rx="31.2843" ry="14.5236" style="stroke: #A80036; stroke-width: 1.5;"/><text fill="#000000" font-family="sans-serif" font-size="14" lengthAdjust="spacingAndGlyphs" textLength="40" x="175.2843" y="290.6721">Entity</text><ellipse cx="195.2843" cy="117.0236" fill="#FEFECE" filter="url(#fe1zgyxcynpk0)" rx="31.2843" ry="14.5236" style="stroke: #A80036; stroke-width: 1.5;"/><text fill="#000000" font-family="sans-serif" font-size="14" lengthAdjust="spacingAndGlyphs" textLength="40" x="175.2843" y="121.6721">Entity</text><ellipse cx="195.2843" cy="181.0236" fill="#FEFECE" filter="url(#fe1zgyxcynpk0)" rx="31.2843" ry="14.5236" style="stroke: #A80036; stroke-width: 1.5;"/><text fill="#000000" font-family="sans-serif" font-size="14" lengthAdjust="spacingAndGlyphs" textLength="40" x="175.2843" y="185.6721">Entity</text><!--MD5=[0797f3478ec30a26af911ff7c9e0d18d]
link root to entity1--><path d="M94.18,200.01 C117.55,220.04 153.94,251.23 175.87,270.03 " fill="none" id="root-&gt;entity1" style="stroke: #A80036; stroke-width: 1.0;"/><polygon fill="#A80036" points="179.79,273.39,175.5764,264.488,175.9998,270.129,170.3588,270.5523,179.79,273.39" style="stroke: #A80036; stroke-width: 1.0;"/><!--MD5=[d7ab9b5f2cfe8e9090a38cfa4836fea6]
link root to entity2--><path d="M99.19,166.8 C120.16,155.84 148.94,140.8 169.37,130.13 " fill="none" id="root-&gt;entity2" style="stroke: #A80036; stroke-width: 1.0;"/><polygon fill="#A80036" points="173.86,127.78,164.0309,128.4033,169.4286,130.0958,167.7361,135.4935,173.86,127.78" style="stroke: #A80036; stroke-width: 1.0;"/><!--MD5=[dfe3955b852d7f007f3a4653db034eff]
link root to entity3--><path d="M104.19,181 C120.89,181 141.35,181 158.56,181 " fill="none" id="root-&gt;entity3" style="stroke: #A80036; stroke-width: 1.0;"/><polygon fill="#A80036" points="163.8,181,154.8,177,158.8,181,154.8,185,163.8,181" style="stroke: #A80036; stroke-width: 1.0;"/><!--MD5=[dc1b5c01facf018fcae40ecc18c4d2f1]
link entity3 to entity4--><path d="M223.35,188.1 C241.68,192.95 266.05,199.39 285.4,204.51 " fill="none" id="entity3-&gt;entity4" style="stroke: #A80036; stroke-width: 1.0;"/><polygon fill="#A80036" points="290.72,205.92,283.0352,199.7601,285.8848,204.6468,280.9981,207.4964,290.72,205.92" style="stroke: #A80036; stroke-width: 1.0;"/><!--MD5=[a94da6f20e3469fedec21d3e3299e6fc]
link entity3 to entity5--><path d="M223.35,173.9 C241.68,169.05 266.05,162.61 285.4,157.49 " fill="none" id="entity3-&gt;entity5" style="stroke: #A80036; stroke-width: 1.0;"/><polygon fill="#A80036" points="290.72,156.08,280.9981,154.5036,285.8848,157.3532,283.0352,162.2399,290.72,156.08" style="stroke: #A80036; stroke-width: 1.0;"/><!--MD5=[472aff225cd5f8da333cab3a0124b42f]
@startuml
left to right direction
rectangle agregát {
usecase root [
<b>root
- - - -
Entity
]

frame 1:1 {
  usecase entity1 [
  Entity
  ]
}

frame 1:n {
  usecase entity2 [
  Entity
  ]
  usecase entity3 [
  Entity
  ]
}


usecase entity4 [
Entity
]

usecase entity5 [
Entity
]
root - -> entity1
root - -> entity2
root - -> entity3
entity3 - -> entity4
entity3 - -> entity5
}

@enduml

PlantUML version 1.2020.06(Sun Apr 05 14:38:32 CEST 2020)
(APACHE source distribution)
Java Runtime: OpenJDK Runtime Environment
JVM: OpenJDK 64-Bit Server VM
Java Version: 11.0.8+10-b944.34
Operating System: Linux
Default Encoding: UTF-8
Language: en
Country: US
--></g></svg>