^D:\USERS\FEDOR\SOURCE\REPOS\HW1\DEBUG\HELPERS.OBJ|D:\USERS\FEDOR\SOURCE\REPOS\HW1\DEBUG\HW1.OBJ
D:\USERS\FEDOR\SOURCE\REPOS\HW1\DEBUG\HW1.EXE
D:\USERS\FEDOR\SOURCE\REPOS\HW1\DEBUG\HW1.ILK
D:\USERS\FEDOR\SOURCE\REPOS\HW1\DEBUG\HW1.PDB
