<?xml version="1.0" encoding="utf-8"?>
<!-- Generator: Adobe Illustrator 25.2.3, SVG Export Plug-In . SVG Version: 6.00 Build 0)  -->
<svg version="1.1" id="Layer_1" xmlns="http://www.w3.org/2000/svg" xmlns:xlink="http://www.w3.org/1999/xlink" x="0px" y="0px"
	 viewBox="0 0 30 30" style="enable-background:new 0 0 30 30;" xml:space="preserve">
<style type="text/css">
	.st0{fill:#FFFFFF;}
</style>
<g id="Layer_2_1_">
	<g id="Capa_1">
		<path class="st0" d="M16.4,19.1v-4.8c0-0.1,0-0.1,0.1-0.1h2.2c0,0,0,0,0,0V22c0,0.1,0,0.1-0.1,0.1h-2.4c-0.1,0-0.1,0-0.1-0.1
			c-0.9-1.2-1.8-2.5-2.8-3.8c-0.2-0.3-0.5-0.7-0.7-1l0,0v1c0,0.8,0,1.6,0,2.3V22c0,0.1,0,0.1-0.1,0.1h-2.1c0,0,0,0,0,0v-7.7
			c0-0.1,0-0.1,0.1-0.1h2.6c0,0,0.1,0,0.1,0.1c0.7,1,1.4,2,2.1,3.1C15.5,17.9,16,18.5,16.4,19.1C16.3,19,16.3,19,16.4,19.1z"/>
		<path class="st0" d="M8.8,22H6.2c-0.1,0-0.1,0-0.1-0.1c-0.4-0.5-0.9-1-1.3-1.5c-0.4-0.5-0.8-1-1.3-1.5l0,0c0,0,0,0-0.1,0
			c-0.3,0.3-0.5,0.6-0.8,0.8c0,0,0,0.1,0,0.1v2.1c0,0.1,0,0.1-0.1,0.1H0.4c-0.1,0-0.1,0-0.1-0.1v-7.7c0-0.1,0-0.1,0.1-0.1h2.1
			c0.1,0,0.1,0,0.1,0.1v3.2h0c0.3-0.3,0.5-0.5,0.8-0.8c0.1-0.1,0.3-0.3,0.4-0.4c0.4-0.4,0.7-0.7,1.1-1.1c0.3-0.3,0.6-0.6,0.9-0.9
			c0,0,0.1,0,0.1,0h2.2c0,0,0,0,0,0.1c-0.3,0.3-0.6,0.7-1,1l-1,1l-0.8,0.8l-0.3,0.3c0,0,0,0,0,0.1c0.3,0.4,0.6,0.7,0.9,1.1L8,21.1
			c0.2,0.3,0.5,0.6,0.7,0.8C8.7,21.9,8.7,22,8.8,22z"/>
		<path class="st0" d="M19.8,22C19.8,22,19.9,22,19.8,22c0.3-0.4,0.6-0.7,0.9-0.9c0.4-0.4,0.9-0.9,1.3-1.3s0.8-0.9,1.3-1.3l0.5-0.5
			c0,0,0.1,0,0-0.1c-0.4-0.5-0.8-0.9-1.1-1.4c-0.6-0.8-1.3-1.5-1.9-2.3l0,0c0,0,0,0,0.1,0h2.5c0,0,0.1,0,0.1,0
			c0.5,0.6,1,1.2,1.5,1.7c0.1,0.2,0.3,0.3,0.4,0.5l0,0h0l0,0l1.4-1.4l0.8-0.8c0,0,0.1,0,0.1,0h2.2c0,0,0,0,0,0.1
			c-0.4,0.4-0.8,0.8-1.1,1.2l-1.2,1.2l-1,1l0,0c0,0,0,0,0,0.1c0.1,0.1,0.2,0.2,0.3,0.3c0.8,0.9,1.5,1.8,2.3,2.7
			c0.3,0.4,0.6,0.8,1,1.1L30,22h-2.6c-0.1,0-0.2,0-0.2-0.1c-0.7-0.9-1.5-1.8-2.2-2.7c-0.1-0.1,0-0.1-0.1,0c-0.4,0.4-0.7,0.8-1.1,1.1
			s-0.6,0.7-1,1L22.2,22c0,0-0.1,0-0.1,0C22.1,22,19.8,22,19.8,22z"/>
		<path class="st0" d="M29.9,13.6L29.9,13.6C29.8,13.6,29.8,13.6,29.9,13.6l-2.2,0c0,0-0.1,0-0.1,0c-0.4-0.3-0.8-0.6-1.2-0.9
			c-0.7-0.5-1.4-0.9-2.1-1.2c-0.7-0.3-1.5-0.6-2.2-0.9c-0.7-0.2-1.4-0.4-2.1-0.5C19.5,10,19,9.9,18.6,9.8c-0.4-0.1-0.8-0.1-1.2-0.1
			l-1.3-0.1c-0.3,0-0.7,0-1,0h-0.2c-0.3,0-0.6,0-0.8,0c-0.3,0-0.7,0-1,0.1l-0.8,0.1c-0.3,0-0.7,0.1-1,0.1c-0.6,0.1-1.2,0.2-1.8,0.4
			c-1.1,0.3-2.2,0.6-3.2,1.1c-1.1,0.5-2.1,1-3,1.7c-0.2,0.2-0.4,0.3-0.6,0.5c0,0,0,0-0.1,0H0.3c0,0,0,0,0-0.1
			C0.6,13.4,0.8,13.2,1,13c0.6-0.5,1.3-1,2-1.5c0.9-0.6,1.9-1.1,3-1.6C6.5,9.6,7,9.4,7.6,9.3C8.3,9,9.1,8.8,9.8,8.6
			c0.6-0.2,1.2-0.3,1.9-0.4c0.4-0.1,0.7-0.1,1.1-0.2C13.1,8,13.4,8,13.6,8c0.5,0,1-0.1,1.5-0.1h0.1c0.4,0,0.8,0,1.1,0
			c0.3,0,0.6,0,0.9,0.1c0.3,0,0.7,0.1,1,0.1c0.4,0.1,0.9,0.1,1.3,0.2c0.9,0.2,1.7,0.4,2.6,0.7c0.9,0.3,1.7,0.6,2.5,0.9
			c0.9,0.4,1.7,0.8,2.5,1.3c0.7,0.4,1.4,0.9,2,1.4C29.4,13.1,29.7,13.3,29.9,13.6C29.8,13.6,29.8,13.6,29.9,13.6z"/>
	</g>
</g>
</svg>
