%YAML 1.1
%TAG !u! tag:unity3d.com,2011:
--- !u!114 &11400000
MonoBehaviour:
  m_ObjectHideFlags: 0
  m_CorrespondingSourceObject: {fileID: 0}
  m_PrefabInstance: {fileID: 0}
  m_PrefabAsset: {fileID: 0}
  m_GameObject: {fileID: 0}
  m_Enabled: 1
  m_EditorHideFlags: 0
  m_Script: {fileID: 11500000, guid: 916d8d67cda374a4ca7161e97618a73c, type: 3}
  m_Name: CV_testingSmall
  m_EditorClassIdentifier: 
  Environments:
  - envGameObject: {fileID: 8090081161548802553, guid: c180833db1dec6d4399aede16552aad2, type: 3}
    minScore: 100
    maxEpisodes: 1000
  - envGameObject: {fileID: 2451014290746930225, guid: 4502c8e5bc6ad3a4a92b55260e7eb5fb, type: 3}
    minScore: 100
    maxEpisodes: 1000
  - envGameObject: {fileID: -8502944365822765771, guid: 28846acbd0e998f47bef5eabf590404d, type: 3}
    minScore: 100
    maxEpisodes: 1000
  - envGameObject: {fileID: 7429753582307261725, guid: ef874b795eb8e8f4f8b7ef3014035593, type: 3}
    minScore: 100
    maxEpisodes: 1000
  - envGameObject: {fileID: 312643495711109788, guid: b0fa4f703a80a3645bfb5348f301a0c8, type: 3}
    minScore: 100
    maxEpisodes: 1000
