%YAML 1.1
%TAG !u! tag:unity3d.com,2011:
--- !u!1 &6926524580150255768
GameObject:
  m_ObjectHideFlags: 0
  m_CorrespondingSourceObject: {fileID: 0}
  m_PrefabInstance: {fileID: 0}
  m_PrefabAsset: {fileID: 0}
  serializedVersion: 6
  m_Component:
  - component: {fileID: 2657381516058266018}
  m_Layer: 0
  m_Name: ParagoneTriplaSceltaUnBlocco
  m_TagString: Untagged
  m_Icon: {fileID: 0}
  m_NavMeshLayer: 0
  m_StaticEditorFlags: 0
  m_IsActive: 1
--- !u!4 &2657381516058266018
Transform:
  m_ObjectHideFlags: 0
  m_CorrespondingSourceObject: {fileID: 0}
  m_PrefabInstance: {fileID: 0}
  m_PrefabAsset: {fileID: 0}
  m_GameObject: {fileID: 6926524580150255768}
  m_LocalRotation: {x: 0, y: 0, z: 0, w: 1}
  m_LocalPosition: {x: 0, y: 0, z: 0}
  m_LocalScale: {x: 1, y: 1, z: 1}
  m_Children:
  - {fileID: 3417391711289228323}
  - {fileID: 3754813724979377904}
  m_Father: {fileID: 0}
  m_RootOrder: 0
  m_LocalEulerAnglesHint: {x: 0, y: 0, z: 0}
--- !u!1001 &6248112860486492628
PrefabInstance:
  m_ObjectHideFlags: 0
  serializedVersion: 2
  m_Modification:
    m_TransformParent: {fileID: 2657381516058266018}
    m_Modifications:
    - target: {fileID: 225227706011985057, guid: cf05d8f4247b2bb47b515fd94e74e0b6, type: 3}
      propertyPath: m_Controller
      value: 
      objectReference: {fileID: 0}
    - target: {fileID: 3559913041693610172, guid: cf05d8f4247b2bb47b515fd94e74e0b6, type: 3}
      propertyPath: m_Enabled
      value: 0
      objectReference: {fileID: 0}
    - target: {fileID: 3730655293891275431, guid: cf05d8f4247b2bb47b515fd94e74e0b6, type: 3}
      propertyPath: paragoneNavMesh
      value: 1
      objectReference: {fileID: 0}
    - target: {fileID: 4116629201885411023, guid: cf05d8f4247b2bb47b515fd94e74e0b6, type: 3}
      propertyPath: m_Controller
      value: 
      objectReference: {fileID: 0}
    - target: {fileID: 7096169942474985103, guid: cf05d8f4247b2bb47b515fd94e74e0b6, type: 3}
      propertyPath: m_Controller
      value: 
      objectReference: {fileID: 0}
    - target: {fileID: 8248528004446893327, guid: cf05d8f4247b2bb47b515fd94e74e0b6, type: 3}
      propertyPath: m_Controller
      value: 
      objectReference: {fileID: 0}
    - target: {fileID: 8779980972828057076, guid: cf05d8f4247b2bb47b515fd94e74e0b6, type: 3}
      propertyPath: m_Name
      value: PathTriplaSceltaFacile
      objectReference: {fileID: 0}
    - target: {fileID: 8779980972828057079, guid: cf05d8f4247b2bb47b515fd94e74e0b6, type: 3}
      propertyPath: m_RootOrder
      value: 0
      objectReference: {fileID: 0}
    - target: {fileID: 8779980972828057079, guid: cf05d8f4247b2bb47b515fd94e74e0b6, type: 3}
      propertyPath: m_LocalPosition.x
      value: 0
      objectReference: {fileID: 0}
    - target: {fileID: 8779980972828057079, guid: cf05d8f4247b2bb47b515fd94e74e0b6, type: 3}
      propertyPath: m_LocalPosition.y
      value: 0
      objectReference: {fileID: 0}
    - target: {fileID: 8779980972828057079, guid: cf05d8f4247b2bb47b515fd94e74e0b6, type: 3}
      propertyPath: m_LocalPosition.z
      value: 0
      objectReference: {fileID: 0}
    - target: {fileID: 8779980972828057079, guid: cf05d8f4247b2bb47b515fd94e74e0b6, type: 3}
      propertyPath: m_LocalRotation.w
      value: 1
      objectReference: {fileID: 0}
    - target: {fileID: 8779980972828057079, guid: cf05d8f4247b2bb47b515fd94e74e0b6, type: 3}
      propertyPath: m_LocalRotation.x
      value: -0
      objectReference: {fileID: 0}
    - target: {fileID: 8779980972828057079, guid: cf05d8f4247b2bb47b515fd94e74e0b6, type: 3}
      propertyPath: m_LocalRotation.y
      value: -0
      objectReference: {fileID: 0}
    - target: {fileID: 8779980972828057079, guid: cf05d8f4247b2bb47b515fd94e74e0b6, type: 3}
      propertyPath: m_LocalRotation.z
      value: -0
      objectReference: {fileID: 0}
    - target: {fileID: 8779980972828057079, guid: cf05d8f4247b2bb47b515fd94e74e0b6, type: 3}
      propertyPath: m_LocalEulerAnglesHint.x
      value: 0
      objectReference: {fileID: 0}
    - target: {fileID: 8779980972828057079, guid: cf05d8f4247b2bb47b515fd94e74e0b6, type: 3}
      propertyPath: m_LocalEulerAnglesHint.y
      value: 0
      objectReference: {fileID: 0}
    - target: {fileID: 8779980972828057079, guid: cf05d8f4247b2bb47b515fd94e74e0b6, type: 3}
      propertyPath: m_LocalEulerAnglesHint.z
      value: 0
      objectReference: {fileID: 0}
    m_RemovedComponents: []
  m_SourcePrefab: {fileID: 100100000, guid: cf05d8f4247b2bb47b515fd94e74e0b6, type: 3}
--- !u!4 &3417391711289228323 stripped
Transform:
  m_CorrespondingSourceObject: {fileID: 8779980972828057079, guid: cf05d8f4247b2bb47b515fd94e74e0b6, type: 3}
  m_PrefabInstance: {fileID: 6248112860486492628}
  m_PrefabAsset: {fileID: 0}
--- !u!1001 &8164988332604126334
PrefabInstance:
  m_ObjectHideFlags: 0
  serializedVersion: 2
  m_Modification:
    m_TransformParent: {fileID: 2657381516058266018}
    m_Modifications:
    - target: {fileID: 872597223626295754, guid: 87638bbcd3c5ead4fb9aebd0e9699b7c, type: 3}
      propertyPath: m_Enabled
      value: 0
      objectReference: {fileID: 0}
    - target: {fileID: 916930261598361749, guid: 87638bbcd3c5ead4fb9aebd0e9699b7c, type: 3}
      propertyPath: m_Controller
      value: 
      objectReference: {fileID: 0}
    - target: {fileID: 1101459433913906654, guid: 87638bbcd3c5ead4fb9aebd0e9699b7c, type: 3}
      propertyPath: paragoneNavMesh
      value: 1
      objectReference: {fileID: 0}
    - target: {fileID: 1101459433913906654, guid: 87638bbcd3c5ead4fb9aebd0e9699b7c, type: 3}
      propertyPath: attivaUno.Array.size
      value: 0
      objectReference: {fileID: 0}
    - target: {fileID: 1101459433913906654, guid: 87638bbcd3c5ead4fb9aebd0e9699b7c, type: 3}
      propertyPath: OggettoDaSpostare.Array.size
      value: 0
      objectReference: {fileID: 0}
    - target: {fileID: 1751887335861460624, guid: 87638bbcd3c5ead4fb9aebd0e9699b7c, type: 3}
      propertyPath: m_Controller
      value: 
      objectReference: {fileID: 0}
    - target: {fileID: 2070414779160060693, guid: 87638bbcd3c5ead4fb9aebd0e9699b7c, type: 3}
      propertyPath: m_Controller
      value: 
      objectReference: {fileID: 0}
    - target: {fileID: 2472171995854114046, guid: 87638bbcd3c5ead4fb9aebd0e9699b7c, type: 3}
      propertyPath: m_Controller
      value: 
      objectReference: {fileID: 0}
    - target: {fileID: 3228686607939540431, guid: 87638bbcd3c5ead4fb9aebd0e9699b7c, type: 3}
      propertyPath: m_Controller
      value: 
      objectReference: {fileID: 0}
    - target: {fileID: 4381044961490087503, guid: 87638bbcd3c5ead4fb9aebd0e9699b7c, type: 3}
      propertyPath: m_Controller
      value: 
      objectReference: {fileID: 0}
    - target: {fileID: 4833603499317044944, guid: 87638bbcd3c5ead4fb9aebd0e9699b7c, type: 3}
      propertyPath: m_Controller
      value: 
      objectReference: {fileID: 0}
    - target: {fileID: 4995647094774284941, guid: 87638bbcd3c5ead4fb9aebd0e9699b7c, type: 3}
      propertyPath: m_Name
      value: PathTriplaSceltaFacileNMA
      objectReference: {fileID: 0}
    - target: {fileID: 4995647094774284942, guid: 87638bbcd3c5ead4fb9aebd0e9699b7c, type: 3}
      propertyPath: m_RootOrder
      value: 1
      objectReference: {fileID: 0}
    - target: {fileID: 4995647094774284942, guid: 87638bbcd3c5ead4fb9aebd0e9699b7c, type: 3}
      propertyPath: m_LocalPosition.x
      value: 21.7
      objectReference: {fileID: 0}
    - target: {fileID: 4995647094774284942, guid: 87638bbcd3c5ead4fb9aebd0e9699b7c, type: 3}
      propertyPath: m_LocalPosition.y
      value: 0
      objectReference: {fileID: 0}
    - target: {fileID: 4995647094774284942, guid: 87638bbcd3c5ead4fb9aebd0e9699b7c, type: 3}
      propertyPath: m_LocalPosition.z
      value: 0
      objectReference: {fileID: 0}
    - target: {fileID: 4995647094774284942, guid: 87638bbcd3c5ead4fb9aebd0e9699b7c, type: 3}
      propertyPath: m_LocalRotation.w
      value: 1
      objectReference: {fileID: 0}
    - target: {fileID: 4995647094774284942, guid: 87638bbcd3c5ead4fb9aebd0e9699b7c, type: 3}
      propertyPath: m_LocalRotation.x
      value: -0
      objectReference: {fileID: 0}
    - target: {fileID: 4995647094774284942, guid: 87638bbcd3c5ead4fb9aebd0e9699b7c, type: 3}
      propertyPath: m_LocalRotation.y
      value: -0
      objectReference: {fileID: 0}
    - target: {fileID: 4995647094774284942, guid: 87638bbcd3c5ead4fb9aebd0e9699b7c, type: 3}
      propertyPath: m_LocalRotation.z
      value: -0
      objectReference: {fileID: 0}
    - target: {fileID: 4995647094774284942, guid: 87638bbcd3c5ead4fb9aebd0e9699b7c, type: 3}
      propertyPath: m_LocalEulerAnglesHint.x
      value: 0
      objectReference: {fileID: 0}
    - target: {fileID: 4995647094774284942, guid: 87638bbcd3c5ead4fb9aebd0e9699b7c, type: 3}
      propertyPath: m_LocalEulerAnglesHint.y
      value: 0
      objectReference: {fileID: 0}
    - target: {fileID: 4995647094774284942, guid: 87638bbcd3c5ead4fb9aebd0e9699b7c, type: 3}
      propertyPath: m_LocalEulerAnglesHint.z
      value: 0
      objectReference: {fileID: 0}
    - target: {fileID: 5987087888717520208, guid: 87638bbcd3c5ead4fb9aebd0e9699b7c, type: 3}
      propertyPath: m_Controller
      value: 
      objectReference: {fileID: 0}
    - target: {fileID: 6332636889782673621, guid: 87638bbcd3c5ead4fb9aebd0e9699b7c, type: 3}
      propertyPath: m_Controller
      value: 
      objectReference: {fileID: 0}
    - target: {fileID: 6743606898329420897, guid: 87638bbcd3c5ead4fb9aebd0e9699b7c, type: 3}
      propertyPath: m_Controller
      value: 
      objectReference: {fileID: 0}
    - target: {fileID: 7464441142336427535, guid: 87638bbcd3c5ead4fb9aebd0e9699b7c, type: 3}
      propertyPath: m_Controller
      value: 
      objectReference: {fileID: 0}
    - target: {fileID: 7918195273364239035, guid: 87638bbcd3c5ead4fb9aebd0e9699b7c, type: 3}
      propertyPath: m_Controller
      value: 
      objectReference: {fileID: 0}
    - target: {fileID: 8069483583011504957, guid: 87638bbcd3c5ead4fb9aebd0e9699b7c, type: 3}
      propertyPath: magneti.Array.data[0].x
      value: 13.425001
      objectReference: {fileID: 0}
    - target: {fileID: 8069483583011504957, guid: 87638bbcd3c5ead4fb9aebd0e9699b7c, type: 3}
      propertyPath: magneti.Array.data[0].z
      value: 7.3875
      objectReference: {fileID: 0}
    - target: {fileID: 8069483583011504957, guid: 87638bbcd3c5ead4fb9aebd0e9699b7c, type: 3}
      propertyPath: magneti.Array.data[1].x
      value: 14.175001
      objectReference: {fileID: 0}
    - target: {fileID: 8069483583011504957, guid: 87638bbcd3c5ead4fb9aebd0e9699b7c, type: 3}
      propertyPath: magneti.Array.data[1].z
      value: 7.3875
      objectReference: {fileID: 0}
    - target: {fileID: 8069483583011504957, guid: 87638bbcd3c5ead4fb9aebd0e9699b7c, type: 3}
      propertyPath: magneti.Array.data[2].x
      value: 13.425001
      objectReference: {fileID: 0}
    - target: {fileID: 8069483583011504957, guid: 87638bbcd3c5ead4fb9aebd0e9699b7c, type: 3}
      propertyPath: magneti.Array.data[2].z
      value: 6.6125
      objectReference: {fileID: 0}
    - target: {fileID: 8069483583011504957, guid: 87638bbcd3c5ead4fb9aebd0e9699b7c, type: 3}
      propertyPath: magneti.Array.data[3].x
      value: 14.175001
      objectReference: {fileID: 0}
    - target: {fileID: 8069483583011504957, guid: 87638bbcd3c5ead4fb9aebd0e9699b7c, type: 3}
      propertyPath: magneti.Array.data[3].z
      value: 6.6125
      objectReference: {fileID: 0}
    m_RemovedComponents: []
  m_SourcePrefab: {fileID: 100100000, guid: 87638bbcd3c5ead4fb9aebd0e9699b7c, type: 3}
--- !u!4 &3754813724979377904 stripped
Transform:
  m_CorrespondingSourceObject: {fileID: 4995647094774284942, guid: 87638bbcd3c5ead4fb9aebd0e9699b7c, type: 3}
  m_PrefabInstance: {fileID: 8164988332604126334}
  m_PrefabAsset: {fileID: 0}
