{
    "name": "root",
    "metadata": {
        "timer_format_version": "0.1.0",
        "start_time_seconds": "1704539083",
        "python_version": "3.10.2 (tags/v3.10.2:a58ebcc, Jan 17 2022, 14:12:15) [MSC v.1929 64 bit (AMD64)]",
        "command_line_arguments": "C:\\Users\\chicc\\AppData\\Local\\Programs\\Python\\Python310\\Scripts\\mlagents-learn TrainerConfig/trainer_config.yaml --run-id=CV_BASE_VARIANTE",
        "mlagents_version": "0.16.1",
        "mlagents_envs_version": "0.16.1",
        "communication_protocol_version": "1.0.0",
        "tensorflow_version": "2.8.0",
        "end_time_seconds": "1704539089"
    },
    "total": 6.031057999935001,
    "count": 1,
    "self": 0.28678960003890097,
    "children": {
        "run_training.setup": {
            "total": 0.006115199998021126,
            "count": 1,
            "self": 0.006115199998021126
        },
        "TrainerController.start_learning": {
            "total": 5.738153199898079,
            "count": 1,
            "self": 0.0006369000766426325,
            "children": {
                "TrainerController._reset_env": {
                    "total": 5.737516299821436,
                    "count": 1,
                    "self": 5.737516299821436
                }
            }
        }
    }
}