07/01/2024 19:19:09;1704651549;33055;8;3,464912
07/01/2024 19:19:09;1704651549;33069;1;6,9955
07/01/2024 19:19:09;1704651549;33082;1;6,9955
07/01/2024 19:19:09;1704651549;33096;1;6,9954
07/01/2024 19:19:09;1704651549;33110;1;6,9955
07/01/2024 19:19:10;1704651550;33123;1;6,9957
07/01/2024 19:19:10;1704651550;33137;1;6,9954
07/01/2024 19:19:10;1704651550;33150;1;6,9954
07/01/2024 19:19:10;1704651550;33165;1;6,9951
07/01/2024 19:19:10;1704651550;33180;1;6,9949
07/01/2024 19:19:11;1704651551;33194;1;6,9954
07/01/2024 19:19:11;1704651551;33209;1;6,995
07/01/2024 19:19:11;1704651551;33223;1;6,9955
07/01/2024 19:19:11;1704651551;33236;1;6,9955
07/01/2024 19:19:11;1704651551;33251;1;6,995
07/01/2024 19:19:11;1704651551;33265;1;6,9954
07/01/2024 19:19:12;1704651552;33277;1;6,9958
07/01/2024 19:19:12;1704651552;33294;1;6,4945
07/01/2024 19:19:12;1704651552;33309;1;6,9948
07/01/2024 19:19:12;1704651552;33325;1;6,9947
07/01/2024 19:19:12;1704651552;33341;1;6,9947
07/01/2024 19:19:13;1704651553;33358;1;6,9945
07/01/2024 19:19:13;1704651553;33371;1;6,9956
07/01/2024 19:19:13;1704651553;33385;1;6,9953
07/01/2024 19:19:13;1704651553;33400;1;6,9951
07/01/2024 19:19:13;1704651553;33415;1;6,995
07/01/2024 19:19:14;1704651554;33429;1;6,9952
07/01/2024 19:19:14;1704651554;33447;1;6,9939
07/01/2024 19:19:14;1704651554;33463;1;4,994701
07/01/2024 19:19:14;1704651554;33478;1;6,9951
07/01/2024 19:19:15;1704651555;33494;1;2,994701
07/01/2024 19:19:15;1704651555;33510;1;6,9946
07/01/2024 19:19:15;1704651555;33525;1;6,995
07/01/2024 19:19:15;1704651555;33539;1;6,9953
07/01/2024 19:19:15;1704651555;33553;1;6,9955
07/01/2024 19:19:16;1704651556;33571;1;6,9941
07/01/2024 19:19:16;1704651556;33586;1;6,4947
07/01/2024 19:19:16;1704651556;33602;1;6,9948
07/01/2024 19:19:16;1704651556;33616;1;6,9954
07/01/2024 19:19:16;1704651556;33631;1;6,995
07/01/2024 19:19:17;1704651557;33647;1;6,9947
07/01/2024 19:19:17;1704651557;33662;1;6,9951
07/01/2024 19:19:17;1704651557;33677;1;6,9947
07/01/2024 19:19:17;1704651557;33692;1;6,9952
07/01/2024 19:19:17;1704651557;33707;1;5,9949
07/01/2024 19:19:18;1704651558;33724;1;6,9943
07/01/2024 19:19:18;1704651558;33738;1;6,9954
07/01/2024 19:19:18;1704651558;33752;1;6,9954
07/01/2024 19:19:18;1704651558;33765;1;6,9956
07/01/2024 19:19:18;1704651558;33779;1;6,9954
07/01/2024 19:19:19;1704651559;33794;1;6,995
07/01/2024 19:19:19;1704651559;33808;1;6,9952
07/01/2024 19:19:19;1704651559;33823;1;6,9952
07/01/2024 19:19:19;1704651559;33836;1;6,4957
07/01/2024 19:19:19;1704651559;33852;1;5,9945
07/01/2024 19:19:20;1704651560;33868;1;6,9946
07/01/2024 19:19:20;1704651560;33883;1;6,9949
07/01/2024 19:19:20;1704651560;33899;1;5,494999
07/01/2024 19:19:20;1704651560;33912;1;6,9954
07/01/2024 19:19:20;1704651560;33930;1;6,9942
07/01/2024 19:19:21;1704651561;33944;1;6,9951
07/01/2024 19:19:21;1704651561;33962;1;6,9941
07/01/2024 19:19:21;1704651561;33977;1;6,9951
07/01/2024 19:19:21;1704651561;33990;1;6,9955
07/01/2024 19:19:22;1704651562;34006;1;4,9949
07/01/2024 19:19:22;1704651562;34019;1;6,9956
07/01/2024 19:19:22;1704651562;34034;1;6,9948
07/01/2024 19:19:22;1704651562;34049;1;6,4952
07/01/2024 19:19:22;1704651562;34065;1;6,9944
07/01/2024 19:19:23;1704651563;34080;1;6,9952
07/01/2024 19:19:23;1704651563;34093;1;6,9955
07/01/2024 19:19:23;1704651563;34109;1;6,4948
07/01/2024 19:19:23;1704651563;34123;1;6,9953
07/01/2024 19:19:23;1704651563;34138;1;6,9951
07/01/2024 19:19:24;1704651564;34153;1;6,9951
07/01/2024 19:19:24;1704651564;34167;1;6,9951
07/01/2024 19:19:24;1704651564;34184;1;6,9945
07/01/2024 19:19:24;1704651564;34196;1;6,9958
07/01/2024 19:19:24;1704651564;34211;1;6,9951
07/01/2024 19:19:25;1704651565;34224;1;6,4955
07/01/2024 19:19:25;1704651565;34241;1;6,4945
07/01/2024 19:19:25;1704651565;34256;1;6,9949
07/01/2024 19:19:25;1704651565;34271;1;6,995
07/01/2024 19:19:25;1704651565;34287;1;6,9946
07/01/2024 19:19:26;1704651566;34303;1;4,494702
07/01/2024 19:19:26;1704651566;34318;1;6,995
07/01/2024 19:19:26;1704651566;34334;1;6,9949
07/01/2024 19:19:26;1704651566;34347;1;6,9955
07/01/2024 19:19:27;1704651567;34362;1;6,9952
07/01/2024 19:19:27;1704651567;34376;1;6,9953
07/01/2024 19:19:27;1704651567;34390;1;6,9954
07/01/2024 19:19:27;1704651567;34404;1;5,495099
07/01/2024 19:19:27;1704651567;34419;1;6,995
07/01/2024 19:19:27;1704651567;34434;1;6,995
07/01/2024 19:19:28;1704651568;34448;1;6,9953
07/01/2024 19:19:28;1704651568;34463;1;6,9953
07/01/2024 19:19:28;1704651568;34476;1;6,9954
07/01/2024 19:19:28;1704651568;34490;1;6,9953
07/01/2024 19:19:29;1704651569;34508;1;3,494304
07/01/2024 19:19:29;1704651569;34525;1;6,9941
