Wall time,Step,Value
1704581552.5657365,7000,-139.5210418701172
1704581580.4382153,20000,-22.88713836669922
1704581594.6083558,26000,-2.2950937747955322
1704581629.9469721,42000,-0.36424028873443604
1704581634.1881232,44000,-1.2650610208511353
1704581641.4384983,47000,-1.1888521909713745
1704581645.5459611,49000,2.31782865524292
1704581659.2825346,55000,1.6213176250457764
1704581666.4056883,58000,-0.6568758487701416
1704581712.780133,77000,5.717899322509766
1704581722.3743942,81000,-0.032761432230472565
1704581775.4852011,101000,8.970200538635254
1704581804.7922642,110000,-75.53961181640625
1704581813.6559882,113000,-196.88262939453125
1704581821.331211,114000,-117.54972076416016
1704581860.156762,121000,-15.194401741027832
1704581941.79195,134000,2.352349042892456
1704582008.3789613,147000,1.2261241674423218
1704582070.5374734,158000,8.14419937133789
1704582098.4236531,163000,7.227899074554443
1704582119.8675032,166000,8.144299507141113
1704582150.4567761,175000,0.9285387992858887
1704582157.9536352,176000,2.9570119380950928
1704582194.4064212,186000,-11.927021026611328
1704582214.9268842,191000,2.271718740463257
1704582218.2892663,193000,2.7176153659820557
1704582221.1842828,194000,1.3737889528274536
1704582235.771993,198000,2.018278121948242
1704582265.7917027,206000,3.9076945781707764
1704582297.0085428,214000,4.300449848175049
1704582300.5162957,215000,4.876543045043945
1704582318.6933823,220000,1.7560861110687256
1704582357.3369505,231000,4.77508544921875
1704582378.8610466,237000,5.051124572753906
1704582398.5953135,242000,4.238158226013184
1704582410.0022335,245000,5.372699737548828
1704582445.6706104,257000,-31.595077514648438
1704582464.3513436,263000,-51.413658142089844
1704582478.9798484,268000,-27.61283302307129
1704582501.7922132,275000,-1.2312607765197754
1704582516.3656309,279000,-1.6238915920257568
1704582519.760713,281000,-79.38729095458984
1704582578.2662487,300000,-10.218400955200195
1704582593.0270202,305000,-3.1359689235687256
1704582593.9814663,306000,-6.729984760284424
1704582608.7488484,311000,-4.791429042816162
1704582622.6232715,316000,-4.351895809173584
1704582626.882133,318000,-6.305758953094482
1704582650.038088,326000,-2.414477586746216
1704582652.767476,327000,-2.870009660720825
1704582670.351836,334000,-1.9624457359313965
1704582681.7053738,338000,-1.1217528581619263
1704582705.6751018,347000,-3.892730951309204
1704582726.6463282,355000,-2.40440034866333
1704582769.1869533,371000,-0.7685826420783997
1704582780.2891717,375000,0.0349438451230526
1704582806.4667141,385000,-1.2479093074798584
1704582815.2198267,387000,-2.9173734188079834
1704582928.953372,429000,-1.0058547258377075
1704582931.5909445,430000,-3.283900260925293
1704582936.4282677,432000,0.3405662178993225
1704582952.4159763,438000,-0.2378966063261032
1704582977.690366,447000,1.0175457000732422
1704582985.3529904,449000,0.7687395811080933
1704582986.5952358,450000,-2.9493966102600098
1704582994.8350782,453000,0.9002494812011719
1704583014.445825,459000,-0.284444659948349
1704583034.3359327,468000,0.4296148419380188
1704583043.39503,471000,0.4074993431568146
1704583045.5109856,472000,1.472821593284607
1704583072.8710332,482000,-0.2607005536556244
1704583120.6446848,499000,0.814799427986145
1704583127.6539586,501000,1.5110365152359009
1704583167.5464182,515000,1.0694154500961304
1704583181.7986395,520000,2.2271456718444824
1704583188.8277028,522000,0.9319570660591125
1704583195.9558969,525000,2.1096880435943604
1704583219.9117646,533000,2.6441149711608887
1704583236.4328797,539000,2.3016550540924072
1704583241.4321952,541000,3.242668628692627
1704583251.6238348,544000,2.556802988052368
1704583267.2541707,550000,1.648291826248169
1704583281.6028006,555000,3.1369552612304688
1704583309.5859327,565000,2.8319995403289795
1704583326.7110686,571000,3.31015682220459
1704583344.1240594,577000,3.403878927230835
1704583355.5624576,581000,3.0749926567077637
1704583370.9238713,587000,1.8776841163635254
1704583378.2526548,589000,2.5662219524383545
1704583380.5336754,590000,2.3541746139526367
1704583384.9366486,592000,2.22802472114563
1704583391.4979653,594000,3.0274887084960938
1704583393.9804475,595000,2.1482720375061035
1704583408.0878296,600000,3.6422197818756104
1704583410.1024635,601000,2.76346755027771
1704583436.9956708,610000,-5.1905341148376465
1704583449.8414645,616000,-50.403865814208984
1704583454.8365934,618000,-38.39204788208008
1704583469.1315172,623000,-10.123383522033691
1704583484.2767348,628000,-15.524680137634277
1704583491.8563817,630000,-64.99480438232422
1704583527.3345542,642000,-2.8658571243286133
1704583546.810912,649000,-4.1003007888793945
1704583551.5586364,650000,0.6988842487335205
1704583556.4708183,652000,0.6224648356437683
1704583561.4697354,654000,0.44779518246650696
1704583566.8114145,655000,2.1537351608276367
1704583570.7825124,657000,0.18674227595329285
1704583604.4217732,669000,1.7242493629455566
1704583614.3713553,672000,1.3374922275543213
1704583627.4514396,676000,3.304727554321289
1704583635.363627,679000,3.2411651611328125
1704583644.2647905,682000,3.3566951751708984
1704583656.5583272,686000,4.297791957855225
1704583659.146549,687000,4.433199882507324
1704583672.6275058,691000,2.8103556632995605
1704583688.483254,696000,1.2090036869049072
1704583716.8170695,707000,3.2796926498413086
1704583730.4434562,711000,2.388063430786133
1704583736.1096196,714000,4.156196117401123
1704583762.5286837,722000,2.335768699645996
1704583771.48928,726000,3.565995931625366
1704583782.1044424,729000,0.954980194568634
1704583784.122398,730000,3.374328851699829
1704583787.0503678,731000,2.3378496170043945
1704583809.419359,738000,1.8788772821426392
1704583827.0406842,744000,0.8701236248016357
1704583831.5668092,746000,3.3004302978515625
1704583838.0273752,747000,0.06961435824632645
1704583845.9552348,751000,1.4493597745895386
1704583856.9961267,755000,3.4725475311279297
1704583869.2503667,759000,4.437560558319092
1704583872.214542,760000,4.149399757385254
1704583883.270321,764000,1.361094355583191
1704583909.1396086,773000,0.37057557702064514
1704583917.7325883,777000,2.3111956119537354
1704583923.266287,778000,3.9484305381774902
1704583924.2921872,779000,4.122866630554199
1704583928.8321993,781000,4.2990803718566895
1704583930.7703092,782000,3.561647891998291
1704583947.7442653,788000,3.9686076641082764
1704583958.6281142,792000,4.530117034912109
1704583960.6971846,793000,3.5289149284362793
1704583966.7478194,795000,3.6319077014923096
1704583971.487368,797000,2.3090810775756836
1704583980.2922318,800000,4.063814640045166
1704583982.5872037,801000,2.809065103530884
1704583984.243361,802000,2.865712881088257
1704583995.6980567,806000,3.325077533721924
1704584006.993537,810000,3.9731462001800537
1704584020.166922,815000,4.382214069366455
1704584022.9356587,816000,4.007437705993652
1704584024.4132674,817000,3.8054330348968506
1704584090.7788424,840000,4.05099630355835
1704584099.0263803,844000,4.5270586013793945
1704584105.0436177,846000,4.187714099884033
1704584118.5611725,851000,3.8063998222351074
1704584178.7929943,875000,3.06484055519104
1704584186.4239225,877000,3.109968662261963
1704584200.5545363,882000,4.142359733581543
1704584205.5909848,884000,4.575613021850586
1704584215.9138634,888000,4.276510238647461
1704584220.6264827,890000,4.504986763000488
1704584242.0098479,898000,4.525332927703857
1704584256.4230642,904000,4.529247760772705
1704584268.27551,908000,4.691071033477783
1704584286.181335,915000,4.238639831542969
1704584293.8210278,917000,4.460533142089844
1704584308.612456,923000,4.079829216003418
1704584313.1231706,925000,4.346980571746826
1704584322.4178836,928000,4.315051555633545
1704584328.4158368,931000,4.332003116607666
1704584351.32277,939000,4.755506992340088
1704584353.7419684,940000,4.072756290435791
1704584363.6402576,943000,4.0434184074401855
1704584380.4718127,950000,4.234946250915527
1704584390.5335932,953000,4.798112869262695
1704584412.9915016,962000,4.475374221801758
1704584424.1577878,966000,4.629351615905762
1704584432.5308387,969000,4.984939098358154
1704584434.543065,970000,5.0563578605651855
1704584460.9108362,979000,5.020431995391846
1704584462.835785,980000,5.368309020996094
1704584475.059385,984000,3.952906608581543
1704584478.8447175,986000,4.537867546081543
1704584482.0187118,987000,4.725615501403809
1704584492.6579003,991000,4.666154861450195
1704584495.134798,992000,4.542939186096191
1704584504.1028326,995000,4.785909652709961
1704584506.432805,996000,4.8704376220703125
1704584527.1502054,1004000,4.471652984619141
1704584539.0097077,1008000,4.6483378410339355
1704584546.3295107,1010000,4.425626277923584
1704584549.915795,1012000,4.924252986907959
1704584551.9300156,1013000,4.492781639099121
1704584577.1726096,1022000,5.0719099044799805
1704584587.2976396,1025000,5.044859886169434
1704584607.3005283,1033000,4.315975666046143
1704584615.144971,1035000,5.15856409072876
1704584624.4346318,1040000,4.547922134399414
1704584638.4896374,1045000,5.134210109710693
1704584659.8686101,1052000,4.8652567863464355
1704584695.8826544,1065000,4.697973728179932
1704584716.0927663,1071000,4.742660045623779
1704584721.3863626,1074000,4.279389381408691
1704584726.318933,1076000,4.27716064453125
1704584737.0946786,1080000,4.82991361618042
1704584748.6652822,1084000,4.562747955322266
1704584753.3987703,1086000,4.924964427947998
1704584768.2053185,1091000,4.155799865722656
1704584773.5436199,1092000,4.79984188079834
1704584797.6302083,1101000,5.12644624710083
1704584818.0065024,1107000,4.858216285705566
1704584825.7102952,1111000,4.592439651489258
1704584828.4494598,1112000,4.91953706741333
1704584856.014545,1122000,4.9568328857421875
1704584869.200921,1127000,5.060563087463379
1704584910.241258,1141000,5.120579719543457
1704584918.6234107,1143000,4.967874050140381
1704584967.6695824,1163000,5.086199760437012
1704584971.9234338,1164000,5.008378982543945
1704584981.4076018,1168000,5.194348335266113
1704584986.8618078,1169000,5.044299602508545
1704584988.4092607,1170000,4.5434722900390625
1704585035.218387,1188000,4.042696475982666
1704585050.2394583,1193000,4.785848140716553
1704585071.5304258,1200000,4.846585750579834
1704585072.531258,1201000,4.71626091003418
1704585088.5706317,1207000,4.140977382659912
1704585093.8518355,1209000,4.993199825286865
1704585107.580915,1214000,4.8012375831604
1704585113.4420097,1216000,5.0978569984436035
1704585177.1060658,1240000,5.177396297454834
1704585184.25078,1242000,5.03205680847168
1704585188.4032035,1244000,4.84433650970459
1704585210.5744536,1252000,4.958072185516357
1704585217.14697,1255000,5.225465297698975
1704585238.2197511,1263000,3.5593247413635254
1704585243.956458,1266000,4.6727070808410645
1704585252.9485383,1269000,5.044535160064697
1704585285.964864,1282000,-7.811250686645508
1704585301.125568,1290000,-6.162192344665527
1704585310.7554214,1296000,-11.082121849060059
1704585320.134912,1302000,-8.825254440307617
1704585324.171609,1303000,-9.48132038116455
1704585333.1279547,1309000,-6.3350934982299805
1704585349.3039453,1319000,-7.590663909912109
1704585358.3052547,1324000,-7.5724196434021
1704585359.8299646,1325000,-4.285386085510254
1704585363.6040926,1328000,-7.41796350479126
1704585375.551888,1334000,-5.363986492156982
1704585377.9990273,1336000,-4.592915058135986
1704585381.5661924,1339000,-5.853150367736816
1704585386.2891188,1342000,-6.036256313323975
1704585392.6010506,1345000,-10.539592742919922
1704585393.8342953,1346000,-7.80958890914917
1704585423.580237,1364000,-4.239224910736084
1704585448.0268884,1379000,-1.584114670753479
1704585473.1198258,1394000,-0.3412099778652191
1704585478.8908863,1397000,-2.708833932876587
1704585480.4853272,1398000,0.6658690571784973
1704585482.8978739,1400000,-2.369328498840332
1704585487.0040731,1401000,0.3801301419734955
1704585522.7226765,1422000,1.2812995910644531
1704585523.3290544,1423000,0.39714765548706055
1704585532.1039534,1428000,3.8144516944885254
1704585535.65312,1431000,2.808699607849121
1704585542.8103645,1435000,1.488795518875122
1704585548.1059897,1437000,0.43718597292900085
1704585552.643062,1441000,3.2219455242156982
1704585559.1930344,1445000,1.4647704362869263
1704585566.5974483,1449000,2.679943323135376
1704585607.672154,1474000,2.51438307762146
1704585608.8969293,1475000,2.043015718460083
1704585626.4726787,1486000,2.8300228118896484
1704585640.6443791,1494000,2.9830920696258545
1704585641.201413,1495000,3.6593728065490723
1704585644.918121,1498000,4.51332950592041
1704585649.3669143,1500000,4.38878059387207
1704585650.4750988,1501000,2.9293787479400635
1704585664.8327765,1510000,3.529263734817505
1704585676.1430197,1517000,3.8793957233428955
1704585701.3317752,1532000,3.819913387298584
1704585701.9860585,1533000,3.1372315883636475
1704585707.4237304,1536000,4.062857627868652
1704585736.9551446,1555000,3.5925638675689697
1704585745.231879,1560000,4.152963161468506
1704585747.935777,1561000,2.6376779079437256
1704585750.6441631,1563000,3.9754104614257812
1704585761.213858,1570000,4.667230606079102
1704585773.209756,1577000,3.4830923080444336
1704585774.3178375,1578000,3.9471163749694824
1704585789.248643,1587000,4.566236972808838
1704585794.297863,1591000,4.388980388641357
1704585798.0217242,1593000,3.22491717338562
1704585805.752953,1597000,4.586888790130615
1704585818.452825,1606000,4.845358848571777
1704585830.31186,1613000,3.9143612384796143
1704585831.842842,1614000,4.73870325088501
1704585839.6847086,1619000,3.934335708618164
1704585852.041674,1627000,4.506789207458496
1704585866.6584647,1636000,4.6747517585754395
1704585868.0033827,1637000,5.0344038009643555
1704585874.8569622,1641000,3.7622318267822266
1704585882.8678777,1646000,4.547414302825928
1704585888.4327593,1649000,4.52698278427124
1704585891.1236858,1651000,4.266795635223389
1704585896.517191,1654000,4.942883014678955
1704585900.355087,1657000,5.08981466293335
1704585906.6167734,1661000,4.026871681213379
1704585920.690793,1669000,4.08596658706665
1704585931.663996,1677000,4.122314929962158
1704585937.6893225,1681000,4.371407508850098
1704585941.2867856,1684000,3.3834662437438965
1704585944.1806633,1685000,3.6085498332977295
1704585953.571059,1691000,4.627968788146973
1704585954.0837076,1692000,3.8395955562591553
1704585967.6788967,1700000,4.074339866638184
1704585973.1893668,1704000,4.511499881744385
1704585975.9256675,1705000,4.097892761230469
1704585976.496664,1706000,3.9446539878845215
1704585979.2244737,1708000,4.206622123718262
1704585984.793822,1711000,4.585915565490723
1704585995.4258058,1718000,3.847439765930176
1704585996.850055,1719000,4.849142551422119
1704586010.0225177,1727000,4.706735610961914
1704586010.8898163,1728000,4.761603355407715
1704586025.9988449,1737000,4.720396041870117
1704586033.1599748,1741000,4.679257392883301
1704586035.1547177,1743000,4.901214599609375
1704586041.3818297,1746000,4.719399929046631
1704586049.3727853,1751000,3.6053218841552734
1704586049.8016548,1752000,5.271547794342041
1704586051.9888976,1754000,4.173520565032959
1704586053.8370364,1755000,5.044276714324951
1704586054.5396821,1756000,4.2207112312316895
1704586062.4126263,1761000,4.4483747482299805
1704586084.4644825,1775000,4.590359687805176
1704586099.3393412,1784000,5.266778945922852
1704586108.1230836,1790000,4.754703521728516
1704586119.0055206,1797000,5.156449794769287
1704586121.7587702,1798000,4.793975830078125
1704586134.6018734,1807000,4.047018051147461
1704586146.8077557,1814000,4.32216739654541
1704586165.7863011,1826000,5.0164570808410645
1704586176.3395417,1833000,4.569626808166504
1704586180.109617,1835000,4.803549766540527
1704586187.7824094,1839000,4.823369026184082
1704586203.630524,1849000,3.933972120285034
1704586204.667798,1850000,4.736199855804443
1704586208.4074528,1853000,4.212845802307129
1704586215.9602327,1858000,5.053511142730713
1704586222.4998162,1862000,4.972426891326904
1704586244.1957347,1875000,4.601014614105225
1704586247.827486,1878000,3.49407958984375
1704586257.283534,1884000,5.055821895599365
1704586260.4334886,1885000,4.61954402923584
1704586261.1247525,1886000,5.275359630584717
1704586288.0090654,1902000,4.435693264007568
1704586316.6929047,1920000,5.03833532333374
1704586326.399821,1926000,5.31978702545166
1704586341.5234675,1935000,-4.90534782409668
1704586350.6334925,1941000,-20.24596405029297
1704586356.8531368,1945000,-12.19361686706543
1704586359.7061746,1947000,-12.688035011291504
1704586364.6152637,1949000,-7.6711297035217285
1704586372.8894904,1955000,-15.530677795410156
1704586379.5404692,1958000,-0.2415362298488617
1704586381.865973,1960000,-5.493250846862793
1704586388.2732773,1963000,-9.387691497802734
1704586391.0997999,1966000,-4.571990489959717
1704586397.2586393,1969000,-4.409867286682129
1704586410.3936465,1978000,-12.86053466796875
1704586414.4704206,1980000,-4.681570053100586
1704586435.080201,1992000,-15.65112590789795
1704586436.361865,1993000,-2.3957505226135254
1704586440.0778508,1994000,2.4193124771118164
1704586461.4104462,2008000,-0.5766557455062866
1704586468.1454964,2012000,-11.926321983337402
1704586475.2334285,2016000,-25.672441482543945
1704586483.5240571,2020000,-3.586334228515625
1704586483.689045,2021000,-10.533550262451172
1704586487.7723484,2024000,-35.28700256347656
1704586492.1294334,2026000,-2.351046085357666
1704586494.5211132,2028000,-23.52760124206543
1704586508.2541313,2036000,-408.8161315917969
1704586509.6389952,2038000,-60.41497802734375
1704586517.5512013,2041000,0.8528378009796143
1704586519.771859,2044000,-33.97822952270508
1704586525.938126,2047000,-25.5299129486084
1704586528.890858,2049000,-81.40007781982422
1704586534.3664646,2052000,-0.2707255780696869
1704586538.406367,2055000,-7.928188323974609
1704586564.195403,2071000,-13.94084358215332
1704586584.6303165,2083000,-1.630020260810852
1704586585.2760499,2084000,-2.5208075046539307
1704586586.7609954,2085000,-62.15458297729492
1704586589.5597908,2087000,-44.45545959472656
1704586590.4785533,2088000,-1.843062400817871
1704586594.7965283,2090000,-6.107584476470947
1704586597.0665584,2092000,-7.956471920013428
1704586604.6630979,2096000,-12.240208625793457
1704586611.3031225,2100000,-33.92580032348633
1704586620.3563786,2106000,-6.028964042663574
1704586623.4091115,2108000,-3.933859348297119
1704586636.2030733,2115000,2.7773451805114746
1704586640.2748415,2118000,0.7473911046981812
1704586648.497955,2123000,-3.4631505012512207
1704586654.8980167,2127000,-36.6778450012207
1704586662.4836848,2132000,-0.3997381329536438
1704586665.2843277,2134000,1.3990659713745117
1704586668.3273606,2135000,0.6432926058769226
1704586685.565127,2146000,-212.58670043945312
1704586690.9186275,2150000,-5.883572101593018
1704586696.492962,2153000,-5.415050506591797
1704586701.306442,2156000,-11.462594032287598
1704586703.0274684,2157000,-26.71883201599121
1704586707.022983,2160000,-7.6519951820373535
1704586710.0769737,2161000,3.7820796966552734
1704586711.3451586,2163000,2.2047300338745117
1704586720.3481317,2168000,-1.0255935192108154
1704586721.499105,2169000,1.1238073110580444
1704586734.50389,2176000,0.9093140959739685
1704586735.586188,2177000,-0.21394802629947662
1704586740.4264646,2181000,-2.77797269821167
1704586744.9424772,2183000,1.9726818799972534
1704586746.8081584,2185000,-0.17600052058696747
1704586754.916266,2189000,1.57008957862854
1704586769.3812466,2199000,0.4677920341491699
1704586772.0372932,2201000,0.6535166501998901
1704586776.6102982,2203000,-2.5338456630706787
1704586777.6515477,2204000,-1.027735710144043
1704586784.7209349,2208000,-1.3647502660751343
1704586788.6041908,2211000,1.4694747924804688
1704586801.4309857,2219000,2.8161940574645996
1704586809.0394576,2223000,1.9703540802001953
1704586829.078996,2237000,-0.11668886989355087
1704586835.9723985,2241000,2.574509620666504
1704586838.0788112,2243000,1.4609642028808594
1704586845.950114,2248000,-0.5845764875411987
1704586848.971264,2249000,-0.30729424953460693
1704586851.1239562,2251000,-0.57773357629776
1704586853.5904055,2253000,0.5454695224761963
1704586857.0144079,2254000,1.2916547060012817
1704586858.7189133,2256000,1.968055009841919
1704586861.7090538,2258000,-2.778930425643921
1704586865.0881429,2259000,2.062532901763916
1704586874.4752715,2266000,2.100241184234619
1704586881.2120838,2269000,2.938307046890259
1704586886.0747669,2274000,1.9103922843933105
1704586913.2718477,2290000,2.344647169113159
1704586916.8210146,2293000,3.340299606323242
1704586932.9790535,2303000,1.479413390159607
1704586942.8214498,2309000,2.63598370552063
1704586947.7721283,2312000,1.7915561199188232
1704586951.3058176,2315000,1.3269870281219482
1704586957.1329806,2318000,4.22552490234375
1704586958.1587756,2319000,4.05187463760376
1704586958.8739128,2320000,1.1680386066436768
1704586975.1899502,2330000,1.0830206871032715
1704586978.0690856,2331000,-0.15070025622844696
1704586978.9877365,2332000,0.5343870520591736
1704586981.21207,2334000,-2.463200569152832
1704587004.7206798,2346000,3.84810471534729
1704587007.4965668,2347000,3.767463445663452
1704587009.9950492,2349000,2.5820395946502686
1704587023.1429336,2357000,1.8026551008224487
1704587038.8558633,2366000,2.798729658126831
1704587066.2174199,2383000,-3.8515238761901855
1704587087.6666296,2397000,0.13424687087535858
1704587094.9606888,2401000,-2.327122211456299
1704587095.9559698,2402000,1.1747839450836182
1704587101.2764409,2404000,1.2419949769973755
1704587112.4450595,2412000,0.9417136907577515
1704587116.9501228,2414000,3.8890161514282227
1704587121.1059349,2418000,0.7991408109664917
1704587138.705041,2428000,3.1030468940734863
1704587151.8101737,2436000,-0.6316602826118469
1704587152.8160334,2437000,3.3817994594573975
1704587168.8612792,2448000,3.238370180130005
1704587181.8790858,2456000,2.0233893394470215
1704587191.5471466,2462000,3.065499782562256
1704587192.3001635,2463000,3.2145936489105225
1704587196.5405076,2465000,0.9712450504302979
1704587198.428028,2467000,3.1568171977996826
1704587205.9133253,2472000,2.042478084564209
1704587235.9320168,2491000,1.286607265472412
1704587244.527072,2497000,4.180614471435547
1704587245.319051,2498000,3.589404821395874
1704587260.3809853,2508000,2.7908785343170166
1704587263.1202722,2510000,3.7948195934295654
1704587268.4302874,2513000,4.1679368019104
1704587269.2032495,2514000,4.263895034790039
1704587270.7042994,2515000,3.2534050941467285
1704587287.6123645,2526000,3.209556818008423
1704587292.3343186,2529000,3.001004695892334
1704587301.570229,2535000,4.278514862060547
1704587308.2451131,2540000,1.0471209287643433
1704587311.7379024,2542000,4.008328437805176
1704587315.0671334,2544000,2.886287212371826
1704587318.1161,2546000,-3.808765411376953
1704587331.985055,2555000,3.2532496452331543
1704587338.3682377,2559000,1.9405385255813599
1704587344.9942756,2563000,-1.23045015335083
1704587346.8364196,2565000,3.3344852924346924
1704587352.912423,2568000,3.6573259830474854
1704587364.7763746,2577000,0.5744195580482483
1704587366.4000885,2578000,-0.8526202440261841
1704587381.6469085,2588000,2.478616714477539
1704587385.7002292,2590000,3.7971997261047363
1704587403.4261243,2602000,4.2452473640441895
1704587404.733235,2603000,3.540926218032837
1704587408.9934876,2604000,4.026378631591797
1704587409.1430879,2605000,-40.08305358886719
1704587412.974995,2608000,4.245184421539307
1704587419.1649787,2612000,3.471099615097046
1704587428.027088,2618000,2.643960475921631
1704587429.0334513,2619000,2.2623889446258545
1704587434.3459482,2622000,3.026710271835327
1704587447.7398558,2630000,1.7535924911499023
1704587456.3741376,2635000,1.9926444292068481
1704587458.9732997,2638000,3.177292823791504
1704587464.3612351,2641000,3.629096031188965
1704587465.2000225,2642000,2.1707773208618164
1704587474.3558745,2648000,2.815140724182129
1704587477.3441625,2650000,0.602439284324646
1704587488.0779147,2656000,2.946699380874634
1704587496.4488854,2662000,2.4070677757263184
1704587504.0922675,2667000,4.091240882873535
1704587531.8729305,2686000,3.677699565887451
1704587537.8666282,2690000,3.978278636932373
1704587543.052025,2692000,3.802149534225464
1704587550.6496406,2697000,2.8038330078125
1704587556.8761377,2702000,4.4601664543151855
1704587577.1692064,2715000,2.567352533340454
1704587583.329094,2719000,2.2871885299682617
1704587586.6141055,2722000,-0.1470123827457428
1704587609.7692275,2737000,0.9697349667549133
1704587626.0638366,2748000,1.536374568939209
1704587629.270129,2749000,0.9064408540725708
1704587632.3748643,2752000,2.142369270324707
1704587641.8847826,2758000,3.6769235134124756
1704587653.7632124,2765000,2.9722235202789307
1704587654.5122442,2766000,2.6729748249053955
1704587655.4936497,2767000,2.8024344444274902
1704587656.8106868,2768000,4.618959903717041
1704587658.5600884,2769000,4.379990100860596
1704587661.3613226,2770000,2.0814313888549805
1704587672.331685,2778000,4.021342754364014
1704587708.890112,2801000,3.729118585586548
1704587709.311003,2802000,2.3372271060943604
1704587710.2280908,2803000,1.508908987045288
1704587720.4916952,2810000,-15.66201114654541
1704587738.6287115,2821000,2.07491397857666
1704587741.0777571,2823000,3.9307260513305664
1704587757.9186728,2835000,4.404974937438965
1704587759.4682088,2836000,3.4642763137817383
1704587763.9130359,2839000,3.6124773025512695
1704587766.8839533,2841000,3.4175994396209717
1704587769.6376867,2842000,3.7415943145751953
1704587772.3350794,2844000,3.334763765335083
1704587800.4278607,2863000,4.21176290512085
1704587807.5535667,2868000,1.5450575351715088
1704587811.4249144,2871000,4.308688640594482
1704587816.6946409,2874000,0.791824460029602
1704587830.4463828,2883000,3.785820722579956
1704587831.5373962,2884000,1.7815663814544678
1704587839.7700999,2890000,3.198439598083496
1704587842.592734,2892000,3.177039623260498
1704587843.3437536,2893000,4.057827472686768
1704587853.6376672,2899000,1.3430246114730835
1704587856.7954385,2902000,2.576010227203369
1704587865.9671488,2908000,2.796252489089966
1704587869.9428349,2910000,3.56807804107666
1704587872.3546498,2912000,2.3225455284118652
1704587877.5060127,2915000,3.808849811553955
1704587897.3360374,2929000,3.4553170204162598
1704587900.6538649,2931000,3.7408289909362793
1704587901.904668,2932000,2.9407107830047607
1704587903.1334233,2933000,3.3068220615386963
1704587918.8757832,2944000,3.217294692993164
1704587934.2447937,2954000,4.404622554779053
1704587947.05178,2962000,2.4274520874023438
1704587971.7227519,2979000,1.8151458501815796
1704587981.495507,2986000,2.8591108322143555
1704587984.1839259,2987000,4.0232648849487305
1704587988.0184212,2990000,3.615823268890381
1704588002.5228395,3000000,3.6015467643737793
1704588011.7136617,3006000,3.875180721282959
1704588017.6743758,3010000,3.367551803588867
1704588025.259618,3015000,4.176966190338135
1704588027.6562812,3017000,3.120820999145508
1704588031.2473447,3019000,3.1481997966766357
1704588034.2549224,3021000,3.892925977706909
1704588038.1935382,3023000,2.6418297290802
1704588042.7954426,3027000,3.6441051959991455
1704588045.6803682,3028000,4.05187463760376
1704588049.159355,3031000,3.531099796295166
1704588057.900337,3037000,2.8704845905303955
1704588061.6634233,3039000,4.202029705047607
1704588065.8804553,3042000,4.799927234649658
1704588078.3394735,3050000,3.375753879547119
1704588079.5622797,3052000,3.8338329792022705
1704588081.434724,3053000,2.873889207839966
1704588084.3774786,3054000,3.2998952865600586
1704588094.7900581,3062000,3.6071364879608154
1704588117.6154354,3077000,4.052268028259277
1704588121.8048604,3079000,3.999213933944702
1704588123.4415824,3081000,4.080984115600586
1704588125.9735734,3083000,3.7916576862335205
1704588129.7454536,3085000,4.0941853523254395
1704588142.2216687,3094000,3.7657296657562256
1704588148.6115763,3098000,3.333019495010376
1704588168.2904375,3111000,4.608455181121826
1704588175.1305299,3115000,2.974580764770508
1704588201.9874682,3134000,4.275149822235107
1704588224.8133495,3149000,4.057794094085693
1704588225.8956273,3150000,4.409687042236328
1704588235.4002857,3156000,4.055219650268555
1704588237.838474,3157000,3.822234630584717
1704588240.6580865,3159000,4.663362979888916
1704588245.5377965,3162000,2.904045820236206
1704588253.7666886,3167000,3.134683847427368
1704588258.7505662,3171000,3.780973196029663
1704588261.9681454,3173000,2.820586919784546
1704588286.6264908,3189000,4.697585582733154
1704588296.8462708,3196000,5.533252239227295
1704588302.4973764,3200000,4.170955181121826
1704588313.9185317,3207000,4.364718437194824
1704588316.7442884,3208000,2.1765596866607666
1704588325.7840443,3215000,2.8719093799591064
1704588330.3775187,3218000,3.1440162658691406
1704588367.8522782,3242000,4.575552940368652
1704588373.25515,3245000,1.43868088722229
1704588383.4699926,3252000,0.7895829677581787
1704588389.136609,3255000,4.421846389770508
1704588389.8946126,3256000,3.0275232791900635
1704588393.2712984,3258000,1.696588397026062
1704588394.3205345,3259000,1.5352110862731934
1704588406.1835046,3266000,3.6220407485961914
1704588426.311039,3279000,2.3195762634277344
1704588433.8834422,3284000,1.2089881896972656
1704588448.6383073,3293000,0.7136437892913818
1704588450.8745468,3295000,1.5485361814498901
1704588454.7744374,3297000,-2.635608434677124
1704588462.2455173,3301000,2.207422971725464
1704588465.1324,3304000,3.5021138191223145
1704588487.2979531,3317000,1.5571644306182861
1704588489.4632258,3319000,3.3108372688293457
1704588499.0524232,3325000,-0.6936607956886292
1704588512.9684458,3333000,-0.00037359396810643375
1704588522.839255,3339000,2.941171646118164
1704588524.0051827,3340000,1.5827745199203491
1704588525.7468925,3341000,3.0334463119506836
1704588532.5921454,3345000,3.587517261505127
1704588541.0171041,3350000,2.7773683071136475
1704588551.4422262,3357000,3.7321362495422363
1704588565.3641112,3365000,1.1703062057495117
1704588571.911667,3369000,2.5863683223724365
1704588577.7611911,3373000,4.043659687042236
1704588582.2769604,3375000,3.1168644428253174
1704588591.492191,3381000,3.4948172569274902
1704588599.905324,3386000,2.2950761318206787
1704588602.6493301,3388000,2.299525737762451
1704588606.3271456,3390000,3.9636688232421875
1704588610.9594138,3393000,1.9198853969573975
1704588619.2681541,3398000,2.583188533782959
1704588639.7581108,3410000,-0.9946140050888062
1704588647.848056,3415000,4.0652618408203125
1704588656.0296848,3420000,2.3617923259735107
1704588683.8042252,3438000,3.1517951488494873
1704588690.9951057,3442000,2.2612996101379395
1704588694.8386006,3445000,2.5546700954437256
1704588702.3756108,3450000,1.149176001548767
1704588714.2266817,3457000,3.836177349090576
1704588719.8380547,3461000,0.7284127473831177
1704588723.5893972,3463000,4.114487648010254
1704588733.8017728,3469000,1.254799485206604
1704588734.7288277,3470000,2.995210647583008
1704588743.70289,3476000,3.7396597862243652
1704588755.8271477,3483000,3.4737496376037598
1704588764.7384398,3489000,1.8733729124069214
1704588768.7929604,3492000,-0.19126741588115692
1704588780.473862,3498000,0.7872421741485596
1704588797.8292289,3509000,1.174276351928711
1704588800.6628294,3511000,4.653044700622559
1704588817.1031637,3521000,3.5226051807403564
1704588822.4729693,3524000,1.9497562646865845
1704588824.8472822,3526000,1.5477551221847534
1704588832.8105474,3531000,2.5007312297821045
1704588858.883672,3547000,3.4039433002471924
1704588863.900241,3549000,2.81248140335083
1704588872.4437149,3554000,3.688825845718384
1704588872.6087797,3555000,2.0960683822631836
1704588878.5910373,3559000,1.4518057107925415
1704588882.0079496,3561000,0.7542123198509216
1704588891.9853423,3567000,3.1881425380706787
1704588893.5616746,3568000,3.776810646057129
1704588906.0406492,3575000,1.3153072595596313
1704588924.3881872,3587000,1.619013786315918
1704588933.0036764,3592000,2.5280470848083496
1704588951.6102822,3604000,0.9439119100570679
1704588953.5366938,3605000,4.44784688949585
1704588965.0168278,3611000,3.493938684463501
1704588965.9105053,3612000,1.939558506011963
1704588988.0068388,3626000,2.268092632293701
1704588995.4798775,3630000,2.1594274044036865
1704588998.4886544,3632000,1.0584758520126343
1704589001.2043834,3634000,1.5396995544433594
1704589006.948645,3637000,2.361194133758545
1704589011.11765,3640000,2.968299627304077
1704589026.3904622,3649000,4.331910610198975
1704589035.5384872,3655000,2.304257392883301
1704589040.9801056,3657000,3.9713997840881348
1704589057.9368458,3668000,1.4162882566452026
1704589059.3890178,3669000,3.408599615097046
1704589068.520839,3675000,0.7022529244422913
1704589080.18757,3682000,2.796517848968506
1704589119.0557573,3706000,0.987695038318634
1704589128.9321518,3712000,3.6589150428771973
1704589133.867001,3714000,3.624549627304077
1704589168.2747762,3735000,0.20896971225738525
1704589172.5111487,3738000,2.303877353668213
1704589179.9518783,3742000,3.3105382919311523
1704589180.532845,3743000,3.229069709777832
1704589182.0573359,3744000,1.728194236755371
1704589192.0149062,3750000,3.237391948699951
1704589197.9339554,3753000,0.6847256422042847
1704589200.557535,3755000,-0.25897055864334106
1704589215.916336,3764000,3.7545275688171387
1704589228.4238288,3771000,4.105754375457764
1704589237.2144217,3776000,-16.396211624145508
1704589248.269393,3784000,1.9673726558685303
1704589255.6009333,3788000,2.8967206478118896
1704589262.5889952,3792000,0.5299776792526245
1704589282.8756752,3805000,2.39835262298584
1704589288.133453,3807000,4.753236293792725
1704589290.895839,3810000,2.7004764080047607
1704589310.4191406,3822000,2.1112747192382812
1704589316.5659618,3826000,1.7030197381973267
1704589325.626384,3831000,3.2866663932800293
1704589329.9196594,3833000,0.8124542832374573
1704589347.0136337,3843000,3.338618278503418
1704589349.417839,3845000,3.9440395832061768
1704589351.113363,3847000,1.2824245691299438
1704589374.546578,3860000,0.5211700201034546
1704589384.34645,3866000,3.521141767501831
1704589400.1671348,3876000,2.165905237197876
1704589408.8851352,3881000,1.1022735834121704
1704589419.652422,3888000,2.6348233222961426
1704589425.124735,3891000,2.5031895637512207
1704589427.8597367,3893000,3.2922046184539795
1704589461.015692,3913000,4.072444915771484
1704589461.9836416,3914000,1.7607625722885132
1704589465.9250913,3915000,3.6857330799102783
1704589472.3548086,3920000,1.1944167613983154
1704589476.6069555,3922000,-3.4069063663482666
1704589493.5235133,3932000,2.608651876449585
1704589505.3716915,3940000,3.1976542472839355
1704589517.4165928,3946000,0.226820707321167
1704589517.9132862,3947000,2.8303139209747314
1704589525.2085676,3951000,3.399479627609253
1704589542.2201602,3962000,1.7458195686340332
1704589551.4005003,3968000,3.307813882827759
1704589561.1762586,3974000,4.956158638000488
1704589567.1153712,3977000,3.2404468059539795
1704589590.2143455,3992000,3.6867427825927734
1704589597.4285228,3996000,2.7105207443237305
1704589609.8642468,4003000,2.529217004776001
1704589615.1913958,4007000,3.120344877243042
1704589623.4943871,4012000,2.2562568187713623
1704589631.9234607,4017000,0.9932604432106018
1704589638.7052732,4021000,4.34782075881958
1704589639.8868713,4022000,3.4171628952026367
1704589657.8736618,4033000,3.6094155311584473
1704589661.254648,4034000,3.8695197105407715
1704589678.5151663,4045000,1.7862451076507568
1704589681.6278782,4047000,3.2610154151916504
1704589682.4258451,4048000,3.5785629749298096
1704589694.6374023,4055000,3.5886805057525635
1704589696.9796712,4057000,1.7204093933105469
1704589699.0386558,4058000,2.806534767150879
1704589700.4040456,4059000,3.537585496902466
1704589703.3040483,4060000,2.6518938541412354
1704589708.5353742,4064000,4.869383811950684
1704589712.7866662,4066000,3.8331282138824463
1704589748.2352219,4088000,4.702505588531494
1704589754.1671395,4091000,3.1399710178375244
1704589776.4480495,4105000,4.403167724609375
1704589784.592878,4110000,1.1517330408096313
1704589787.5196154,4111000,1.1862772703170776
1704589790.3352773,4113000,-1.457593560218811
1704589806.1286173,4121000,0.379459947347641
1704589812.2399802,4126000,2.9803524017333984
1704589825.195654,4133000,3.3234994411468506
1704589872.956442,4161000,3.230955123901367
1704589887.0255113,4168000,1.2732583284378052
1704589906.1670773,4179000,1.9161434173583984
1704589914.3093219,4184000,4.221762180328369
1704589931.869983,4193000,1.0483304262161255
1704589932.2499819,4194000,0.8088732957839966
1704589951.6570034,4205000,2.9151055812835693
1704589953.1825802,4206000,1.1533639430999756
1704589956.2070992,4208000,4.1624579429626465
1704589960.7302084,4210000,3.851417303085327
1704589965.231167,4213000,2.012376070022583
1704589968.7550404,4214000,2.4912731647491455
1704589970.9098868,4216000,3.967064380645752
1704590010.7138894,4239000,2.9653496742248535
1704590019.5665596,4244000,3.4449574947357178
1704590025.5941179,4247000,4.1205525398254395
1704590031.9359827,4250000,2.555805206298828
1704590041.0053327,4255000,1.010939598083496
1704590059.6701627,4266000,2.634567975997925
1704590074.622917,4275000,0.6738525032997131
1704590080.4009888,4278000,4.481129169464111
1704590082.089092,4279000,3.6030595302581787
1704590098.6783118,4288000,3.5919580459594727
1704590109.617567,4294000,1.600252628326416
1704590138.2383027,4310000,4.007676124572754
1704590148.6008966,4316000,-0.5758267045021057
1704590155.3899279,4320000,3.397160768508911
1704590161.572844,4323000,2.506049394607544
1704590171.721472,4329000,3.808011293411255
1704590174.7309327,4331000,3.0411744117736816
1704590191.0919423,4340000,3.619499683380127
1704590198.770873,4344000,4.005439758300781
1704590209.1900833,4350000,-14.058439254760742
1704590217.716207,4355000,4.779240131378174
1704590227.8091772,4361000,-2.534588575363159
1704590235.8149972,4365000,3.0565226078033447
1704590244.9290473,4370000,2.476940870285034
1704590257.927324,4377000,4.1161065101623535
1704590265.6439047,4381000,3.439119577407837
1704590282.346553,4390000,2.886362314224243
1704590286.7428582,4393000,2.3099262714385986
1704590308.9490469,4405000,4.133426189422607
1704590320.173312,4412000,3.9504051208496094
1704590327.4879396,4415000,4.4487433433532715
1704590329.0971997,4417000,3.1720166206359863
1704590331.0217412,4418000,1.9526731967926025
1704590338.18001,4422000,2.8655998706817627
1704590339.9818158,4423000,4.278619766235352
1704590341.6349554,4424000,2.977311849594116
1704590363.098699,4436000,2.5673348903656006
1704590372.4118938,4442000,3.942899703979492
1704590374.1062639,4443000,5.08538293838501
1704590377.4865587,4445000,3.9438424110412598
1704590390.3658738,4451000,3.922034978866577
1704590393.850794,4454000,3.1163718700408936
1704590404.1519725,4460000,4.415988922119141
1704590411.0900242,4464000,2.7725095748901367
1704590423.4561942,4471000,3.2497689723968506
1704590440.8937714,4481000,3.106790542602539
1704590453.9462726,4487000,3.7039058208465576
1704590459.2236078,4491000,4.2955732345581055
1704590464.4961472,4494000,2.305692434310913
1704590478.2405398,4502000,3.5701184272766113
1704590482.2047606,4504000,2.4122798442840576
1704590504.6689188,4517000,4.2570719718933105
1704590512.2713437,4521000,4.097412109375
1704590513.3345494,4522000,4.048549652099609
1704590547.696118,4541000,4.315657615661621
1704590549.0095384,4542000,2.9798781871795654
1704590554.4428966,4545000,4.006352424621582
1704590566.7314224,4552000,4.915770530700684
1704590571.8366964,4554000,3.7579050064086914
1704590583.97994,4562000,4.64381742477417
1704590586.850853,4564000,2.1706931591033936
1704590589.9776402,4565000,4.388988018035889
1704590612.1291776,4578000,3.728449583053589
1704590616.9117255,4580000,3.2345311641693115
1704590617.1914861,4581000,2.676039457321167
1704590635.1367126,4590000,4.482083797454834
1704590638.8534062,4593000,4.805384635925293
1704590659.0726173,4604000,4.372409820556641
1704590665.2031631,4607000,0.6416218280792236
1704590668.0747316,4609000,3.1298770904541016
1704590673.4156413,4611000,4.900620937347412
1704590693.759593,4623000,4.450734615325928
1704590725.938894,4640000,-4.068975448608398
1704590733.3313503,4645000,3.8723318576812744
1704590749.1061273,4655000,4.079931735992432
1704590757.7072399,4661000,3.239492893218994
1704590769.2685068,4668000,2.3797717094421387
1704590778.527101,4674000,3.8733084201812744
1704590780.6534603,4676000,4.096743106842041
1704590786.9586933,4680000,3.897709846496582
1704590797.0972035,4687000,4.9907426834106445
1704590799.1029325,4688000,4.392714977264404
1704590801.670123,4689000,4.455304145812988
1704590817.1794631,4699000,4.867547035217285
1704590850.4163737,4720000,5.008009433746338
1704590858.882151,4725000,3.1168053150177
1704590866.6417453,4730000,3.2355692386627197
1704590875.1428819,4736000,1.971024990081787
1704590890.7137287,4746000,3.2816996574401855
1704590898.7348654,4751000,2.3012478351593018
1704590907.2042375,4757000,2.8138184547424316
1704590914.722243,4761000,3.7052724361419678
1704590915.4343698,4762000,3.078707218170166
1704590927.5136526,4770000,5.028131484985352
1704590932.2971106,4773000,3.915383815765381
1704590933.4171586,4774000,3.497217893600464
1704590938.8294926,4776000,3.0194156169891357
1704590941.8027751,4779000,4.704692840576172
1704590943.0325422,4780000,4.339763164520264
1704590944.1366298,4781000,3.9085583686828613
1704590952.2718315,4786000,3.6750261783599854
1704590956.1052923,4788000,2.2054343223571777
1704590960.2209315,4791000,3.6115589141845703
1704590963.0206764,4792000,4.555160999298096
1704590963.9826388,4793000,3.618044137954712
1704590965.42335,4794000,3.4427943229675293
1704590968.1213052,4796000,2.9155819416046143
1704590973.6448612,4799000,4.348047256469727
1704590974.772382,4800000,4.1097588539123535
1704590983.7056038,4806000,2.8619630336761475
1704590995.113177,4812000,3.6067087650299072
1704590997.1206057,4814000,3.61206316947937
1704591000.8946536,4817000,4.75154972076416
1704591019.999545,4829000,4.47029447555542
1704591031.314351,4837000,3.582199811935425
1704591034.8248012,4838000,4.080220699310303
1704591035.7819538,4839000,2.7783079147338867
1704591045.1035998,4845000,3.844573497772217
1704591055.0667412,4852000,3.6168854236602783
1704591063.059043,4857000,2.2686896324157715
1704591075.1200037,4864000,-1.6034003496170044
1704591095.1604245,4877000,4.779569625854492
1704591103.9294052,4883000,3.3173224925994873
1704591107.8581092,4885000,3.163731336593628
1704591111.2471702,4888000,4.244799613952637
1704591123.1855114,4895000,4.615199565887451
1704591132.6698112,4901000,3.1130049228668213
1704591136.5745215,4904000,3.1776044368743896
1704591140.5173812,4906000,4.44589376449585
1704591141.7610974,4907000,5.255399703979492
1704591156.1085317,4916000,3.247443437576294
1704591171.865354,4926000,3.885021924972534
1704591173.677126,4927000,3.762845039367676
1704591185.0159826,4935000,3.4792122840881348
1704591204.9672973,4947000,3.1149375438690186
1704591209.261755,4950000,4.254791736602783
1704591214.0920873,4953000,3.220249891281128
1704591233.344877,4966000,4.648519515991211
1704591246.6920602,4974000,3.888964891433716
1704591257.9188561,4982000,3.597529888153076
1704591260.4895942,4983000,4.111681938171387
1704591264.5934494,4986000,2.852487802505493
1704591269.2153487,4988000,4.740512847900391
1704591269.719999,4989000,4.367641925811768
1704591293.2148073,5003000,4.524874687194824
1704591301.8052192,5009000,3.830075979232788
1704591305.1520562,5011000,4.034744739532471
1704591328.7352245,5026000,4.1674652099609375
1704591339.4206018,5033000,4.099499702453613
1704591350.7018642,5039000,4.405280590057373
1704591353.4211743,5042000,3.930799722671509
1704591354.827979,5043000,4.3459954261779785
1704591359.766576,5046000,4.201259613037109
1704591364.1877434,5049000,4.9414567947387695
1704591385.2709029,5062000,3.2408132553100586
1704591388.1936646,5064000,4.260078430175781
1704591390.9252398,5065000,3.9489388465881348
1704591391.6660178,5066000,3.645852565765381
1704591400.501257,5072000,4.43946647644043
1704591408.2728565,5077000,4.157947063446045
1704591427.6437576,5090000,4.085023403167725
1704591455.3391132,5106000,2.787858724594116
1704591465.7361376,5113000,2.088871717453003
1704591473.2072904,5118000,-3.133645534515381
1704591474.9587708,5119000,1.6388996839523315
1704591484.1231437,5125000,-0.8616719245910645
1704591498.6789918,5134000,2.038966417312622
1704591504.8669999,5137000,3.280928134918213
1704591505.3821704,5138000,0.7055795788764954
1704591508.2899966,5140000,2.4941163063049316
1704591517.8000414,5146000,3.7502996921539307
1704591521.4294412,5147000,3.2588837146759033
1704591523.0097678,5149000,4.494939804077148
1704591531.0407064,5154000,0.4930243194103241
1704591535.124252,5157000,5.000516414642334
1704591559.3710687,5172000,5.743826389312744
1704591568.6046855,5177000,2.973328113555908
1704591580.5624871,5183000,3.706864356994629
1704591590.452863,5190000,1.8000680208206177
1704591597.9920492,5194000,3.8574349880218506
1704591601.661686,5197000,3.8786122798919678
1704591657.3147721,5212000,2.6046242713928223
1704591688.6368978,5220000,3.9785830974578857
1704591702.8183317,5224000,3.4783992767333984
1704591707.4945014,5225000,3.3785393238067627
1704591775.8498318,5243000,4.978299140930176
1704591787.853012,5246000,1.979074239730835
1704591791.147321,5247000,6.278119087219238
1704591798.3495996,5249000,1.728848934173584
1704591806.9487886,5251000,2.6447324752807617
1704591810.3566067,5252000,6.311899185180664
1704591817.6254854,5254000,6.645165920257568
