06/01/2024 01:27:53;1704500873;4038;6;-0,6877646
06/01/2024 01:27:54;1704500874;4071;1;7,988999
06/01/2024 01:27:54;1704500874;4102;1;7,989899
06/01/2024 01:27:55;1704500875;4133;1;7,989599
06/01/2024 01:27:55;1704500875;4164;1;7,989799
06/01/2024 01:27:56;1704500876;4195;1;7,989499
06/01/2024 01:27:56;1704500876;4226;1;7,989799
06/01/2024 01:27:57;1704500877;4255;1;4,990199
06/01/2024 01:27:57;1704500877;4286;1;7,989899
06/01/2024 01:27:58;1704500878;4316;1;7,989699
06/01/2024 01:27:58;1704500878;4349;1;7,988999
06/01/2024 01:27:58;1704500878;4381;1;7,989299
06/01/2024 01:27:59;1704500879;4414;1;7,989299
06/01/2024 01:27:59;1704500879;4444;1;7,989899
06/01/2024 01:28:00;1704500880;4476;1;7,989399
06/01/2024 01:28:00;1704500880;4508;1;7,989099
06/01/2024 01:28:01;1704500881;4540;1;7,989299
06/01/2024 01:28:01;1704500881;4575;1;7,988499
06/01/2024 01:28:02;1704500882;4607;1;7,989399
06/01/2024 01:28:02;1704500882;4638;1;7,989599
06/01/2024 01:28:03;1704500883;4669;1;7,989599
06/01/2024 01:28:03;1704500883;4701;1;7,989499
06/01/2024 01:28:04;1704500884;4731;1;7,989799
06/01/2024 01:28:04;1704500884;4766;1;7,988399
06/01/2024 01:28:05;1704500885;4799;1;7,988899
06/01/2024 01:28:05;1704500885;4834;1;7,988499
06/01/2024 01:28:06;1704500886;4865;1;7,989599
06/01/2024 01:28:06;1704500886;4898;1;7,989199
06/01/2024 01:28:07;1704500887;4928;1;7,489799
06/01/2024 01:28:07;1704500887;4959;1;7,989599
06/01/2024 01:28:08;1704500888;4992;1;7,989199
06/01/2024 01:28:08;1704500888;5023;1;4,989499
06/01/2024 01:28:09;1704500889;5054;1;7,989699
06/01/2024 01:28:09;1704500889;5085;1;7,989499
06/01/2024 01:28:10;1704500890;5117;1;7,989499
06/01/2024 01:28:10;1704500890;5152;1;7,988399
06/01/2024 01:28:11;1704500891;5184;1;7,989199
06/01/2024 01:28:11;1704500891;5216;1;7,989499
06/01/2024 01:28:11;1704500891;5246;1;7,990099
06/01/2024 01:28:12;1704500892;5277;1;5,9895
06/01/2024 01:28:12;1704500892;5310;1;7,989099
06/01/2024 01:28:13;1704500893;5341;1;7,989499
06/01/2024 01:28:13;1704500893;5374;1;7,988999
06/01/2024 01:28:14;1704500894;5408;1;7,4886
06/01/2024 01:28:14;1704500894;5439;1;7,989599
06/01/2024 01:28:15;1704500895;5471;1;7,989499
06/01/2024 01:28:15;1704500895;5507;1;7,988199
06/01/2024 01:28:16;1704500896;5538;1;7,989399
06/01/2024 01:28:16;1704500896;5570;1;7,989499
06/01/2024 01:28:17;1704500897;5601;1;7,989599
06/01/2024 01:28:17;1704500897;5631;1;7,989799
06/01/2024 01:28:18;1704500898;5664;1;7,989099
06/01/2024 01:28:18;1704500898;5696;1;7,989499
06/01/2024 01:28:19;1704500899;5726;1;7,989799
06/01/2024 01:28:19;1704500899;5758;1;7,989499
06/01/2024 01:28:20;1704500900;5791;1;7,988999
06/01/2024 01:28:20;1704500900;5825;1;7,988699
06/01/2024 01:28:21;1704500901;5854;1;7,990099
06/01/2024 01:28:21;1704500901;5887;1;7,989099
06/01/2024 01:28:22;1704500902;5919;1;7,989499
06/01/2024 01:28:22;1704500902;5953;1;7,988699
06/01/2024 01:28:23;1704500903;5984;1;7,989599
06/01/2024 01:28:23;1704500903;6015;1;7,989499
06/01/2024 01:28:23;1704500903;6048;1;7,989099
06/01/2024 01:28:24;1704500904;6079;1;7,989599
06/01/2024 01:28:24;1704500904;6110;1;7,989899
06/01/2024 01:28:25;1704500905;6142;1;7,989299
06/01/2024 01:28:25;1704500905;6173;1;7,989399
06/01/2024 01:28:26;1704500906;6204;1;7,989599
06/01/2024 01:28:26;1704500906;6235;1;7,989899
06/01/2024 01:28:27;1704500907;6267;1;7,989199
06/01/2024 01:28:27;1704500907;6297;1;7,990099
06/01/2024 01:28:28;1704500908;6329;1;7,989199
06/01/2024 01:28:28;1704500908;6362;1;7,989199
06/01/2024 01:28:29;1704500909;6397;1;7,988399
06/01/2024 01:28:29;1704500909;6430;1;7,988899
06/01/2024 01:28:30;1704500910;6461;1;7,989599
06/01/2024 01:28:30;1704500910;6493;1;7,989299
06/01/2024 01:28:31;1704500911;6528;1;7,988499
06/01/2024 01:28:31;1704500911;6559;1;7,989499
06/01/2024 01:28:32;1704500912;6590;1;7,989699
06/01/2024 01:28:32;1704500912;6621;1;7,989799
06/01/2024 01:28:33;1704500913;6650;1;7,990299
06/01/2024 01:28:33;1704500913;6683;1;7,988999
06/01/2024 01:28:34;1704500914;6712;1;7,990199
06/01/2024 01:28:34;1704500914;6743;1;7,989799
06/01/2024 01:28:35;1704500915;6772;1;7,990199
06/01/2024 01:28:35;1704500915;6803;1;7,989599
06/01/2024 01:28:36;1704500916;6838;1;7,988599
06/01/2024 01:28:36;1704500916;6868;1;7,989999
06/01/2024 01:28:37;1704500917;6898;1;7,989799
06/01/2024 01:28:37;1704500917;6932;1;7,988599
06/01/2024 01:28:38;1704500918;6964;1;7,989399
06/01/2024 01:28:38;1704500918;6996;1;7,989399
06/01/2024 01:28:39;1704500919;7029;1;7,488999
06/01/2024 01:28:39;1704500919;7060;1;7,989699
06/01/2024 01:28:40;1704500920;7092;1;7,989199
06/01/2024 01:28:41;1704500921;7126;1;7,988899
06/01/2024 01:28:42;1704500922;7156;1;7,989899
06/01/2024 01:28:42;1704500922;7188;1;7,989399
