07/01/2024 21:26:03;1704659163;0;First
07/01/2024 21:26:03;1704659163;0;Second
07/01/2024 21:26:03;1704659163;0;Second
07/01/2024 21:26:03;1704659163;0;First
07/01/2024 21:26:03;1704659163;0;First
07/01/2024 21:26:03;1704659163;0;Second
07/01/2024 21:26:03;1704659163;11;Second
07/01/2024 21:26:03;1704659163;12;First
07/01/2024 21:26:03;1704659163;12;First
07/01/2024 21:26:03;1704659163;12;Second
07/01/2024 21:26:03;1704659163;13;Second
07/01/2024 21:26:03;1704659163;13;First
07/01/2024 21:26:04;1704659164;10;Second
07/01/2024 21:26:04;1704659164;11;First
07/01/2024 21:26:04;1704659164;11;Second
07/01/2024 21:26:04;1704659164;13;First
07/01/2024 21:26:04;1704659164;13;Second
07/01/2024 21:26:04;1704659164;14;First
07/01/2024 21:26:05;1704659165;10;Second
07/01/2024 21:26:05;1704659165;10;First
07/01/2024 21:26:05;1704659165;11;First
07/01/2024 21:26:05;1704659165;11;Second
07/01/2024 21:26:05;1704659165;12;Second
07/01/2024 21:26:05;1704659165;12;First
07/01/2024 21:26:06;1704659166;11;Second
07/01/2024 21:26:06;1704659166;13;Second
07/01/2024 21:26:06;1704659166;15;First
07/01/2024 21:26:06;1704659166;16;Second
07/01/2024 21:26:06;1704659166;25;First
07/01/2024 21:26:06;1704659166;31;First
07/01/2024 21:26:06;1704659166;10;First
07/01/2024 21:26:06;1704659166;10;Second
07/01/2024 21:26:07;1704659167;11;Second
07/01/2024 21:26:07;1704659167;12;Second
07/01/2024 21:26:07;1704659167;12;First
07/01/2024 21:26:07;1704659167;15;First
07/01/2024 21:26:07;1704659167;10;Second
07/01/2024 21:26:07;1704659167;11;Second
07/01/2024 21:26:07;1704659167;13;First
07/01/2024 21:26:07;1704659167;14;Second
07/01/2024 21:26:07;1704659167;14;First
07/01/2024 21:26:08;1704659168;22;First
07/01/2024 21:26:08;1704659168;11;Second
07/01/2024 21:26:08;1704659168;11;First
07/01/2024 21:26:08;1704659168;12;Second
07/01/2024 21:26:08;1704659168;12;First
07/01/2024 21:26:08;1704659168;13;First
07/01/2024 21:26:08;1704659168;14;Second
07/01/2024 21:26:09;1704659169;9;Second
07/01/2024 21:26:09;1704659169;10;First
07/01/2024 21:26:09;1704659169;11;Second
07/01/2024 21:26:09;1704659169;13;Second
07/01/2024 21:26:09;1704659169;15;First
07/01/2024 21:26:09;1704659169;19;First
07/01/2024 21:26:10;1704659170;11;Second
07/01/2024 21:26:10;1704659170;12;Second
07/01/2024 21:26:10;1704659170;12;Second
07/01/2024 21:26:10;1704659170;12;First
07/01/2024 21:26:10;1704659170;13;First
07/01/2024 21:26:10;1704659170;21;First
07/01/2024 21:26:10;1704659170;10;Second
07/01/2024 21:26:10;1704659170;11;Second
07/01/2024 21:26:10;1704659170;11;First
07/01/2024 21:26:10;1704659170;12;Second
07/01/2024 21:26:10;1704659170;12;First
07/01/2024 21:26:11;1704659171;12;First
07/01/2024 21:26:11;1704659171;11;Second
07/01/2024 21:26:11;1704659171;11;First
07/01/2024 21:26:11;1704659171;11;Second
07/01/2024 21:26:11;1704659171;12;First
07/01/2024 21:26:11;1704659171;12;Second
07/01/2024 21:26:11;1704659171;14;First
07/01/2024 21:26:12;1704659172;10;First
07/01/2024 21:26:12;1704659172;10;Second
07/01/2024 21:26:12;1704659172;12;First
07/01/2024 21:26:12;1704659172;12;Second
07/01/2024 21:26:12;1704659172;13;Second
07/01/2024 21:26:12;1704659172;13;First
07/01/2024 21:26:12;1704659172;10;Second
07/01/2024 21:26:12;1704659172;10;First
07/01/2024 21:26:12;1704659172;11;Second
07/01/2024 21:26:12;1704659172;11;First
07/01/2024 21:26:12;1704659172;13;Second
07/01/2024 21:26:12;1704659172;14;First
07/01/2024 21:26:13;1704659173;10;Second
07/01/2024 21:26:13;1704659173;13;Second
07/01/2024 21:26:13;1704659173;13;First
07/01/2024 21:26:13;1704659173;14;Second
07/01/2024 21:26:13;1704659173;14;First
07/01/2024 21:26:13;1704659173;15;First
07/01/2024 21:26:14;1704659174;11;Second
07/01/2024 21:26:14;1704659174;11;First
07/01/2024 21:26:14;1704659174;12;First
07/01/2024 21:26:14;1704659174;12;Second
07/01/2024 21:26:14;1704659174;13;First
07/01/2024 21:26:14;1704659174;13;Second
07/01/2024 21:26:15;1704659175;11;Second
07/01/2024 21:26:15;1704659175;11;First
07/01/2024 21:26:15;1704659175;11;First
07/01/2024 21:26:15;1704659175;11;Second
07/01/2024 21:26:15;1704659175;12;Second
07/01/2024 21:26:15;1704659175;13;First
07/01/2024 21:26:15;1704659175;10;Second
07/01/2024 21:26:15;1704659175;10;First
07/01/2024 21:26:15;1704659175;12;First
07/01/2024 21:26:15;1704659175;13;Second
07/01/2024 21:26:15;1704659175;13;Second
07/01/2024 21:26:15;1704659175;15;First
07/01/2024 21:26:16;1704659176;12;Second
07/01/2024 21:26:16;1704659176;12;First
07/01/2024 21:26:16;1704659176;12;Second
07/01/2024 21:26:16;1704659176;13;Second
07/01/2024 21:26:16;1704659176;15;First
07/01/2024 21:26:16;1704659176;21;First
07/01/2024 21:26:17;1704659177;10;First
07/01/2024 21:26:17;1704659177;11;Second
07/01/2024 21:26:17;1704659177;11;First
07/01/2024 21:26:17;1704659177;12;Second
07/01/2024 21:26:17;1704659177;13;Second
07/01/2024 21:26:17;1704659177;14;First
07/01/2024 21:26:17;1704659177;10;Second
07/01/2024 21:26:18;1704659178;11;First
07/01/2024 21:26:18;1704659178;11;Second
07/01/2024 21:26:18;1704659178;12;First
07/01/2024 21:26:18;1704659178;13;Second
07/01/2024 21:26:18;1704659178;14;First
07/01/2024 21:26:18;1704659178;10;Second
07/01/2024 21:26:18;1704659178;11;First
07/01/2024 21:26:18;1704659178;12;Second
07/01/2024 21:26:18;1704659178;15;First
07/01/2024 21:26:18;1704659178;15;Second
07/01/2024 21:26:18;1704659178;16;First
07/01/2024 21:26:19;1704659179;10;Second
07/01/2024 21:26:19;1704659179;11;First
07/01/2024 21:26:19;1704659179;11;Second
07/01/2024 21:26:19;1704659179;12;Second
07/01/2024 21:26:19;1704659179;12;First
07/01/2024 21:26:19;1704659179;24;First
07/01/2024 21:26:20;1704659180;10;Second
07/01/2024 21:26:20;1704659180;10;First
07/01/2024 21:26:20;1704659180;12;First
07/01/2024 21:26:20;1704659180;12;Second
07/01/2024 21:26:20;1704659180;13;Second
07/01/2024 21:26:20;1704659180;13;First
07/01/2024 21:26:20;1704659180;10;First
07/01/2024 21:26:20;1704659180;11;Second
07/01/2024 21:26:20;1704659180;11;Second
07/01/2024 21:26:20;1704659180;12;Second
07/01/2024 21:26:20;1704659180;13;First
07/01/2024 21:26:20;1704659180;14;First
07/01/2024 21:26:21;1704659181;10;Second
07/01/2024 21:26:21;1704659181;10;First
07/01/2024 21:26:21;1704659181;11;Second
07/01/2024 21:26:21;1704659181;12;Second
07/01/2024 21:26:21;1704659181;12;First
07/01/2024 21:26:21;1704659181;15;First
07/01/2024 21:26:21;1704659181;10;Second
07/01/2024 21:26:21;1704659181;10;First
07/01/2024 21:26:22;1704659182;12;Second
07/01/2024 21:26:22;1704659182;12;First
07/01/2024 21:26:22;1704659182;12;Second
07/01/2024 21:26:22;1704659182;14;First
07/01/2024 21:26:22;1704659182;10;Second
07/01/2024 21:26:23;1704659183;12;Second
07/01/2024 21:26:23;1704659183;14;First
07/01/2024 21:26:23;1704659183;14;First
07/01/2024 21:26:23;1704659183;15;Second
07/01/2024 21:26:23;1704659183;17;First
07/01/2024 21:26:24;1704659184;10;First
07/01/2024 21:26:24;1704659184;11;Second
07/01/2024 21:26:24;1704659184;11;Second
07/01/2024 21:26:24;1704659184;11;First
07/01/2024 21:26:24;1704659184;12;Second
07/01/2024 21:26:24;1704659184;13;First
07/01/2024 21:26:24;1704659184;11;Second
07/01/2024 21:26:24;1704659184;12;First
07/01/2024 21:26:24;1704659184;13;Second
07/01/2024 21:26:24;1704659184;13;First
07/01/2024 21:26:24;1704659184;15;Second
07/01/2024 21:26:24;1704659184;15;First
07/01/2024 21:26:25;1704659185;11;Second
07/01/2024 21:26:25;1704659185;11;First
07/01/2024 21:26:25;1704659185;13;Second
07/01/2024 21:26:25;1704659185;13;First
07/01/2024 21:26:25;1704659185;14;Second
07/01/2024 21:26:25;1704659185;15;First
07/01/2024 21:26:26;1704659186;9;Second
07/01/2024 21:26:26;1704659186;12;Second
07/01/2024 21:26:26;1704659186;13;First
07/01/2024 21:26:26;1704659186;13;First
07/01/2024 21:26:26;1704659186;14;First
07/01/2024 21:26:31;1704659191;299;Second
07/01/2024 21:26:31;1704659191;11;Second
07/01/2024 21:26:31;1704659191;12;First
07/01/2024 21:26:32;1704659192;13;First
07/01/2024 21:26:32;1704659192;13;Second
07/01/2024 21:26:32;1704659192;14;Second
07/01/2024 21:26:32;1704659192;15;First
07/01/2024 21:26:32;1704659192;10;First
07/01/2024 21:26:32;1704659192;10;Second
07/01/2024 21:26:32;1704659192;11;Second
07/01/2024 21:26:32;1704659192;11;First
07/01/2024 21:26:32;1704659192;12;Second
07/01/2024 21:26:32;1704659192;12;First
07/01/2024 21:26:33;1704659193;11;Second
07/01/2024 21:26:33;1704659193;12;Second
07/01/2024 21:26:33;1704659193;15;Second
07/01/2024 21:26:33;1704659193;15;First
07/01/2024 21:26:33;1704659193;18;First
07/01/2024 21:26:33;1704659193;21;First
07/01/2024 21:26:34;1704659194;9;Second
07/01/2024 21:26:34;1704659194;10;First
07/01/2024 21:26:34;1704659194;11;Second
07/01/2024 21:26:34;1704659194;16;Second
07/01/2024 21:26:34;1704659194;16;First
07/01/2024 21:26:34;1704659194;18;First
07/01/2024 21:26:35;1704659195;11;Second
07/01/2024 21:26:35;1704659195;13;Second
07/01/2024 21:26:35;1704659195;14;First
07/01/2024 21:26:35;1704659195;16;First
07/01/2024 21:26:35;1704659195;16;Second
07/01/2024 21:26:35;1704659195;25;First
07/01/2024 21:26:36;1704659196;11;First
07/01/2024 21:26:36;1704659196;12;Second
07/01/2024 21:26:36;1704659196;12;Second
07/01/2024 21:26:36;1704659196;13;First
07/01/2024 21:26:36;1704659196;16;First
07/01/2024 21:26:36;1704659196;26;Second
07/01/2024 21:26:37;1704659197;11;First
07/01/2024 21:26:37;1704659197;11;Second
07/01/2024 21:26:37;1704659197;11;Second
07/01/2024 21:26:37;1704659197;13;Second
07/01/2024 21:26:37;1704659197;13;First
07/01/2024 21:26:37;1704659197;14;First
07/01/2024 21:26:38;1704659198;12;Second
07/01/2024 21:26:38;1704659198;12;Second
07/01/2024 21:26:38;1704659198;14;First
07/01/2024 21:26:38;1704659198;14;Second
07/01/2024 21:26:38;1704659198;14;First
07/01/2024 21:26:38;1704659198;16;First
07/01/2024 21:26:39;1704659199;10;Second
07/01/2024 21:26:39;1704659199;11;First
07/01/2024 21:26:39;1704659199;12;First
07/01/2024 21:26:39;1704659199;14;Second
07/01/2024 21:26:39;1704659199;15;Second
07/01/2024 21:26:39;1704659199;16;First
07/01/2024 21:26:39;1704659199;10;Second
07/01/2024 21:26:40;1704659200;12;First
07/01/2024 21:26:40;1704659200;13;Second
07/01/2024 21:26:40;1704659200;13;First
07/01/2024 21:26:40;1704659200;13;Second
07/01/2024 21:26:40;1704659200;26;First
07/01/2024 21:26:40;1704659200;10;Second
07/01/2024 21:26:41;1704659201;12;Second
07/01/2024 21:26:41;1704659201;19;First
07/01/2024 21:26:41;1704659201;20;Second
07/01/2024 21:26:41;1704659201;22;First
07/01/2024 21:26:41;1704659201;24;First
07/01/2024 21:26:42;1704659202;11;Second
07/01/2024 21:26:42;1704659202;12;First
07/01/2024 21:26:42;1704659202;12;Second
07/01/2024 21:26:42;1704659202;13;First
07/01/2024 21:26:42;1704659202;13;Second
07/01/2024 21:26:42;1704659202;14;First
07/01/2024 21:26:42;1704659202;9;First
07/01/2024 21:26:42;1704659202;10;Second
07/01/2024 21:26:42;1704659202;11;Second
07/01/2024 21:26:42;1704659202;12;First
07/01/2024 21:26:42;1704659202;12;Second
07/01/2024 21:26:42;1704659202;12;First
07/01/2024 21:26:43;1704659203;11;Second
07/01/2024 21:26:43;1704659203;11;First
07/01/2024 21:26:43;1704659203;12;Second
07/01/2024 21:26:43;1704659203;13;Second
07/01/2024 21:26:43;1704659203;14;First
07/01/2024 21:26:43;1704659203;21;First
07/01/2024 21:26:44;1704659204;11;First
07/01/2024 21:26:44;1704659204;11;Second
07/01/2024 21:26:44;1704659204;12;Second
07/01/2024 21:26:44;1704659204;15;First
07/01/2024 21:26:44;1704659204;15;Second
07/01/2024 21:26:44;1704659204;15;First
07/01/2024 21:26:45;1704659205;11;First
07/01/2024 21:26:45;1704659205;11;Second
07/01/2024 21:26:45;1704659205;11;First
07/01/2024 21:26:45;1704659205;12;Second
07/01/2024 21:26:45;1704659205;13;Second
07/01/2024 21:26:45;1704659205;14;First
07/01/2024 21:26:46;1704659206;11;Second
07/01/2024 21:26:46;1704659206;12;First
07/01/2024 21:26:46;1704659206;12;Second
07/01/2024 21:26:46;1704659206;13;First
07/01/2024 21:26:46;1704659206;13;Second
07/01/2024 21:26:46;1704659206;14;First
07/01/2024 21:26:46;1704659206;10;Second
07/01/2024 21:26:47;1704659207;11;First
07/01/2024 21:26:47;1704659207;12;Second
07/01/2024 21:26:47;1704659207;17;First
07/01/2024 21:26:47;1704659207;19;Second
07/01/2024 21:26:47;1704659207;19;First
07/01/2024 21:26:47;1704659207;11;Second
07/01/2024 21:26:47;1704659207;11;First
07/01/2024 21:26:47;1704659207;12;Second
07/01/2024 21:26:47;1704659207;12;Second
07/01/2024 21:26:47;1704659207;12;First
07/01/2024 21:26:48;1704659208;21;First
07/01/2024 21:26:48;1704659208;10;Second
07/01/2024 21:26:48;1704659208;10;First
07/01/2024 21:26:48;1704659208;11;First
07/01/2024 21:26:48;1704659208;12;Second
07/01/2024 21:26:48;1704659208;12;Second
07/01/2024 21:26:48;1704659208;13;First
07/01/2024 21:26:49;1704659209;11;Second
07/01/2024 21:26:49;1704659209;12;First
07/01/2024 21:26:49;1704659209;12;Second
07/01/2024 21:26:49;1704659209;17;Second
07/01/2024 21:26:49;1704659209;19;First
07/01/2024 21:26:49;1704659209;19;First
07/01/2024 21:26:50;1704659210;11;First
07/01/2024 21:26:50;1704659210;11;Second
07/01/2024 21:26:50;1704659210;12;Second
07/01/2024 21:26:50;1704659210;12;First
07/01/2024 21:26:50;1704659210;12;First
07/01/2024 21:26:50;1704659210;13;Second
07/01/2024 21:26:51;1704659211;10;Second
07/01/2024 21:26:51;1704659211;11;First
07/01/2024 21:26:51;1704659211;12;Second
07/01/2024 21:26:51;1704659211;13;First
07/01/2024 21:26:51;1704659211;13;First
07/01/2024 21:26:51;1704659211;13;Second
07/01/2024 21:26:52;1704659212;10;Second
07/01/2024 21:26:52;1704659212;10;First
07/01/2024 21:26:52;1704659212;11;Second
07/01/2024 21:26:52;1704659212;12;First
07/01/2024 21:26:52;1704659212;12;Second
07/01/2024 21:26:52;1704659212;21;First
07/01/2024 21:26:52;1704659212;10;Second
07/01/2024 21:26:52;1704659212;10;Second
07/01/2024 21:26:52;1704659212;11;First
07/01/2024 21:26:53;1704659213;11;First
07/01/2024 21:26:53;1704659213;13;Second
07/01/2024 21:26:53;1704659213;16;First
07/01/2024 21:26:53;1704659213;10;Second
07/01/2024 21:26:53;1704659213;11;First
07/01/2024 21:26:53;1704659213;11;Second
07/01/2024 21:26:53;1704659213;12;First
07/01/2024 21:26:53;1704659213;13;Second
07/01/2024 21:26:53;1704659213;14;First
07/01/2024 21:26:54;1704659214;10;Second
07/01/2024 21:26:54;1704659214;11;First
07/01/2024 21:26:54;1704659214;12;Second
07/01/2024 21:26:54;1704659214;12;Second
07/01/2024 21:26:54;1704659214;13;First
07/01/2024 21:26:54;1704659214;21;First
07/01/2024 21:26:55;1704659215;10;Second
07/01/2024 21:26:55;1704659215;10;First
07/01/2024 21:26:55;1704659215;11;Second
07/01/2024 21:26:55;1704659215;12;Second
07/01/2024 21:26:55;1704659215;12;First
07/01/2024 21:26:55;1704659215;19;First
07/01/2024 21:26:55;1704659215;10;First
07/01/2024 21:26:55;1704659215;10;Second
07/01/2024 21:26:55;1704659215;11;First
07/01/2024 21:26:55;1704659215;12;Second
07/01/2024 21:26:55;1704659215;12;Second
07/01/2024 21:26:55;1704659215;18;First
07/01/2024 21:26:56;1704659216;11;Second
07/01/2024 21:26:56;1704659216;11;First
07/01/2024 21:26:56;1704659216;12;First
07/01/2024 21:26:56;1704659216;13;Second
07/01/2024 21:26:56;1704659216;13;Second
07/01/2024 21:26:56;1704659216;14;First
07/01/2024 21:26:57;1704659217;11;Second
07/01/2024 21:26:57;1704659217;12;First
07/01/2024 21:26:57;1704659217;12;Second
07/01/2024 21:26:57;1704659217;13;First
07/01/2024 21:26:57;1704659217;13;Second
07/01/2024 21:26:57;1704659217;16;First
07/01/2024 21:26:57;1704659217;10;First
07/01/2024 21:26:58;1704659218;11;Second
07/01/2024 21:26:58;1704659218;13;First
07/01/2024 21:26:58;1704659218;13;First
07/01/2024 21:26:58;1704659218;14;Second
07/01/2024 21:26:58;1704659218;14;Second
07/01/2024 21:26:58;1704659218;10;Second
07/01/2024 21:26:58;1704659218;12;First
07/01/2024 21:26:58;1704659218;12;Second
07/01/2024 21:26:58;1704659218;13;Second
07/01/2024 21:26:58;1704659218;14;First
07/01/2024 21:26:58;1704659218;14;First
07/01/2024 21:26:59;1704659219;11;Second
07/01/2024 21:26:59;1704659219;12;Second
07/01/2024 21:27:00;1704659220;18;First
07/01/2024 21:27:00;1704659220;18;Second
07/01/2024 21:27:00;1704659220;20;First
07/01/2024 21:27:00;1704659220;22;First
07/01/2024 21:27:01;1704659221;10;Second
07/01/2024 21:27:01;1704659221;11;Second
07/01/2024 21:27:01;1704659221;12;First
07/01/2024 21:27:01;1704659221;17;First
07/01/2024 21:27:01;1704659221;19;Second
07/01/2024 21:27:01;1704659221;21;First
07/01/2024 21:27:02;1704659222;10;First
07/01/2024 21:27:02;1704659222;10;Second
07/01/2024 21:27:02;1704659222;13;First
07/01/2024 21:27:02;1704659222;13;Second
07/01/2024 21:27:02;1704659222;15;Second
07/01/2024 21:27:02;1704659222;16;First
07/01/2024 21:27:02;1704659222;11;Second
07/01/2024 21:27:02;1704659222;11;First
07/01/2024 21:27:02;1704659222;12;Second
07/01/2024 21:27:02;1704659222;13;First
07/01/2024 21:27:02;1704659222;13;Second
07/01/2024 21:27:03;1704659223;15;First
07/01/2024 21:27:03;1704659223;10;Second
07/01/2024 21:27:03;1704659223;11;First
07/01/2024 21:27:03;1704659223;12;Second
07/01/2024 21:27:03;1704659223;13;Second
07/01/2024 21:27:03;1704659223;13;First
07/01/2024 21:27:03;1704659223;14;First
07/01/2024 21:27:04;1704659224;12;Second
07/01/2024 21:27:04;1704659224;12;First
07/01/2024 21:27:04;1704659224;12;Second
07/01/2024 21:27:04;1704659224;12;First
07/01/2024 21:27:04;1704659224;24;Second
07/01/2024 21:27:04;1704659224;25;First
07/01/2024 21:27:05;1704659225;11;Second
07/01/2024 21:27:05;1704659225;12;Second
07/01/2024 21:27:05;1704659225;12;First
07/01/2024 21:27:05;1704659225;14;Second
07/01/2024 21:27:05;1704659225;15;First
07/01/2024 21:27:05;1704659225;15;First
07/01/2024 21:27:06;1704659226;10;Second
07/01/2024 21:27:06;1704659226;12;Second
07/01/2024 21:27:06;1704659226;13;First
07/01/2024 21:27:06;1704659226;14;First
07/01/2024 21:27:06;1704659226;32;First
07/01/2024 21:27:11;1704659231;299;Second
07/01/2024 21:27:11;1704659231;11;First
07/01/2024 21:27:11;1704659231;11;Second
07/01/2024 21:27:11;1704659231;12;First
07/01/2024 21:27:11;1704659231;12;Second
07/01/2024 21:27:11;1704659231;13;First
07/01/2024 21:27:11;1704659231;14;Second
07/01/2024 21:27:12;1704659232;10;Second
07/01/2024 21:27:12;1704659232;11;First
07/01/2024 21:27:12;1704659232;11;Second
07/01/2024 21:27:12;1704659232;11;First
07/01/2024 21:27:12;1704659232;12;Second
07/01/2024 21:27:12;1704659232;14;First
07/01/2024 21:27:13;1704659233;10;First
07/01/2024 21:27:13;1704659233;11;Second
07/01/2024 21:27:13;1704659233;12;Second
07/01/2024 21:27:13;1704659233;12;First
07/01/2024 21:27:13;1704659233;13;Second
07/01/2024 21:27:13;1704659233;15;First
07/01/2024 21:27:13;1704659233;10;Second
07/01/2024 21:27:13;1704659233;11;Second
07/01/2024 21:27:13;1704659233;12;First
07/01/2024 21:27:13;1704659233;14;First
07/01/2024 21:27:13;1704659233;14;First
07/01/2024 21:27:14;1704659234;15;Second
07/01/2024 21:27:14;1704659234;10;First
07/01/2024 21:27:14;1704659234;11;Second
07/01/2024 21:27:14;1704659234;11;Second
07/01/2024 21:27:14;1704659234;12;First
07/01/2024 21:27:16;1704659236;52;Second
07/01/2024 21:27:16;1704659236;52;First
07/01/2024 21:27:17;1704659237;12;First
07/01/2024 21:27:17;1704659237;12;Second
07/01/2024 21:27:17;1704659237;12;First
07/01/2024 21:27:17;1704659237;13;Second
07/01/2024 21:27:17;1704659237;14;Second
07/01/2024 21:27:17;1704659237;14;First
07/01/2024 21:27:18;1704659238;11;Second
07/01/2024 21:27:18;1704659238;12;Second
07/01/2024 21:27:18;1704659238;12;First
07/01/2024 21:27:18;1704659238;13;First
07/01/2024 21:27:18;1704659238;15;Second
07/01/2024 21:27:18;1704659238;15;First
07/01/2024 21:27:19;1704659239;10;First
07/01/2024 21:27:19;1704659239;12;Second
07/01/2024 21:27:19;1704659239;12;Second
07/01/2024 21:27:19;1704659239;13;First
07/01/2024 21:27:19;1704659239;14;First
07/01/2024 21:27:19;1704659239;15;Second
07/01/2024 21:27:20;1704659240;10;First
07/01/2024 21:27:20;1704659240;10;Second
07/01/2024 21:27:20;1704659240;12;Second
07/01/2024 21:27:20;1704659240;12;First
07/01/2024 21:27:20;1704659240;13;Second
07/01/2024 21:27:20;1704659240;14;First
07/01/2024 21:27:21;1704659241;11;Second
07/01/2024 21:27:21;1704659241;12;Second
07/01/2024 21:27:21;1704659241;13;Second
07/01/2024 21:27:21;1704659241;14;First
07/01/2024 21:27:21;1704659241;14;First
07/01/2024 21:27:21;1704659241;21;First
07/01/2024 21:27:22;1704659242;10;Second
07/01/2024 21:27:22;1704659242;12;First
07/01/2024 21:27:22;1704659242;12;Second
07/01/2024 21:27:22;1704659242;13;First
07/01/2024 21:27:22;1704659242;15;First
07/01/2024 21:27:22;1704659242;16;Second
07/01/2024 21:27:23;1704659243;10;First
07/01/2024 21:27:23;1704659243;10;Second
07/01/2024 21:27:23;1704659243;11;First
07/01/2024 21:27:23;1704659243;12;Second
07/01/2024 21:27:23;1704659243;12;Second
07/01/2024 21:27:23;1704659243;13;First
07/01/2024 21:27:23;1704659243;9;Second
07/01/2024 21:27:23;1704659243;10;First
07/01/2024 21:27:23;1704659243;11;Second
07/01/2024 21:27:23;1704659243;11;First
07/01/2024 21:27:23;1704659243;11;Second
07/01/2024 21:27:23;1704659243;13;First
07/01/2024 21:27:24;1704659244;10;Second
07/01/2024 21:27:24;1704659244;12;Second
07/01/2024 21:27:24;1704659244;12;First
07/01/2024 21:27:25;1704659245;21;First
07/01/2024 21:27:25;1704659245;22;Second
07/01/2024 21:27:25;1704659245;23;First
07/01/2024 21:27:26;1704659246;11;First
07/01/2024 21:27:26;1704659246;11;Second
07/01/2024 21:27:26;1704659246;13;First
07/01/2024 21:27:26;1704659246;13;Second
07/01/2024 21:27:26;1704659246;14;Second
07/01/2024 21:27:26;1704659246;16;First
07/01/2024 21:27:26;1704659246;10;Second
07/01/2024 21:27:26;1704659246;11;First
07/01/2024 21:27:26;1704659246;12;Second
07/01/2024 21:27:26;1704659246;12;First
07/01/2024 21:27:26;1704659246;13;Second
07/01/2024 21:27:26;1704659246;22;First
07/01/2024 21:27:27;1704659247;11;Second
07/01/2024 21:27:27;1704659247;13;First
07/01/2024 21:27:27;1704659247;13;First
07/01/2024 21:27:27;1704659247;13;Second
07/01/2024 21:27:27;1704659247;14;Second
07/01/2024 21:27:28;1704659248;29;First
07/01/2024 21:27:28;1704659248;10;Second
07/01/2024 21:27:28;1704659248;11;First
07/01/2024 21:27:28;1704659248;12;Second
07/01/2024 21:27:28;1704659248;12;Second
07/01/2024 21:27:28;1704659248;13;First
07/01/2024 21:27:28;1704659248;13;First
07/01/2024 21:27:29;1704659249;11;First
07/01/2024 21:27:29;1704659249;12;First
07/01/2024 21:27:29;1704659249;12;Second
07/01/2024 21:27:29;1704659249;13;Second
07/01/2024 21:27:29;1704659249;14;Second
07/01/2024 21:27:29;1704659249;15;First
07/01/2024 21:27:30;1704659250;10;First
07/01/2024 21:27:30;1704659250;11;Second
07/01/2024 21:27:30;1704659250;12;Second
07/01/2024 21:27:30;1704659250;12;Second
07/01/2024 21:27:30;1704659250;13;First
07/01/2024 21:27:30;1704659250;14;First
07/01/2024 21:27:30;1704659250;10;First
07/01/2024 21:27:30;1704659250;10;Second
07/01/2024 21:27:30;1704659250;11;Second
07/01/2024 21:27:30;1704659250;12;First
07/01/2024 21:27:30;1704659250;13;Second
07/01/2024 21:27:30;1704659250;13;First
07/01/2024 21:27:31;1704659251;10;First
07/01/2024 21:27:31;1704659251;10;Second
07/01/2024 21:27:31;1704659251;11;First
07/01/2024 21:27:31;1704659251;12;Second
07/01/2024 21:27:31;1704659251;13;First
07/01/2024 21:27:31;1704659251;13;Second
07/01/2024 21:27:32;1704659252;11;Second
07/01/2024 21:27:32;1704659252;12;Second
07/01/2024 21:27:32;1704659252;13;First
07/01/2024 21:27:32;1704659252;21;First
07/01/2024 21:27:33;1704659253;29;First
07/01/2024 21:27:33;1704659253;31;Second
07/01/2024 21:27:33;1704659253;10;First
07/01/2024 21:27:33;1704659253;11;Second
07/01/2024 21:27:33;1704659253;11;First
07/01/2024 21:27:33;1704659253;11;Second
07/01/2024 21:27:33;1704659253;12;Second
07/01/2024 21:27:33;1704659253;12;First
07/01/2024 21:27:34;1704659254;11;Second
07/01/2024 21:27:34;1704659254;12;Second
07/01/2024 21:27:34;1704659254;12;Second
07/01/2024 21:27:34;1704659254;13;First
07/01/2024 21:27:34;1704659254;13;First
07/01/2024 21:27:34;1704659254;14;First
07/01/2024 21:27:35;1704659255;10;Second
07/01/2024 21:27:35;1704659255;10;First
07/01/2024 21:27:35;1704659255;11;First
07/01/2024 21:27:35;1704659255;12;Second
07/01/2024 21:27:35;1704659255;13;Second
07/01/2024 21:27:35;1704659255;15;First
07/01/2024 21:27:35;1704659255;10;Second
07/01/2024 21:27:35;1704659255;11;First
07/01/2024 21:27:35;1704659255;12;First
07/01/2024 21:27:35;1704659255;12;Second
07/01/2024 21:27:35;1704659255;12;Second
07/01/2024 21:27:36;1704659256;13;First
07/01/2024 21:27:36;1704659256;11;Second
07/01/2024 21:27:36;1704659256;11;First
07/01/2024 21:27:36;1704659256;11;Second
07/01/2024 21:27:36;1704659256;12;First
07/01/2024 21:27:36;1704659256;13;First
07/01/2024 21:27:36;1704659256;13;Second
