05/01/2024 22:12:15;1704489135;1168;6;4,725084
05/01/2024 22:12:16;1704489136;1204;1;7,988199
05/01/2024 22:12:16;1704489136;1234;1;7,989799
05/01/2024 22:12:17;1704489137;1268;1;7,988699
05/01/2024 22:12:17;1704489137;1302;1;7,988599
05/01/2024 22:12:18;1704489138;1334;1;7,989399
05/01/2024 22:12:18;1704489138;1367;1;7,988999
05/01/2024 22:12:18;1704489138;1396;1;7,990399
05/01/2024 22:12:19;1704489139;1428;1;7,989399
05/01/2024 22:12:19;1704489139;1460;1;7,989199
05/01/2024 22:12:20;1704489140;1491;1;7,989599
05/01/2024 22:12:20;1704489140;1525;1;7,988899
05/01/2024 22:12:21;1704489141;1555;1;7,989999
05/01/2024 22:12:21;1704489141;1587;1;7,989399
05/01/2024 22:12:22;1704489142;1618;1;7,989599
05/01/2024 22:12:22;1704489142;1649;1;7,989499
05/01/2024 22:12:23;1704489143;1680;1;7,989799
05/01/2024 22:12:23;1704489143;1712;1;7,989199
05/01/2024 22:12:24;1704489144;1748;1;7,988299
05/01/2024 22:12:24;1704489144;1781;1;7,988999
05/01/2024 22:12:25;1704489145;1812;1;7,989599
05/01/2024 22:12:25;1704489145;1842;1;7,989799
05/01/2024 22:12:25;1704489145;1875;1;7,989099
05/01/2024 22:12:26;1704489146;1905;1;7,990099
05/01/2024 22:12:26;1704489146;1939;1;7,988699
05/01/2024 22:12:27;1704489147;1971;1;7,989199
05/01/2024 22:12:27;1704489147;2002;1;7,989699
05/01/2024 22:12:28;1704489148;2033;1;7,989599
05/01/2024 22:12:28;1704489148;2064;1;7,989799
05/01/2024 22:12:29;1704489149;2095;1;7,989399
