07/01/2024 23:12:28;1704665548;0;First
07/01/2024 23:12:28;1704665548;0;Second
07/01/2024 23:12:28;1704665548;0;Second
07/01/2024 23:12:28;1704665548;0;Second
07/01/2024 23:12:28;1704665548;0;First
07/01/2024 23:12:28;1704665548;0;Second
07/01/2024 23:12:28;1704665548;7;Second
07/01/2024 23:12:29;1704665549;9;Second
07/01/2024 23:12:29;1704665549;11;Second
07/01/2024 23:12:29;1704665549;13;First
07/01/2024 23:12:29;1704665549;15;First
07/01/2024 23:12:29;1704665549;16;Second
07/01/2024 23:12:29;1704665549;7;Second
07/01/2024 23:12:29;1704665549;9;Second
07/01/2024 23:12:29;1704665549;11;Second
07/01/2024 23:12:29;1704665549;13;First
07/01/2024 23:12:29;1704665549;13;Second
07/01/2024 23:12:29;1704665549;16;First
07/01/2024 23:12:29;1704665549;7;Second
07/01/2024 23:12:29;1704665549;9;Second
07/01/2024 23:12:29;1704665549;11;Second
07/01/2024 23:12:30;1704665550;13;First
07/01/2024 23:12:30;1704665550;15;Second
07/01/2024 23:12:30;1704665550;17;First
07/01/2024 23:12:30;1704665550;7;Second
07/01/2024 23:12:30;1704665550;9;Second
07/01/2024 23:12:30;1704665550;11;Second
07/01/2024 23:12:30;1704665550;13;First
07/01/2024 23:12:30;1704665550;14;Second
07/01/2024 23:12:30;1704665550;16;First
07/01/2024 23:12:30;1704665550;7;Second
07/01/2024 23:12:30;1704665550;9;Second
07/01/2024 23:12:30;1704665550;11;Second
07/01/2024 23:12:31;1704665551;13;Second
07/01/2024 23:12:31;1704665551;14;First
07/01/2024 23:12:31;1704665551;16;First
07/01/2024 23:12:31;1704665551;7;Second
07/01/2024 23:12:31;1704665551;9;Second
07/01/2024 23:12:31;1704665551;12;Second
07/01/2024 23:12:31;1704665551;14;First
07/01/2024 23:12:31;1704665551;15;Second
07/01/2024 23:12:31;1704665551;17;First
07/01/2024 23:12:31;1704665551;7;Second
07/01/2024 23:12:31;1704665551;9;Second
07/01/2024 23:12:31;1704665551;10;Second
07/01/2024 23:12:31;1704665551;12;First
07/01/2024 23:12:32;1704665552;15;First
07/01/2024 23:12:32;1704665552;16;Second
07/01/2024 23:12:32;1704665552;7;Second
07/01/2024 23:12:32;1704665552;8;Second
07/01/2024 23:12:32;1704665552;10;Second
07/01/2024 23:12:32;1704665552;12;First
07/01/2024 23:12:32;1704665552;15;First
07/01/2024 23:12:32;1704665552;16;Second
07/01/2024 23:12:32;1704665552;7;Second
07/01/2024 23:12:32;1704665552;9;Second
07/01/2024 23:12:32;1704665552;11;Second
07/01/2024 23:12:32;1704665552;13;First
07/01/2024 23:12:32;1704665552;15;Second
07/01/2024 23:12:33;1704665553;16;First
07/01/2024 23:12:33;1704665553;8;Second
07/01/2024 23:12:33;1704665553;10;Second
07/01/2024 23:12:33;1704665553;12;Second
07/01/2024 23:12:33;1704665553;14;First
07/01/2024 23:12:33;1704665553;15;Second
07/01/2024 23:12:33;1704665553;17;First
07/01/2024 23:12:33;1704665553;8;Second
07/01/2024 23:12:33;1704665553;10;Second
07/01/2024 23:12:33;1704665553;12;Second
07/01/2024 23:12:34;1704665554;15;First
07/01/2024 23:12:34;1704665554;15;Second
07/01/2024 23:12:34;1704665554;17;First
07/01/2024 23:12:34;1704665554;7;Second
07/01/2024 23:12:34;1704665554;9;Second
07/01/2024 23:12:34;1704665554;12;First
07/01/2024 23:12:34;1704665554;13;Second
07/01/2024 23:12:34;1704665554;14;Second
07/01/2024 23:12:34;1704665554;17;First
07/01/2024 23:12:34;1704665554;7;Second
07/01/2024 23:12:34;1704665554;9;Second
07/01/2024 23:12:34;1704665554;11;Second
07/01/2024 23:12:35;1704665555;12;First
07/01/2024 23:12:35;1704665555;13;Second
07/01/2024 23:12:35;1704665555;15;First
07/01/2024 23:12:35;1704665555;7;Second
07/01/2024 23:12:35;1704665555;10;Second
07/01/2024 23:12:35;1704665555;11;Second
07/01/2024 23:12:35;1704665555;13;Second
07/01/2024 23:12:35;1704665555;15;First
07/01/2024 23:12:35;1704665555;18;First
07/01/2024 23:12:35;1704665555;7;Second
07/01/2024 23:12:35;1704665555;9;Second
07/01/2024 23:12:35;1704665555;11;Second
07/01/2024 23:12:36;1704665556;14;First
07/01/2024 23:12:36;1704665556;14;Second
07/01/2024 23:12:36;1704665556;17;First
07/01/2024 23:12:36;1704665556;7;Second
07/01/2024 23:12:36;1704665556;9;Second
07/01/2024 23:12:36;1704665556;11;Second
07/01/2024 23:12:36;1704665556;13;First
07/01/2024 23:12:36;1704665556;14;Second
07/01/2024 23:12:36;1704665556;17;First
07/01/2024 23:12:36;1704665556;7;Second
07/01/2024 23:12:36;1704665556;10;Second
07/01/2024 23:12:36;1704665556;11;Second
07/01/2024 23:12:36;1704665556;13;First
07/01/2024 23:12:36;1704665556;14;Second
07/01/2024 23:12:37;1704665557;17;First
07/01/2024 23:12:37;1704665557;7;Second
07/01/2024 23:12:37;1704665557;8;Second
07/01/2024 23:12:37;1704665557;10;Second
07/01/2024 23:12:37;1704665557;11;First
07/01/2024 23:12:37;1704665557;14;First
07/01/2024 23:12:37;1704665557;16;Second
07/01/2024 23:12:37;1704665557;7;Second
07/01/2024 23:12:37;1704665557;9;Second
07/01/2024 23:12:37;1704665557;10;Second
07/01/2024 23:12:37;1704665557;12;First
07/01/2024 23:12:37;1704665557;14;Second
07/01/2024 23:12:37;1704665557;16;First
07/01/2024 23:12:38;1704665558;8;Second
07/01/2024 23:12:38;1704665558;9;Second
07/01/2024 23:12:38;1704665558;12;Second
07/01/2024 23:12:38;1704665558;13;First
07/01/2024 23:12:38;1704665558;15;First
07/01/2024 23:12:38;1704665558;16;Second
07/01/2024 23:12:38;1704665558;8;Second
07/01/2024 23:12:38;1704665558;10;Second
07/01/2024 23:12:38;1704665558;12;Second
07/01/2024 23:12:38;1704665558;14;First
07/01/2024 23:12:38;1704665558;15;Second
07/01/2024 23:12:38;1704665558;17;First
07/01/2024 23:12:39;1704665559;7;Second
07/01/2024 23:12:39;1704665559;9;Second
07/01/2024 23:12:39;1704665559;13;Second
07/01/2024 23:12:39;1704665559;13;First
07/01/2024 23:12:39;1704665559;16;Second
07/01/2024 23:12:39;1704665559;16;First
07/01/2024 23:12:39;1704665559;7;Second
07/01/2024 23:12:39;1704665559;9;Second
07/01/2024 23:12:39;1704665559;11;Second
07/01/2024 23:12:39;1704665559;13;First
07/01/2024 23:12:39;1704665559;15;Second
07/01/2024 23:12:39;1704665559;16;First
07/01/2024 23:12:40;1704665560;7;Second
07/01/2024 23:12:40;1704665560;9;Second
07/01/2024 23:12:40;1704665560;12;Second
07/01/2024 23:12:40;1704665560;14;First
07/01/2024 23:12:40;1704665560;15;Second
07/01/2024 23:12:40;1704665560;17;First
07/01/2024 23:12:40;1704665560;8;Second
07/01/2024 23:12:40;1704665560;10;Second
07/01/2024 23:12:40;1704665560;12;Second
07/01/2024 23:12:40;1704665560;14;First
07/01/2024 23:12:40;1704665560;14;Second
07/01/2024 23:12:40;1704665560;17;First
07/01/2024 23:12:41;1704665561;6;Second
07/01/2024 23:12:41;1704665561;9;Second
07/01/2024 23:12:41;1704665561;11;Second
07/01/2024 23:12:41;1704665561;13;First
07/01/2024 23:12:41;1704665561;15;Second
07/01/2024 23:12:41;1704665561;16;First
07/01/2024 23:12:41;1704665561;7;Second
07/01/2024 23:12:41;1704665561;10;Second
07/01/2024 23:12:41;1704665561;12;Second
07/01/2024 23:12:41;1704665561;15;Second
07/01/2024 23:12:41;1704665561;16;First
07/01/2024 23:12:42;1704665562;18;First
07/01/2024 23:12:42;1704665562;8;Second
07/01/2024 23:12:42;1704665562;10;Second
07/01/2024 23:12:42;1704665562;13;Second
07/01/2024 23:12:42;1704665562;15;First
07/01/2024 23:12:42;1704665562;15;Second
07/01/2024 23:12:42;1704665562;18;First
07/01/2024 23:12:42;1704665562;7;Second
07/01/2024 23:12:42;1704665562;10;Second
07/01/2024 23:12:42;1704665562;12;Second
07/01/2024 23:12:42;1704665562;13;First
07/01/2024 23:12:42;1704665562;14;Second
07/01/2024 23:12:43;1704665563;17;First
07/01/2024 23:12:43;1704665563;7;Second
07/01/2024 23:12:43;1704665563;10;Second
07/01/2024 23:12:43;1704665563;13;Second
07/01/2024 23:12:43;1704665563;14;First
07/01/2024 23:12:43;1704665563;17;Second
07/01/2024 23:12:43;1704665563;18;First
07/01/2024 23:12:43;1704665563;7;Second
07/01/2024 23:12:44;1704665564;9;Second
07/01/2024 23:12:44;1704665564;11;Second
07/01/2024 23:12:44;1704665564;13;First
07/01/2024 23:12:44;1704665564;15;First
07/01/2024 23:12:44;1704665564;16;Second
07/01/2024 23:12:44;1704665564;7;Second
07/01/2024 23:12:44;1704665564;10;Second
07/01/2024 23:12:44;1704665564;12;Second
07/01/2024 23:12:44;1704665564;13;First
07/01/2024 23:12:44;1704665564;15;First
07/01/2024 23:12:44;1704665564;16;Second
07/01/2024 23:12:45;1704665565;8;Second
07/01/2024 23:12:45;1704665565;10;Second
07/01/2024 23:12:45;1704665565;12;First
07/01/2024 23:12:45;1704665565;15;First
07/01/2024 23:12:45;1704665565;16;Second
07/01/2024 23:12:45;1704665565;18;Second
07/01/2024 23:12:45;1704665565;7;Second
07/01/2024 23:12:45;1704665565;9;Second
07/01/2024 23:12:45;1704665565;11;Second
07/01/2024 23:12:45;1704665565;15;First
07/01/2024 23:12:45;1704665565;16;Second
07/01/2024 23:12:46;1704665566;18;First
07/01/2024 23:12:46;1704665566;7;Second
07/01/2024 23:12:46;1704665566;10;Second
07/01/2024 23:12:46;1704665566;11;Second
07/01/2024 23:12:46;1704665566;13;First
07/01/2024 23:12:47;1704665567;15;Second
07/01/2024 23:12:47;1704665567;18;First
07/01/2024 23:12:47;1704665567;7;Second
07/01/2024 23:12:47;1704665567;10;Second
07/01/2024 23:12:47;1704665567;12;Second
07/01/2024 23:12:47;1704665567;13;First
07/01/2024 23:12:47;1704665567;14;Second
07/01/2024 23:12:47;1704665567;15;First
07/01/2024 23:12:47;1704665567;8;Second
07/01/2024 23:12:47;1704665567;10;Second
07/01/2024 23:12:47;1704665567;11;Second
07/01/2024 23:12:48;1704665568;13;First
07/01/2024 23:12:48;1704665568;16;First
07/01/2024 23:12:48;1704665568;16;Second
07/01/2024 23:12:48;1704665568;8;Second
07/01/2024 23:12:48;1704665568;11;Second
07/01/2024 23:12:48;1704665568;13;Second
07/01/2024 23:12:48;1704665568;16;Second
07/01/2024 23:12:48;1704665568;16;First
07/01/2024 23:12:48;1704665568;19;First
07/01/2024 23:12:48;1704665568;7;Second
07/01/2024 23:12:49;1704665569;9;Second
07/01/2024 23:12:49;1704665569;11;Second
07/01/2024 23:12:49;1704665569;12;First
07/01/2024 23:12:49;1704665569;14;Second
07/01/2024 23:12:49;1704665569;15;First
07/01/2024 23:12:49;1704665569;7;Second
07/01/2024 23:12:49;1704665569;10;Second
07/01/2024 23:12:49;1704665569;12;Second
07/01/2024 23:12:49;1704665569;13;Second
07/01/2024 23:12:49;1704665569;15;First
07/01/2024 23:12:49;1704665569;18;First
07/01/2024 23:12:49;1704665569;8;Second
07/01/2024 23:12:50;1704665570;10;Second
07/01/2024 23:12:50;1704665570;13;First
07/01/2024 23:12:50;1704665570;14;Second
07/01/2024 23:12:50;1704665570;15;Second
07/01/2024 23:12:50;1704665570;16;First
07/01/2024 23:12:50;1704665570;7;Second
07/01/2024 23:12:50;1704665570;9;Second
07/01/2024 23:12:50;1704665570;11;Second
07/01/2024 23:12:50;1704665570;12;First
07/01/2024 23:12:50;1704665570;14;First
07/01/2024 23:12:50;1704665570;16;Second
07/01/2024 23:12:50;1704665570;7;Second
07/01/2024 23:12:51;1704665571;9;Second
07/01/2024 23:12:51;1704665571;11;Second
07/01/2024 23:12:51;1704665571;13;First
07/01/2024 23:12:51;1704665571;14;Second
07/01/2024 23:12:51;1704665571;16;First
07/01/2024 23:12:51;1704665571;7;Second
07/01/2024 23:12:51;1704665571;9;Second
07/01/2024 23:12:51;1704665571;11;Second
07/01/2024 23:12:51;1704665571;13;First
07/01/2024 23:12:51;1704665571;15;Second
07/01/2024 23:12:51;1704665571;16;First
07/01/2024 23:12:51;1704665571;8;Second
07/01/2024 23:12:51;1704665571;9;Second
07/01/2024 23:12:52;1704665572;10;Second
07/01/2024 23:12:52;1704665572;13;First
07/01/2024 23:12:52;1704665572;14;Second
07/01/2024 23:12:52;1704665572;17;First
07/01/2024 23:12:52;1704665572;7;Second
07/01/2024 23:12:52;1704665572;9;Second
07/01/2024 23:12:52;1704665572;11;Second
07/01/2024 23:12:52;1704665572;11;First
07/01/2024 23:12:52;1704665572;13;First
07/01/2024 23:12:52;1704665572;15;Second
07/01/2024 23:12:52;1704665572;7;Second
07/01/2024 23:12:52;1704665572;9;Second
07/01/2024 23:12:53;1704665573;11;Second
07/01/2024 23:12:53;1704665573;14;First
07/01/2024 23:12:53;1704665573;14;Second
07/01/2024 23:12:53;1704665573;17;First
07/01/2024 23:12:53;1704665573;7;Second
07/01/2024 23:12:53;1704665573;9;Second
07/01/2024 23:12:53;1704665573;11;Second
07/01/2024 23:12:53;1704665573;12;First
07/01/2024 23:12:53;1704665573;15;First
07/01/2024 23:12:53;1704665573;16;Second
07/01/2024 23:12:53;1704665573;7;Second
07/01/2024 23:12:53;1704665573;9;Second
07/01/2024 23:12:54;1704665574;12;Second
07/01/2024 23:12:54;1704665574;14;Second
07/01/2024 23:12:54;1704665574;15;First
07/01/2024 23:12:54;1704665574;17;First
07/01/2024 23:12:54;1704665574;7;Second
07/01/2024 23:12:54;1704665574;9;Second
07/01/2024 23:12:54;1704665574;11;Second
07/01/2024 23:12:54;1704665574;13;First
07/01/2024 23:12:54;1704665574;15;First
07/01/2024 23:12:54;1704665574;16;Second
07/01/2024 23:12:54;1704665574;7;Second
07/01/2024 23:12:54;1704665574;9;Second
07/01/2024 23:12:55;1704665575;12;First
07/01/2024 23:12:55;1704665575;13;Second
07/01/2024 23:12:55;1704665575;16;First
07/01/2024 23:12:55;1704665575;17;Second
07/01/2024 23:12:55;1704665575;7;Second
07/01/2024 23:12:55;1704665575;10;Second
07/01/2024 23:12:55;1704665575;13;First
07/01/2024 23:12:55;1704665575;14;Second
07/01/2024 23:12:55;1704665575;16;First
07/01/2024 23:12:55;1704665575;17;Second
07/01/2024 23:12:55;1704665575;7;Second
07/01/2024 23:12:55;1704665575;8;Second
07/01/2024 23:12:55;1704665575;10;Second
07/01/2024 23:12:56;1704665576;13;First
07/01/2024 23:12:56;1704665576;14;Second
07/01/2024 23:12:56;1704665576;16;First
07/01/2024 23:12:56;1704665576;7;Second
07/01/2024 23:12:56;1704665576;9;Second
07/01/2024 23:12:56;1704665576;11;Second
07/01/2024 23:12:56;1704665576;14;Second
07/01/2024 23:12:56;1704665576;16;First
07/01/2024 23:12:56;1704665576;18;First
07/01/2024 23:12:56;1704665576;7;Second
07/01/2024 23:12:56;1704665576;10;Second
07/01/2024 23:12:56;1704665576;11;Second
07/01/2024 23:12:57;1704665577;15;First
07/01/2024 23:12:57;1704665577;15;Second
07/01/2024 23:12:57;1704665577;17;First
07/01/2024 23:12:57;1704665577;8;Second
07/01/2024 23:12:57;1704665577;10;Second
07/01/2024 23:12:57;1704665577;12;Second
07/01/2024 23:12:57;1704665577;14;First
07/01/2024 23:12:57;1704665577;15;Second
07/01/2024 23:12:57;1704665577;18;First
07/01/2024 23:12:57;1704665577;8;Second
07/01/2024 23:12:57;1704665577;10;Second
07/01/2024 23:12:58;1704665578;12;Second
07/01/2024 23:12:58;1704665578;13;First
07/01/2024 23:12:58;1704665578;15;First
07/01/2024 23:12:58;1704665578;16;Second
07/01/2024 23:12:58;1704665578;7;Second
07/01/2024 23:12:58;1704665578;10;Second
07/01/2024 23:12:58;1704665578;12;First
07/01/2024 23:12:58;1704665578;13;Second
07/01/2024 23:12:58;1704665578;17;First
07/01/2024 23:12:58;1704665578;17;Second
07/01/2024 23:12:58;1704665578;8;Second
07/01/2024 23:12:59;1704665579;9;Second
07/01/2024 23:12:59;1704665579;12;Second
07/01/2024 23:12:59;1704665579;14;Second
07/01/2024 23:12:59;1704665579;15;First
07/01/2024 23:12:59;1704665579;17;First
07/01/2024 23:12:59;1704665579;8;Second
07/01/2024 23:12:59;1704665579;9;Second
07/01/2024 23:12:59;1704665579;12;First
07/01/2024 23:12:59;1704665579;13;Second
07/01/2024 23:12:59;1704665579;14;Second
07/01/2024 23:12:59;1704665579;17;First
07/01/2024 23:12:59;1704665579;6;Second
07/01/2024 23:13:00;1704665580;9;Second
07/01/2024 23:13:00;1704665580;12;First
07/01/2024 23:13:00;1704665580;13;Second
07/01/2024 23:13:00;1704665580;15;Second
07/01/2024 23:13:00;1704665580;16;First
07/01/2024 23:13:00;1704665580;7;Second
07/01/2024 23:13:00;1704665580;10;Second
07/01/2024 23:13:00;1704665580;12;Second
07/01/2024 23:13:00;1704665580;14;First
07/01/2024 23:13:00;1704665580;16;Second
07/01/2024 23:13:00;1704665580;16;First
07/01/2024 23:13:00;1704665580;7;Second
07/01/2024 23:13:01;1704665581;9;Second
07/01/2024 23:13:01;1704665581;10;Second
07/01/2024 23:13:01;1704665581;12;First
07/01/2024 23:13:01;1704665581;13;Second
07/01/2024 23:13:01;1704665581;16;First
07/01/2024 23:13:01;1704665581;7;Second
07/01/2024 23:13:01;1704665581;10;Second
07/01/2024 23:13:01;1704665581;12;Second
07/01/2024 23:13:01;1704665581;14;Second
07/01/2024 23:13:01;1704665581;15;First
07/01/2024 23:13:01;1704665581;16;First
07/01/2024 23:13:01;1704665581;7;Second
07/01/2024 23:13:02;1704665582;10;Second
07/01/2024 23:13:02;1704665582;12;Second
07/01/2024 23:13:02;1704665582;14;Second
07/01/2024 23:13:02;1704665582;15;First
07/01/2024 23:13:02;1704665582;17;First
07/01/2024 23:13:02;1704665582;7;Second
07/01/2024 23:13:02;1704665582;11;Second
07/01/2024 23:13:02;1704665582;12;Second
07/01/2024 23:13:02;1704665582;14;Second
07/01/2024 23:13:02;1704665582;16;First
07/01/2024 23:13:02;1704665582;18;First
07/01/2024 23:13:02;1704665582;7;Second
07/01/2024 23:13:03;1704665583;9;Second
07/01/2024 23:13:03;1704665583;12;Second
07/01/2024 23:13:03;1704665583;13;First
07/01/2024 23:13:03;1704665583;15;First
07/01/2024 23:13:03;1704665583;16;Second
07/01/2024 23:13:03;1704665583;8;Second
07/01/2024 23:13:03;1704665583;11;Second
07/01/2024 23:13:03;1704665583;12;Second
07/01/2024 23:13:03;1704665583;13;First
07/01/2024 23:13:03;1704665583;15;Second
07/01/2024 23:13:03;1704665583;17;First
07/01/2024 23:13:04;1704665584;7;Second
07/01/2024 23:13:04;1704665584;10;Second
07/01/2024 23:13:04;1704665584;12;Second
07/01/2024 23:13:04;1704665584;13;Second
07/01/2024 23:13:04;1704665584;15;First
07/01/2024 23:13:04;1704665584;17;First
07/01/2024 23:13:04;1704665584;7;Second
07/01/2024 23:13:04;1704665584;10;Second
07/01/2024 23:13:04;1704665584;11;Second
07/01/2024 23:13:04;1704665584;13;First
07/01/2024 23:13:04;1704665584;14;Second
07/01/2024 23:13:04;1704665584;16;First
07/01/2024 23:13:05;1704665585;8;Second
07/01/2024 23:13:05;1704665585;10;Second
07/01/2024 23:13:05;1704665585;12;Second
07/01/2024 23:13:05;1704665585;14;First
07/01/2024 23:13:05;1704665585;15;First
07/01/2024 23:13:05;1704665585;16;Second
07/01/2024 23:13:05;1704665585;7;Second
07/01/2024 23:13:05;1704665585;9;Second
07/01/2024 23:13:05;1704665585;12;Second
07/01/2024 23:13:05;1704665585;13;First
07/01/2024 23:13:05;1704665585;14;Second
07/01/2024 23:13:05;1704665585;16;First
07/01/2024 23:13:06;1704665586;7;Second
07/01/2024 23:13:06;1704665586;9;Second
07/01/2024 23:13:06;1704665586;12;First
07/01/2024 23:13:06;1704665586;13;Second
07/01/2024 23:13:06;1704665586;14;Second
07/01/2024 23:13:06;1704665586;16;First
07/01/2024 23:13:06;1704665586;7;Second
07/01/2024 23:13:06;1704665586;10;Second
07/01/2024 23:13:06;1704665586;13;Second
07/01/2024 23:13:06;1704665586;14;First
07/01/2024 23:13:06;1704665586;16;First
07/01/2024 23:13:06;1704665586;17;Second
07/01/2024 23:13:07;1704665587;7;Second
07/01/2024 23:13:07;1704665587;10;Second
07/01/2024 23:13:07;1704665587;13;First
07/01/2024 23:13:07;1704665587;14;Second
07/01/2024 23:13:07;1704665587;16;Second
07/01/2024 23:13:07;1704665587;17;First
07/01/2024 23:13:07;1704665587;8;Second
07/01/2024 23:13:07;1704665587;10;Second
07/01/2024 23:13:07;1704665587;12;Second
07/01/2024 23:13:07;1704665587;14;First
07/01/2024 23:13:07;1704665587;17;First
07/01/2024 23:13:07;1704665587;17;Second
07/01/2024 23:13:08;1704665588;7;Second
07/01/2024 23:13:08;1704665588;9;Second
07/01/2024 23:13:08;1704665588;11;Second
07/01/2024 23:13:08;1704665588;12;First
07/01/2024 23:13:08;1704665588;14;First
07/01/2024 23:13:08;1704665588;15;Second
07/01/2024 23:13:08;1704665588;7;Second
07/01/2024 23:13:08;1704665588;9;Second
07/01/2024 23:13:08;1704665588;11;Second
07/01/2024 23:13:08;1704665588;13;First
07/01/2024 23:13:08;1704665588;15;First
07/01/2024 23:13:08;1704665588;15;Second
07/01/2024 23:13:09;1704665589;8;Second
07/01/2024 23:13:09;1704665589;9;Second
07/01/2024 23:13:09;1704665589;12;Second
07/01/2024 23:13:09;1704665589;14;Second
07/01/2024 23:13:09;1704665589;15;First
07/01/2024 23:13:09;1704665589;18;First
07/01/2024 23:13:09;1704665589;7;Second
07/01/2024 23:13:09;1704665589;9;Second
07/01/2024 23:13:09;1704665589;12;Second
07/01/2024 23:13:09;1704665589;14;Second
07/01/2024 23:13:09;1704665589;16;First
07/01/2024 23:13:09;1704665589;17;First
07/01/2024 23:13:10;1704665590;7;Second
07/01/2024 23:13:10;1704665590;9;Second
07/01/2024 23:13:10;1704665590;11;Second
07/01/2024 23:13:10;1704665590;12;First
07/01/2024 23:13:10;1704665590;14;Second
07/01/2024 23:13:10;1704665590;16;First
07/01/2024 23:13:10;1704665590;8;Second
07/01/2024 23:13:10;1704665590;10;Second
07/01/2024 23:13:10;1704665590;12;Second
07/01/2024 23:13:10;1704665590;14;First
07/01/2024 23:13:10;1704665590;15;Second
07/01/2024 23:13:10;1704665590;17;First
07/01/2024 23:13:11;1704665591;8;Second
07/01/2024 23:13:11;1704665591;10;Second
07/01/2024 23:13:11;1704665591;12;First
07/01/2024 23:13:11;1704665591;14;Second
07/01/2024 23:13:11;1704665591;16;Second
07/01/2024 23:13:11;1704665591;18;First
07/01/2024 23:13:11;1704665591;7;Second
07/01/2024 23:13:11;1704665591;9;Second
07/01/2024 23:13:11;1704665591;11;Second
07/01/2024 23:13:11;1704665591;15;First
07/01/2024 23:13:11;1704665591;15;Second
07/01/2024 23:13:11;1704665591;17;First
07/01/2024 23:13:12;1704665592;6;Second
07/01/2024 23:13:12;1704665592;9;Second
07/01/2024 23:13:12;1704665592;12;First
07/01/2024 23:13:12;1704665592;14;Second
07/01/2024 23:13:12;1704665592;14;Second
07/01/2024 23:13:12;1704665592;17;First
07/01/2024 23:13:12;1704665592;7;Second
07/01/2024 23:13:12;1704665592;10;Second
07/01/2024 23:13:12;1704665592;11;Second
07/01/2024 23:13:12;1704665592;12;First
07/01/2024 23:13:12;1704665592;14;Second
07/01/2024 23:13:12;1704665592;17;First
07/01/2024 23:13:13;1704665593;7;Second
07/01/2024 23:13:13;1704665593;9;Second
07/01/2024 23:13:13;1704665593;12;Second
07/01/2024 23:13:13;1704665593;14;Second
07/01/2024 23:13:13;1704665593;16;First
07/01/2024 23:13:13;1704665593;17;First
07/01/2024 23:13:13;1704665593;7;Second
07/01/2024 23:13:13;1704665593;9;Second
07/01/2024 23:13:13;1704665593;11;Second
07/01/2024 23:13:13;1704665593;14;First
07/01/2024 23:13:13;1704665593;15;Second
07/01/2024 23:13:14;1704665594;17;First
07/01/2024 23:13:14;1704665594;7;Second
07/01/2024 23:13:14;1704665594;10;Second
07/01/2024 23:13:14;1704665594;12;First
07/01/2024 23:13:14;1704665594;14;Second
07/01/2024 23:13:14;1704665594;15;Second
07/01/2024 23:13:14;1704665594;17;First
07/01/2024 23:13:14;1704665594;7;Second
07/01/2024 23:13:14;1704665594;10;Second
07/01/2024 23:13:14;1704665594;10;Second
07/01/2024 23:13:15;1704665595;13;Second
07/01/2024 23:13:15;1704665595;15;First
07/01/2024 23:13:15;1704665595;17;First
07/01/2024 23:13:15;1704665595;7;Second
07/01/2024 23:13:15;1704665595;9;Second
07/01/2024 23:13:15;1704665595;11;Second
07/01/2024 23:13:15;1704665595;12;First
07/01/2024 23:13:15;1704665595;15;First
07/01/2024 23:13:15;1704665595;15;Second
07/01/2024 23:13:15;1704665595;8;Second
07/01/2024 23:13:15;1704665595;10;Second
07/01/2024 23:13:15;1704665595;11;Second
07/01/2024 23:13:15;1704665595;14;First
07/01/2024 23:13:15;1704665595;16;Second
07/01/2024 23:13:16;1704665596;18;First
07/01/2024 23:13:16;1704665596;7;Second
07/01/2024 23:13:16;1704665596;9;Second
07/01/2024 23:13:16;1704665596;12;First
07/01/2024 23:13:16;1704665596;13;Second
07/01/2024 23:13:16;1704665596;15;Second
07/01/2024 23:13:16;1704665596;18;First
07/01/2024 23:13:16;1704665596;7;Second
07/01/2024 23:13:16;1704665596;10;Second
07/01/2024 23:13:16;1704665596;12;Second
07/01/2024 23:13:17;1704665597;14;First
07/01/2024 23:13:17;1704665597;15;Second
07/01/2024 23:13:17;1704665597;17;First
07/01/2024 23:13:17;1704665597;7;Second
07/01/2024 23:13:17;1704665597;10;Second
07/01/2024 23:13:17;1704665597;11;Second
07/01/2024 23:13:17;1704665597;13;First
07/01/2024 23:13:17;1704665597;14;Second
07/01/2024 23:13:17;1704665597;17;First
07/01/2024 23:13:17;1704665597;7;Second
07/01/2024 23:13:18;1704665598;9;Second
07/01/2024 23:13:18;1704665598;11;Second
07/01/2024 23:13:18;1704665598;13;First
07/01/2024 23:13:18;1704665598;14;Second
07/01/2024 23:13:18;1704665598;16;First
07/01/2024 23:13:18;1704665598;7;Second
07/01/2024 23:13:18;1704665598;10;Second
07/01/2024 23:13:18;1704665598;11;Second
07/01/2024 23:13:18;1704665598;14;First
07/01/2024 23:13:18;1704665598;14;Second
07/01/2024 23:13:18;1704665598;17;First
07/01/2024 23:13:19;1704665599;8;Second
07/01/2024 23:13:19;1704665599;10;Second
07/01/2024 23:13:19;1704665599;11;Second
07/01/2024 23:13:19;1704665599;13;First
07/01/2024 23:13:19;1704665599;15;Second
07/01/2024 23:13:19;1704665599;17;First
07/01/2024 23:13:19;1704665599;7;Second
07/01/2024 23:13:19;1704665599;9;Second
07/01/2024 23:13:19;1704665599;11;First
07/01/2024 23:13:19;1704665599;12;Second
07/01/2024 23:13:19;1704665599;13;Second
07/01/2024 23:13:19;1704665599;16;First
07/01/2024 23:13:20;1704665600;7;Second
07/01/2024 23:13:20;1704665600;9;Second
07/01/2024 23:13:20;1704665600;12;First
07/01/2024 23:13:20;1704665600;13;Second
07/01/2024 23:13:20;1704665600;15;First
07/01/2024 23:13:20;1704665600;17;Second
