06/01/2024 16:21:46;1704554506;0;First
06/01/2024 16:21:46;1704554506;0;First
06/01/2024 16:21:46;1704554506;0;Second
06/01/2024 16:21:46;1704554506;0;Second
06/01/2024 16:21:47;1704554507;15;First
06/01/2024 16:21:47;1704554507;17;Second
06/01/2024 16:21:47;1704554507;18;First
06/01/2024 16:21:47;1704554507;19;Second
06/01/2024 16:21:47;1704554507;15;Second
06/01/2024 16:21:47;1704554507;16;First
06/01/2024 16:21:47;1704554507;18;First
06/01/2024 16:21:47;1704554507;18;Second
06/01/2024 16:21:48;1704554508;16;First
06/01/2024 16:21:48;1704554508;16;Second
06/01/2024 16:21:48;1704554508;17;Second
06/01/2024 16:21:48;1704554508;18;First
06/01/2024 16:21:48;1704554508;14;Second
06/01/2024 16:21:48;1704554508;16;First
06/01/2024 16:21:48;1704554508;17;Second
06/01/2024 16:21:48;1704554508;17;First
06/01/2024 16:21:49;1704554509;14;First
06/01/2024 16:21:49;1704554509;17;Second
06/01/2024 16:21:49;1704554509;17;First
06/01/2024 16:21:49;1704554509;20;Second
06/01/2024 16:21:49;1704554509;14;Second
06/01/2024 16:21:49;1704554509;16;First
06/01/2024 16:21:49;1704554509;17;Second
06/01/2024 16:21:49;1704554509;18;First
06/01/2024 16:21:50;1704554510;15;Second
06/01/2024 16:21:50;1704554510;16;First
06/01/2024 16:21:50;1704554510;16;Second
06/01/2024 16:21:50;1704554510;19;First
06/01/2024 16:21:50;1704554510;14;Second
06/01/2024 16:21:50;1704554510;16;First
06/01/2024 16:21:50;1704554510;16;Second
06/01/2024 16:21:50;1704554510;18;First
06/01/2024 16:21:51;1704554511;16;Second
06/01/2024 16:21:51;1704554511;16;First
06/01/2024 16:21:51;1704554511;17;First
06/01/2024 16:21:51;1704554511;18;Second
06/01/2024 16:21:51;1704554511;15;Second
06/01/2024 16:21:51;1704554511;16;First
06/01/2024 16:21:51;1704554511;18;First
06/01/2024 16:21:51;1704554511;18;Second
06/01/2024 16:21:51;1704554511;15;Second
06/01/2024 16:21:51;1704554511;17;Second
06/01/2024 16:21:51;1704554511;17;First
06/01/2024 16:21:52;1704554512;19;First
06/01/2024 16:21:52;1704554512;15;First
06/01/2024 16:21:52;1704554512;15;Second
06/01/2024 16:21:52;1704554512;18;First
06/01/2024 16:21:52;1704554512;18;Second
06/01/2024 16:21:52;1704554512;14;Second
06/01/2024 16:21:52;1704554512;15;First
06/01/2024 16:21:52;1704554512;16;Second
06/01/2024 16:21:52;1704554512;17;First
06/01/2024 16:21:53;1704554513;14;Second
06/01/2024 16:21:53;1704554513;15;First
06/01/2024 16:21:53;1704554513;17;First
06/01/2024 16:21:53;1704554513;18;Second
06/01/2024 16:21:53;1704554513;14;First
06/01/2024 16:21:53;1704554513;14;Second
06/01/2024 16:21:53;1704554513;17;Second
06/01/2024 16:21:53;1704554513;17;First
06/01/2024 16:21:54;1704554514;16;Second
06/01/2024 16:21:54;1704554514;17;First
06/01/2024 16:21:54;1704554514;18;First
06/01/2024 16:21:54;1704554514;18;Second
06/01/2024 16:21:54;1704554514;14;Second
06/01/2024 16:21:54;1704554514;17;First
06/01/2024 16:21:54;1704554514;17;Second
06/01/2024 16:21:54;1704554514;19;First
06/01/2024 16:21:55;1704554515;15;Second
06/01/2024 16:21:55;1704554515;16;First
06/01/2024 16:21:55;1704554515;17;Second
06/01/2024 16:21:55;1704554515;19;First
06/01/2024 16:21:55;1704554515;14;Second
06/01/2024 16:21:55;1704554515;16;First
06/01/2024 16:21:55;1704554515;17;Second
06/01/2024 16:21:55;1704554515;18;First
06/01/2024 16:21:56;1704554516;15;Second
06/01/2024 16:21:56;1704554516;17;First
06/01/2024 16:21:56;1704554516;18;Second
06/01/2024 16:21:56;1704554516;18;First
06/01/2024 16:21:56;1704554516;15;Second
06/01/2024 16:21:56;1704554516;16;First
06/01/2024 16:21:56;1704554516;16;Second
06/01/2024 16:21:56;1704554516;18;First
06/01/2024 16:21:57;1704554517;15;First
06/01/2024 16:21:57;1704554517;15;Second
06/01/2024 16:21:57;1704554517;18;First
06/01/2024 16:21:57;1704554517;18;Second
06/01/2024 16:21:57;1704554517;15;Second
06/01/2024 16:21:57;1704554517;16;First
06/01/2024 16:21:57;1704554517;19;First
06/01/2024 16:21:57;1704554517;19;Second
06/01/2024 16:21:57;1704554517;15;First
06/01/2024 16:21:57;1704554517;16;Second
06/01/2024 16:21:58;1704554518;17;First
06/01/2024 16:21:58;1704554518;18;Second
06/01/2024 16:21:58;1704554518;16;Second
06/01/2024 16:21:58;1704554518;16;First
06/01/2024 16:21:58;1704554518;18;First
06/01/2024 16:21:58;1704554518;19;Second
06/01/2024 16:21:58;1704554518;15;First
06/01/2024 16:21:59;1704554519;16;Second
06/01/2024 16:21:59;1704554519;16;First
06/01/2024 16:21:59;1704554519;19;Second
06/01/2024 16:21:59;1704554519;14;Second
06/01/2024 16:21:59;1704554519;16;First
06/01/2024 16:21:59;1704554519;17;First
06/01/2024 16:21:59;1704554519;19;Second
06/01/2024 16:21:59;1704554519;15;First
06/01/2024 16:21:59;1704554519;16;Second
06/01/2024 16:21:59;1704554519;18;First
06/01/2024 16:21:59;1704554519;18;Second
06/01/2024 16:22:00;1704554520;16;Second
06/01/2024 16:22:00;1704554520;18;First
06/01/2024 16:22:00;1704554520;19;Second
06/01/2024 16:22:00;1704554520;19;First
06/01/2024 16:22:00;1704554520;17;First
06/01/2024 16:22:00;1704554520;18;Second
06/01/2024 16:22:01;1704554521;19;First
06/01/2024 16:22:01;1704554521;20;Second
06/01/2024 16:22:01;1704554521;15;Second
06/01/2024 16:22:01;1704554521;17;First
06/01/2024 16:22:01;1704554521;19;First
06/01/2024 16:22:01;1704554521;20;Second
06/01/2024 16:22:01;1704554521;16;Second
06/01/2024 16:22:01;1704554521;17;First
06/01/2024 16:22:02;1704554522;19;Second
06/01/2024 16:22:02;1704554522;19;First
06/01/2024 16:22:02;1704554522;15;Second
06/01/2024 16:22:02;1704554522;17;First
06/01/2024 16:22:02;1704554522;18;Second
06/01/2024 16:22:02;1704554522;19;First
06/01/2024 16:22:02;1704554522;15;First
06/01/2024 16:22:03;1704554523;16;Second
06/01/2024 16:22:03;1704554523;18;First
06/01/2024 16:22:03;1704554523;18;Second
06/01/2024 16:22:03;1704554523;14;Second
06/01/2024 16:22:03;1704554523;17;First
06/01/2024 16:22:03;1704554523;18;Second
06/01/2024 16:22:03;1704554523;20;First
06/01/2024 16:22:03;1704554523;16;Second
06/01/2024 16:22:03;1704554523;16;First
06/01/2024 16:22:03;1704554523;18;First
06/01/2024 16:22:03;1704554523;18;Second
06/01/2024 16:22:04;1704554524;16;Second
06/01/2024 16:22:04;1704554524;16;First
06/01/2024 16:22:04;1704554524;19;First
06/01/2024 16:22:04;1704554524;19;Second
06/01/2024 16:22:04;1704554524;15;First
06/01/2024 16:22:04;1704554524;16;Second
06/01/2024 16:22:04;1704554524;17;First
06/01/2024 16:22:04;1704554524;18;Second
06/01/2024 16:22:05;1704554525;16;Second
06/01/2024 16:22:05;1704554525;18;First
06/01/2024 16:22:05;1704554525;19;Second
06/01/2024 16:22:05;1704554525;19;First
06/01/2024 16:22:05;1704554525;14;Second
06/01/2024 16:22:05;1704554525;16;First
06/01/2024 16:22:05;1704554525;17;Second
06/01/2024 16:22:05;1704554525;19;First
06/01/2024 16:22:06;1704554526;16;Second
06/01/2024 16:22:06;1704554526;16;First
06/01/2024 16:22:06;1704554526;17;First
06/01/2024 16:22:06;1704554526;18;Second
06/01/2024 16:22:06;1704554526;15;First
06/01/2024 16:22:06;1704554526;18;Second
06/01/2024 16:22:06;1704554526;20;First
06/01/2024 16:22:06;1704554526;20;Second
06/01/2024 16:22:07;1704554527;15;Second
06/01/2024 16:22:07;1704554527;17;First
06/01/2024 16:22:07;1704554527;17;Second
06/01/2024 16:22:07;1704554527;18;First
06/01/2024 16:22:07;1704554527;15;Second
06/01/2024 16:22:07;1704554527;16;First
06/01/2024 16:22:07;1704554527;17;Second
06/01/2024 16:22:07;1704554527;19;First
06/01/2024 16:22:08;1704554528;15;First
06/01/2024 16:22:08;1704554528;16;Second
06/01/2024 16:22:08;1704554528;17;First
06/01/2024 16:22:08;1704554528;19;Second
06/01/2024 16:22:08;1704554528;14;First
06/01/2024 16:22:08;1704554528;16;First
06/01/2024 16:22:08;1704554528;16;Second
06/01/2024 16:22:08;1704554528;18;Second
06/01/2024 16:22:09;1704554529;15;Second
06/01/2024 16:22:09;1704554529;16;First
06/01/2024 16:22:09;1704554529;18;First
06/01/2024 16:22:09;1704554529;18;Second
06/01/2024 16:22:09;1704554529;15;Second
06/01/2024 16:22:09;1704554529;17;Second
06/01/2024 16:22:09;1704554529;17;First
06/01/2024 16:22:09;1704554529;18;First
06/01/2024 16:22:10;1704554530;15;Second
06/01/2024 16:22:10;1704554530;16;First
06/01/2024 16:22:10;1704554530;17;Second
06/01/2024 16:22:10;1704554530;18;First
06/01/2024 16:22:10;1704554530;15;Second
06/01/2024 16:22:10;1704554530;16;First
06/01/2024 16:22:10;1704554530;18;First
06/01/2024 16:22:10;1704554530;18;Second
06/01/2024 16:22:11;1704554531;16;Second
06/01/2024 16:22:11;1704554531;17;First
06/01/2024 16:22:11;1704554531;18;Second
06/01/2024 16:22:11;1704554531;20;First
06/01/2024 16:22:11;1704554531;15;Second
06/01/2024 16:22:11;1704554531;16;First
06/01/2024 16:22:11;1704554531;17;First
06/01/2024 16:22:11;1704554531;18;Second
06/01/2024 16:22:11;1704554531;13;First
06/01/2024 16:22:11;1704554531;15;Second
06/01/2024 16:22:12;1704554532;16;First
06/01/2024 16:22:12;1704554532;16;Second
06/01/2024 16:22:12;1704554532;16;First
06/01/2024 16:22:12;1704554532;17;Second
06/01/2024 16:22:12;1704554532;18;First
06/01/2024 16:22:12;1704554532;19;Second
06/01/2024 16:22:12;1704554532;15;Second
06/01/2024 16:22:12;1704554532;17;First
06/01/2024 16:22:12;1704554532;18;First
06/01/2024 16:22:13;1704554533;19;Second
06/01/2024 16:22:13;1704554533;15;Second
06/01/2024 16:22:13;1704554533;17;First
06/01/2024 16:22:13;1704554533;18;Second
06/01/2024 16:22:13;1704554533;20;First
06/01/2024 16:22:13;1704554533;15;Second
06/01/2024 16:22:13;1704554533;15;First
06/01/2024 16:22:13;1704554533;16;Second
06/01/2024 16:22:13;1704554533;18;First
06/01/2024 16:22:14;1704554534;15;Second
06/01/2024 16:22:14;1704554534;15;First
06/01/2024 16:22:14;1704554534;18;First
06/01/2024 16:22:14;1704554534;18;Second
06/01/2024 16:22:14;1704554534;14;Second
06/01/2024 16:22:14;1704554534;15;First
06/01/2024 16:22:14;1704554534;17;First
06/01/2024 16:22:14;1704554534;17;Second
06/01/2024 16:22:15;1704554535;17;Second
06/01/2024 16:22:15;1704554535;18;First
06/01/2024 16:22:15;1704554535;19;First
06/01/2024 16:22:15;1704554535;19;Second
06/01/2024 16:22:15;1704554535;17;Second
06/01/2024 16:22:15;1704554535;17;First
06/01/2024 16:22:15;1704554535;18;Second
06/01/2024 16:22:15;1704554535;20;First
06/01/2024 16:22:16;1704554536;16;First
06/01/2024 16:22:16;1704554536;16;Second
06/01/2024 16:22:16;1704554536;17;First
06/01/2024 16:22:16;1704554536;19;Second
06/01/2024 16:22:17;1704554537;14;Second
06/01/2024 16:22:17;1704554537;15;First
06/01/2024 16:22:17;1704554537;16;Second
06/01/2024 16:22:17;1704554537;16;First
06/01/2024 16:22:17;1704554537;16;Second
06/01/2024 16:22:17;1704554537;16;First
06/01/2024 16:22:17;1704554537;18;Second
06/01/2024 16:22:17;1704554537;18;First
06/01/2024 16:22:17;1704554537;16;First
06/01/2024 16:22:17;1704554537;16;Second
06/01/2024 16:22:18;1704554538;18;Second
06/01/2024 16:22:18;1704554538;18;First
06/01/2024 16:22:18;1704554538;15;Second
06/01/2024 16:22:18;1704554538;17;First
06/01/2024 16:22:18;1704554538;18;First
06/01/2024 16:22:18;1704554538;18;Second
06/01/2024 16:22:18;1704554538;15;Second
06/01/2024 16:22:18;1704554538;15;First
06/01/2024 16:22:18;1704554538;19;First
06/01/2024 16:22:18;1704554538;19;Second
06/01/2024 16:22:19;1704554539;15;Second
06/01/2024 16:22:19;1704554539;15;First
06/01/2024 16:22:19;1704554539;18;Second
06/01/2024 16:22:19;1704554539;18;First
06/01/2024 16:22:19;1704554539;16;First
06/01/2024 16:22:19;1704554539;17;First
06/01/2024 16:22:19;1704554539;19;Second
06/01/2024 16:22:19;1704554539;20;Second
06/01/2024 16:22:20;1704554540;16;Second
06/01/2024 16:22:20;1704554540;17;First
06/01/2024 16:22:20;1704554540;17;Second
06/01/2024 16:22:20;1704554540;21;First
06/01/2024 16:22:20;1704554540;14;Second
06/01/2024 16:22:20;1704554540;16;First
06/01/2024 16:22:20;1704554540;18;First
06/01/2024 16:22:20;1704554540;18;Second
06/01/2024 16:22:21;1704554541;15;First
06/01/2024 16:22:21;1704554541;16;Second
06/01/2024 16:22:21;1704554541;18;First
06/01/2024 16:22:21;1704554541;19;Second
06/01/2024 16:22:21;1704554541;14;First
06/01/2024 16:22:21;1704554541;15;Second
06/01/2024 16:22:21;1704554541;18;Second
06/01/2024 16:22:21;1704554541;18;First
06/01/2024 16:22:22;1704554542;15;Second
06/01/2024 16:22:22;1704554542;17;First
06/01/2024 16:22:22;1704554542;19;First
06/01/2024 16:22:22;1704554542;22;Second
06/01/2024 16:22:23;1704554543;17;Second
06/01/2024 16:22:23;1704554543;17;First
06/01/2024 16:22:23;1704554543;18;First
06/01/2024 16:22:23;1704554543;20;Second
06/01/2024 16:22:23;1704554543;14;Second
06/01/2024 16:22:23;1704554543;15;First
06/01/2024 16:22:23;1704554543;17;First
06/01/2024 16:22:23;1704554543;18;Second
06/01/2024 16:22:23;1704554543;15;Second
06/01/2024 16:22:23;1704554543;16;First
06/01/2024 16:22:23;1704554543;17;Second
06/01/2024 16:22:23;1704554543;18;First
06/01/2024 16:22:24;1704554544;15;Second
06/01/2024 16:22:24;1704554544;16;First
06/01/2024 16:22:24;1704554544;16;Second
06/01/2024 16:22:24;1704554544;20;First
06/01/2024 16:22:24;1704554544;13;Second
06/01/2024 16:22:24;1704554544;16;First
06/01/2024 16:22:24;1704554544;17;Second
06/01/2024 16:22:24;1704554544;18;First
06/01/2024 16:22:25;1704554545;14;First
06/01/2024 16:22:25;1704554545;14;Second
06/01/2024 16:22:25;1704554545;17;Second
06/01/2024 16:22:25;1704554545;18;First
06/01/2024 16:22:25;1704554545;15;First
06/01/2024 16:22:25;1704554545;15;Second
06/01/2024 16:22:25;1704554545;18;First
06/01/2024 16:22:25;1704554545;20;Second
06/01/2024 16:22:26;1704554546;14;Second
06/01/2024 16:22:26;1704554546;15;First
06/01/2024 16:22:26;1704554546;17;First
06/01/2024 16:22:26;1704554546;18;Second
06/01/2024 16:22:26;1704554546;16;Second
06/01/2024 16:22:26;1704554546;17;Second
06/01/2024 16:22:26;1704554546;17;First
06/01/2024 16:22:26;1704554546;19;First
06/01/2024 16:22:27;1704554547;15;Second
06/01/2024 16:22:27;1704554547;17;First
06/01/2024 16:22:27;1704554547;17;Second
06/01/2024 16:22:27;1704554547;20;First
06/01/2024 16:22:27;1704554547;16;Second
06/01/2024 16:22:27;1704554547;16;First
06/01/2024 16:22:27;1704554547;17;First
06/01/2024 16:22:27;1704554547;18;Second
06/01/2024 16:22:28;1704554548;14;Second
06/01/2024 16:22:28;1704554548;16;First
06/01/2024 16:22:28;1704554548;16;Second
06/01/2024 16:22:28;1704554548;17;First
06/01/2024 16:22:28;1704554548;15;First
06/01/2024 16:22:28;1704554548;15;Second
06/01/2024 16:22:28;1704554548;17;Second
06/01/2024 16:22:28;1704554548;18;First
06/01/2024 16:22:29;1704554549;14;Second
06/01/2024 16:22:29;1704554549;15;First
06/01/2024 16:22:29;1704554549;17;Second
06/01/2024 16:22:29;1704554549;18;First
06/01/2024 16:22:29;1704554549;15;First
06/01/2024 16:22:29;1704554549;15;Second
06/01/2024 16:22:29;1704554549;16;First
06/01/2024 16:22:29;1704554549;18;Second
06/01/2024 16:22:30;1704554550;16;First
06/01/2024 16:22:30;1704554550;18;Second
06/01/2024 16:22:30;1704554550;18;Second
06/01/2024 16:22:30;1704554550;19;First
06/01/2024 16:22:30;1704554550;14;Second
06/01/2024 16:22:30;1704554550;16;Second
06/01/2024 16:22:30;1704554550;16;First
06/01/2024 16:22:30;1704554550;18;First
06/01/2024 16:22:31;1704554551;16;First
06/01/2024 16:22:31;1704554551;16;Second
06/01/2024 16:22:31;1704554551;18;First
06/01/2024 16:22:31;1704554551;19;Second
06/01/2024 16:22:31;1704554551;16;Second
06/01/2024 16:22:31;1704554551;16;First
06/01/2024 16:22:31;1704554551;17;Second
06/01/2024 16:22:31;1704554551;18;First
06/01/2024 16:22:32;1704554552;15;Second
06/01/2024 16:22:32;1704554552;16;First
06/01/2024 16:22:32;1704554552;17;Second
06/01/2024 16:22:32;1704554552;17;First
06/01/2024 16:22:32;1704554552;15;Second
06/01/2024 16:22:32;1704554552;17;First
06/01/2024 16:22:32;1704554552;18;Second
06/01/2024 16:22:32;1704554552;20;First
06/01/2024 16:22:33;1704554553;15;First
06/01/2024 16:22:33;1704554553;15;Second
06/01/2024 16:22:33;1704554553;16;Second
06/01/2024 16:22:33;1704554553;18;First
06/01/2024 16:22:33;1704554553;15;Second
06/01/2024 16:22:33;1704554553;16;First
06/01/2024 16:22:33;1704554553;17;Second
06/01/2024 16:22:33;1704554553;18;First
06/01/2024 16:22:34;1704554554;15;Second
06/01/2024 16:22:34;1704554554;16;First
06/01/2024 16:22:34;1704554554;18;Second
06/01/2024 16:22:34;1704554554;20;First
06/01/2024 16:22:34;1704554554;15;Second
06/01/2024 16:22:34;1704554554;16;First
06/01/2024 16:22:34;1704554554;18;First
06/01/2024 16:22:34;1704554554;18;Second
06/01/2024 16:22:35;1704554555;16;Second
06/01/2024 16:22:35;1704554555;16;First
06/01/2024 16:22:35;1704554555;18;First
06/01/2024 16:22:35;1704554555;19;Second
