07/01/2024 21:27:36;1704659256;49392;6;5,468916
07/01/2024 21:27:37;1704659257;49410;4;6,9816
07/01/2024 21:27:37;1704659257;49428;4;6,86935
07/01/2024 21:27:38;1704659258;49447;4;6,98885
07/01/2024 21:27:38;1704659258;49464;4;6,73775
07/01/2024 21:27:39;1704659259;49480;4;6,9927
07/01/2024 21:27:39;1704659259;49496;4;2,959374
07/01/2024 21:27:40;1704659260;49512;4;5,9863
07/01/2024 21:27:40;1704659260;49532;4;5,492649
07/01/2024 21:27:41;1704659261;49549;4;6,98775
07/01/2024 21:27:41;1704659261;49567;4;6,744325
07/01/2024 21:27:42;1704659262;49585;4;5,83605
07/01/2024 21:27:43;1704659263;49602;4;6,9772
07/01/2024 21:27:43;1704659263;49619;4;5,99055
07/01/2024 21:27:44;1704659264;49637;4;6,4933
07/01/2024 21:27:44;1704659264;49655;4;6,743625
07/01/2024 21:27:45;1704659265;49671;4;4,324149
07/01/2024 21:27:46;1704659266;49688;4;5,9674
07/01/2024 21:27:46;1704659266;49704;4;5,7272
07/01/2024 21:27:47;1704659267;49722;4;5,9734
07/01/2024 21:27:48;1704659268;49738;4;6,982025
07/01/2024 21:27:48;1704659268;49756;4;5,713775
07/01/2024 21:27:49;1704659269;49772;4;6,346825
07/01/2024 21:27:49;1704659269;49789;4;6,4913
07/01/2024 21:27:50;1704659270;49805;4;6,738075
07/01/2024 21:27:50;1704659270;49822;4;6,363475
07/01/2024 21:27:51;1704659271;49840;4;2,34755
07/01/2024 21:27:52;1704659272;49857;4;6,933025
07/01/2024 21:27:52;1704659272;49874;4;5,812925
07/01/2024 21:27:53;1704659273;49891;4;3,599649
07/01/2024 21:27:53;1704659273;49910;4;6,988025
07/01/2024 21:27:54;1704659274;49928;4;6,993725
07/01/2024 21:27:54;1704659274;49945;4;6,993975
07/01/2024 21:27:55;1704659275;49962;4;6,9943
07/01/2024 21:27:55;1704659275;49980;4;6,9681
07/01/2024 21:27:56;1704659276;49996;4;1,217974
07/01/2024 21:27:57;1704659277;50017;4;3,361549
07/01/2024 21:27:57;1704659277;50035;4;6,6085
07/01/2024 21:27:58;1704659278;50052;4;4,212775
07/01/2024 21:27:58;1704659278;50069;4;6,994699
07/01/2024 21:27:59;1704659279;50086;4;6,6147
07/01/2024 21:28:00;1704659280;50105;4;4,612526
07/01/2024 21:28:00;1704659280;50123;4;6,364375
07/01/2024 21:28:00;1704659280;50141;4;6,993999
07/01/2024 21:28:01;1704659281;50157;4;6,978625
07/01/2024 21:28:02;1704659282;50176;4;6,49095
07/01/2024 21:28:02;1704659282;50193;4;6,323125
07/01/2024 21:28:03;1704659283;50211;4;6,359525
07/01/2024 21:28:03;1704659283;50231;4;6,9937
07/01/2024 21:28:04;1704659284;50248;4;6,989625
07/01/2024 21:28:04;1704659284;50265;4;6,994275
07/01/2024 21:28:05;1704659285;50282;4;6,867525
07/01/2024 21:28:05;1704659285;50298;4;6,11695
07/01/2024 21:28:06;1704659286;50316;4;4,479375
07/01/2024 21:28:12;1704659292;50616;4;-163,2902
07/01/2024 21:28:13;1704659293;50632;4;6,597025
07/01/2024 21:28:14;1704659294;50648;4;6,61075
07/01/2024 21:28:14;1704659294;50666;4;6,9754
07/01/2024 21:28:15;1704659295;50683;4;2,727899
07/01/2024 21:28:15;1704659295;50701;4;6,866025
07/01/2024 21:28:16;1704659296;50718;4;6,9945
07/01/2024 21:28:17;1704659297;50735;4;4,83595
07/01/2024 21:28:18;1704659298;50752;4;6,593275
07/01/2024 21:28:18;1704659298;50770;4;6,994325
07/01/2024 21:28:19;1704659299;50787;4;6,99265
07/01/2024 21:28:19;1704659299;50804;4;6,990275
07/01/2024 21:28:20;1704659300;50821;4;6,713775
07/01/2024 21:28:20;1704659300;50839;4;5,977
07/01/2024 21:28:21;1704659301;50858;4;6,9932
07/01/2024 21:28:21;1704659301;50874;4;4,674875
07/01/2024 21:28:22;1704659302;50892;4;6,86495
07/01/2024 21:28:22;1704659302;50910;4;6,99405
07/01/2024 21:28:23;1704659303;50926;4;6,717401
07/01/2024 21:28:23;1704659303;50943;4;6,7333
07/01/2024 21:28:24;1704659304;50960;4;6,73055
07/01/2024 21:28:25;1704659305;50977;4;4,6028
07/01/2024 21:28:25;1704659305;50994;4;6,99245
07/01/2024 21:28:26;1704659306;51011;4;6,616875
07/01/2024 21:28:26;1704659306;51028;4;6,193151
07/01/2024 21:28:27;1704659307;51047;4;6,971025
07/01/2024 21:28:28;1704659308;51064;4;6,988875
07/01/2024 21:28:28;1704659308;51082;4;6,461675
07/01/2024 21:28:29;1704659309;51099;4;5,991176
07/01/2024 21:28:29;1704659309;51117;4;5,991225
07/01/2024 21:28:30;1704659310;51133;4;6,240075
07/01/2024 21:28:30;1704659310;51151;4;6,73675
07/01/2024 21:28:31;1704659311;51168;4;6,981925
07/01/2024 21:28:31;1704659311;51185;4;6,618275
07/01/2024 21:28:32;1704659312;51202;4;6,1105
07/01/2024 21:28:32;1704659312;51221;4;6,991475
07/01/2024 21:28:33;1704659313;51238;4;6,994575
07/01/2024 21:28:34;1704659314;51257;4;6,9902
07/01/2024 21:28:34;1704659314;51274;4;6,99215
07/01/2024 21:28:35;1704659315;51294;4;6,616199
07/01/2024 21:28:35;1704659315;51311;4;6,364125
07/01/2024 21:28:36;1704659316;51329;4;5,480926
07/01/2024 21:28:36;1704659316;51345;4;5,975625
07/01/2024 21:28:37;1704659317;51364;4;4,100424
07/01/2024 21:28:37;1704659317;51382;4;6,9867
07/01/2024 21:28:38;1704659318;51399;4;5,86755
07/01/2024 21:28:38;1704659318;51416;4;6,9943
