07/01/2024 23:12:28;1704665548;2078;4;6,238475
07/01/2024 23:12:29;1704665549;2095;6;6,32325
07/01/2024 23:12:29;1704665549;2111;6;6,325266
07/01/2024 23:12:30;1704665550;2128;6;5,988533
07/01/2024 23:12:30;1704665550;2144;6;6,15205
07/01/2024 23:12:31;1704665551;2160;6;5,9886
07/01/2024 23:12:31;1704665551;2177;6;6,313384
07/01/2024 23:12:32;1704665552;2193;6;6,074383
07/01/2024 23:12:32;1704665552;2209;6;6,325834
07/01/2024 23:12:33;1704665553;2225;6;5,6574
07/01/2024 23:12:33;1704665553;2242;6;5,989017
07/01/2024 23:12:34;1704665554;2259;6;5,317034
07/01/2024 23:12:34;1704665554;2276;6;5,73105
07/01/2024 23:12:35;1704665555;2291;6;6,3275
07/01/2024 23:12:35;1704665555;2309;6;6,31865
07/01/2024 23:12:36;1704665556;2326;6;6,326467
07/01/2024 23:12:36;1704665556;2343;6;5,8269
07/01/2024 23:12:37;1704665557;2360;6;6,3236
07/01/2024 23:12:37;1704665557;2376;6;6,3227
07/01/2024 23:12:37;1704665557;2392;6;6,322183
07/01/2024 23:12:38;1704665558;2408;6;6,32225
07/01/2024 23:12:38;1704665558;2425;6;5,81485
07/01/2024 23:12:39;1704665559;2441;6;5,143768
07/01/2024 23:12:39;1704665559;2457;6;6,3219
07/01/2024 23:12:40;1704665560;2474;6;6,234766
07/01/2024 23:12:40;1704665560;2491;6;6,323267
07/01/2024 23:12:41;1704665561;2507;6;6,0751
07/01/2024 23:12:42;1704665562;2525;6;5,735584
07/01/2024 23:12:42;1704665562;2543;6;5,82335
07/01/2024 23:12:43;1704665563;2560;6;6,158567
07/01/2024 23:12:43;1704665563;2578;6;4,733318
07/01/2024 23:12:44;1704665564;2594;6;6,240099
07/01/2024 23:12:44;1704665564;2610;6;5,734516
07/01/2024 23:12:45;1704665565;2628;6;6,320133
07/01/2024 23:12:46;1704665566;2646;6;5,73675
07/01/2024 23:12:47;1704665567;2664;6;6,314283
07/01/2024 23:12:47;1704665567;2679;6;5,8234
07/01/2024 23:12:48;1704665568;2695;6;6,323184
07/01/2024 23:12:48;1704665568;2714;6;5,14095
07/01/2024 23:12:49;1704665569;2729;6;5,990799
07/01/2024 23:12:49;1704665569;2747;6;5,657484
07/01/2024 23:12:50;1704665570;2763;6;5,066583
07/01/2024 23:12:50;1704665570;2779;6;5,991517
07/01/2024 23:12:51;1704665571;2795;6;6,321066
07/01/2024 23:12:51;1704665571;2811;6;5,737234
07/01/2024 23:12:52;1704665572;2828;6;6,324133
07/01/2024 23:12:52;1704665572;2843;6;5,822199
07/01/2024 23:12:53;1704665573;2860;6;6,319767
07/01/2024 23:12:53;1704665573;2876;6;5,9104
07/01/2024 23:12:54;1704665574;2893;6;6,0659
07/01/2024 23:12:54;1704665574;2909;6;5,901917
07/01/2024 23:12:55;1704665575;2926;6;6,328066
07/01/2024 23:12:55;1704665575;2943;6;5,823284
07/01/2024 23:12:56;1704665576;2959;6;5,9095
07/01/2024 23:12:56;1704665576;2977;6;6,070316
07/01/2024 23:12:57;1704665577;2994;6;6,32355
07/01/2024 23:12:57;1704665577;3012;6;6,072767
07/01/2024 23:12:58;1704665578;3028;6;6,157467
07/01/2024 23:12:58;1704665578;3045;6;6,3203
07/01/2024 23:12:59;1704665579;3062;6;5,313484
07/01/2024 23:12:59;1704665579;3079;6;5,319717
07/01/2024 23:13:00;1704665580;3095;6;6,234133
07/01/2024 23:13:00;1704665580;3111;6;6,3226
07/01/2024 23:13:01;1704665581;3127;6;6,07255
07/01/2024 23:13:01;1704665581;3143;6;5,4897
07/01/2024 23:13:02;1704665582;3160;6;6,3237
07/01/2024 23:13:02;1704665582;3178;6;6,322767
07/01/2024 23:13:03;1704665583;3194;6;5,569734
07/01/2024 23:13:03;1704665583;3211;6;5,150484
07/01/2024 23:13:04;1704665584;3228;6;6,323584
07/01/2024 23:13:04;1704665584;3244;6;6,0719
07/01/2024 23:13:05;1704665585;3260;6;5,817667
07/01/2024 23:13:05;1704665585;3276;6;6,3204
07/01/2024 23:13:06;1704665586;3292;6;5,656383
07/01/2024 23:13:06;1704665586;3309;6;5,905033
07/01/2024 23:13:07;1704665587;3326;6;6,316783
07/01/2024 23:13:07;1704665587;3343;6;6,316917
07/01/2024 23:13:08;1704665588;3358;6;5,822817
07/01/2024 23:13:08;1704665588;3373;6;6,321733
07/01/2024 23:13:09;1704665589;3391;6;6,316217
07/01/2024 23:13:09;1704665589;3408;6;5,7377
07/01/2024 23:13:10;1704665590;3424;6;6,3216
07/01/2024 23:13:10;1704665590;3441;6;6,23185
07/01/2024 23:13:11;1704665591;3459;6;5,400051
07/01/2024 23:13:11;1704665591;3476;6;5,40485
07/01/2024 23:13:12;1704665592;3493;6;6,058483
07/01/2024 23:13:12;1704665592;3510;6;6,15265
07/01/2024 23:13:13;1704665593;3527;6;5,5694
07/01/2024 23:13:14;1704665594;3544;6;6,158516
07/01/2024 23:13:14;1704665594;3561;6;6,231617
07/01/2024 23:13:15;1704665595;3578;6;5,822367
07/01/2024 23:13:15;1704665595;3593;6;6,0718
07/01/2024 23:13:16;1704665596;3611;6;6,326534
07/01/2024 23:13:16;1704665596;3629;6;6,321766
07/01/2024 23:13:17;1704665597;3646;6;5,985917
07/01/2024 23:13:17;1704665597;3663;6;5,9928
07/01/2024 23:13:18;1704665598;3679;6;6,32235
07/01/2024 23:13:18;1704665598;3696;6;6,3236
07/01/2024 23:13:19;1704665599;3713;6;6,32185
07/01/2024 23:13:19;1704665599;3729;6;5,6521
