07/01/2024 20:14:50;1704654890;3460;6;5,655334
07/01/2024 20:14:50;1704654890;3491;1;7,489599
07/01/2024 20:14:50;1704654890;3521;1;7,989999
07/01/2024 20:14:51;1704654891;3553;1;7,989499
07/01/2024 20:14:51;1704654891;3583;1;7,989999
07/01/2024 20:14:52;1704654892;3613;1;7,989999
07/01/2024 20:14:52;1704654892;3643;1;7,990099
07/01/2024 20:14:53;1704654893;3677;1;7,988599
07/01/2024 20:14:53;1704654893;3707;1;7,990099
07/01/2024 20:14:54;1704654894;3736;1;7,989999
07/01/2024 20:14:54;1704654894;3767;1;7,989699
07/01/2024 20:14:54;1704654894;3800;1;7,988999
07/01/2024 20:14:55;1704654895;3832;1;7,989399
07/01/2024 20:14:55;1704654895;3863;1;7,989599
07/01/2024 20:14:56;1704654896;3892;1;7,990399
07/01/2024 20:14:56;1704654896;3924;1;7,989399
07/01/2024 20:14:57;1704654897;3953;1;7,990299
07/01/2024 20:14:57;1704654897;3982;1;7,990299
07/01/2024 20:14:57;1704654897;4011;1;7,990499
07/01/2024 20:14:58;1704654898;4044;1;7,988999
07/01/2024 20:14:58;1704654898;4075;1;7,989699
07/01/2024 20:14:59;1704654899;4103;1;7,990399
07/01/2024 20:14:59;1704654899;4132;1;7,990499
07/01/2024 20:15:00;1704654900;4164;1;7,989399
07/01/2024 20:15:00;1704654900;4197;1;7,988999
07/01/2024 20:15:01;1704654901;4227;1;7,989699
07/01/2024 20:15:01;1704654901;4263;1;7,988299
07/01/2024 20:15:02;1704654902;4293;1;7,989699
07/01/2024 20:15:02;1704654902;4322;1;7,990499
07/01/2024 20:15:03;1704654903;4353;1;7,989699
07/01/2024 20:15:03;1704654903;4384;1;7,989499
07/01/2024 20:15:04;1704654904;4414;1;5,490199
07/01/2024 20:15:04;1704654904;4447;1;7,989099
07/01/2024 20:15:05;1704654905;4476;1;7,990099
07/01/2024 20:15:05;1704654905;4509;1;7,989099
07/01/2024 20:15:05;1704654905;4540;1;7,989599
07/01/2024 20:15:06;1704654906;4573;1;7,989199
07/01/2024 20:15:06;1704654906;4603;1;7,989699
07/01/2024 20:15:07;1704654907;4635;1;7,989499
07/01/2024 20:15:07;1704654907;4665;1;7,989899
07/01/2024 20:15:08;1704654908;4698;1;7,989199
07/01/2024 20:15:08;1704654908;4728;1;7,989999
07/01/2024 20:15:09;1704654909;4757;1;7,990099
07/01/2024 20:15:09;1704654909;4789;1;7,489599
07/01/2024 20:15:09;1704654909;4818;1;7,990199
07/01/2024 20:15:10;1704654910;4849;1;7,989699
07/01/2024 20:15:10;1704654910;4878;1;7,990299
07/01/2024 20:15:11;1704654911;4908;1;7,989999
07/01/2024 20:15:11;1704654911;4938;1;7,49
07/01/2024 20:15:12;1704654912;4968;1;7,989799
07/01/2024 20:15:12;1704654912;4999;1;7,989899
07/01/2024 20:15:13;1704654913;5031;1;7,989299
07/01/2024 20:15:13;1704654913;5061;1;7,990099
07/01/2024 20:15:14;1704654914;5090;1;7,990299
07/01/2024 20:15:14;1704654914;5119;1;7,990099
07/01/2024 20:15:15;1704654915;5148;1;7,990499
07/01/2024 20:15:15;1704654915;5177;1;7,990199
07/01/2024 20:15:16;1704654916;5208;1;7,989899
07/01/2024 20:15:16;1704654916;5238;1;7,989999
07/01/2024 20:15:16;1704654916;5266;1;7,990599
07/01/2024 20:15:17;1704654917;5295;1;7,990199
07/01/2024 20:15:17;1704654917;5325;1;7,990099
07/01/2024 20:15:18;1704654918;5355;1;7,989899
07/01/2024 20:15:18;1704654918;5386;1;7,989699
07/01/2024 20:15:19;1704654919;5415;1;7,990299
07/01/2024 20:15:19;1704654919;5445;1;7,989999
07/01/2024 20:15:19;1704654919;5476;1;7,989699
07/01/2024 20:15:20;1704654920;5506;1;7,990099
07/01/2024 20:15:20;1704654920;5535;1;7,990199
07/01/2024 20:15:21;1704654921;5566;1;7,989899
07/01/2024 20:15:21;1704654921;5597;1;7,989399
07/01/2024 20:15:22;1704654922;5629;1;7,989599
07/01/2024 20:15:22;1704654922;5658;1;7,990199
07/01/2024 20:15:23;1704654923;5686;1;7,990499
07/01/2024 20:15:23;1704654923;5717;1;7,989999
07/01/2024 20:15:23;1704654923;5746;1;7,990199
07/01/2024 20:15:24;1704654924;5776;1;7,989899
07/01/2024 20:15:24;1704654924;5806;1;7,990099
07/01/2024 20:15:25;1704654925;5837;1;7,989599
07/01/2024 20:15:25;1704654925;5866;1;7,990299
07/01/2024 20:15:26;1704654926;5897;1;7,989699
07/01/2024 20:15:26;1704654926;5928;1;7,989599
07/01/2024 20:15:26;1704654926;5959;1;7,989699
07/01/2024 20:15:27;1704654927;5989;1;7,989999
07/01/2024 20:15:27;1704654927;6017;1;7,990699
07/01/2024 20:15:28;1704654928;6047;1;7,989999
07/01/2024 20:15:28;1704654928;6076;1;7,990399
07/01/2024 20:15:29;1704654929;6106;1;7,989899
07/01/2024 20:15:29;1704654929;6137;1;7,989699
07/01/2024 20:15:29;1704654929;6166;1;7,990199
07/01/2024 20:15:30;1704654930;6196;1;7,990099
07/01/2024 20:15:30;1704654930;6226;1;7,990199
07/01/2024 20:15:31;1704654931;6258;1;7,989199
07/01/2024 20:15:31;1704654931;6290;1;7,4892
07/01/2024 20:15:32;1704654932;6322;1;7,989399
07/01/2024 20:15:32;1704654932;6351;1;7,990399
07/01/2024 20:15:33;1704654933;6381;1;7,989999
07/01/2024 20:15:33;1704654933;6410;1;7,990199
07/01/2024 20:15:34;1704654934;6440;1;7,990199
07/01/2024 20:15:34;1704654934;6469;1;7,990299
