07/01/2024 23:22:27;1704666147;15
07/01/2024 23:22:28;1704666148;29
07/01/2024 23:22:29;1704666149;22
07/01/2024 23:22:30;1704666150;21
07/01/2024 23:22:31;1704666151;23
07/01/2024 23:22:32;1704666152;24
07/01/2024 23:22:33;1704666153;27
07/01/2024 23:22:34;1704666154;22
07/01/2024 23:22:34;1704666154;23
07/01/2024 23:22:35;1704666155;25
07/01/2024 23:22:36;1704666156;21
07/01/2024 23:22:37;1704666157;29
07/01/2024 23:22:38;1704666158;25
07/01/2024 23:22:39;1704666159;24
07/01/2024 23:22:40;1704666160;24
07/01/2024 23:22:41;1704666161;23
07/01/2024 23:22:42;1704666162;22
07/01/2024 23:22:43;1704666163;28
07/01/2024 23:22:44;1704666164;22
07/01/2024 23:22:45;1704666165;25
07/01/2024 23:22:46;1704666166;22
07/01/2024 23:22:47;1704666167;26
07/01/2024 23:22:48;1704666168;24
07/01/2024 23:22:49;1704666169;23
07/01/2024 23:22:50;1704666170;23
07/01/2024 23:22:52;1704666172;43
07/01/2024 23:22:53;1704666173;23
07/01/2024 23:22:54;1704666174;24
07/01/2024 23:22:55;1704666175;26
07/01/2024 23:22:56;1704666176;22
07/01/2024 23:22:57;1704666177;22
07/01/2024 23:22:59;1704666179;42
07/01/2024 23:22:59;1704666179;22
07/01/2024 23:23:00;1704666180;22
07/01/2024 23:23:01;1704666181;22
07/01/2024 23:23:02;1704666182;23
07/01/2024 23:23:03;1704666183;24
07/01/2024 23:23:04;1704666184;21
07/01/2024 23:23:05;1704666185;22
07/01/2024 23:23:06;1704666186;21
07/01/2024 23:23:07;1704666187;24
07/01/2024 23:23:08;1704666188;23
07/01/2024 23:23:08;1704666188;22
07/01/2024 23:23:09;1704666189;23
07/01/2024 23:23:10;1704666190;24
07/01/2024 23:23:11;1704666191;23
07/01/2024 23:23:13;1704666193;36
07/01/2024 23:23:14;1704666194;23
07/01/2024 23:23:15;1704666195;24
07/01/2024 23:23:16;1704666196;27
07/01/2024 23:23:17;1704666197;22
07/01/2024 23:23:18;1704666198;21
07/01/2024 23:23:19;1704666199;22
07/01/2024 23:23:20;1704666200;26
07/01/2024 23:23:21;1704666201;24
07/01/2024 23:23:22;1704666202;21
07/01/2024 23:23:23;1704666203;25
07/01/2024 23:23:24;1704666204;24
07/01/2024 23:23:26;1704666206;23
07/01/2024 23:23:27;1704666207;22
07/01/2024 23:23:28;1704666208;23
07/01/2024 23:23:29;1704666209;24
07/01/2024 23:23:34;1704666214;300
07/01/2024 23:23:35;1704666215;23
07/01/2024 23:23:36;1704666216;23
07/01/2024 23:23:37;1704666217;22
07/01/2024 23:23:38;1704666218;21
07/01/2024 23:23:39;1704666219;22
07/01/2024 23:23:40;1704666220;25
07/01/2024 23:23:41;1704666221;25
07/01/2024 23:23:42;1704666222;23
07/01/2024 23:23:43;1704666223;22
07/01/2024 23:23:43;1704666223;22
07/01/2024 23:23:44;1704666224;24
07/01/2024 23:23:45;1704666225;21
07/01/2024 23:23:46;1704666226;30
07/01/2024 23:23:47;1704666227;23
07/01/2024 23:23:48;1704666228;23
07/01/2024 23:23:49;1704666229;21
07/01/2024 23:23:54;1704666234;300
07/01/2024 23:23:55;1704666235;24
07/01/2024 23:23:56;1704666236;29
07/01/2024 23:23:57;1704666237;22
07/01/2024 23:23:58;1704666238;28
07/01/2024 23:23:59;1704666239;22
07/01/2024 23:24:01;1704666241;24
07/01/2024 23:24:02;1704666242;22
07/01/2024 23:24:03;1704666243;23
07/01/2024 23:24:04;1704666244;24
07/01/2024 23:24:05;1704666245;22
07/01/2024 23:24:06;1704666246;23
07/01/2024 23:24:07;1704666247;21
07/01/2024 23:24:08;1704666248;21
07/01/2024 23:24:08;1704666248;21
07/01/2024 23:24:09;1704666249;23
07/01/2024 23:24:10;1704666250;22
07/01/2024 23:24:11;1704666251;25
07/01/2024 23:24:12;1704666252;24
07/01/2024 23:24:13;1704666253;27
07/01/2024 23:24:14;1704666254;23
