06/01/2024 01:34:02;1704501242;18116;13;3,548191
06/01/2024 01:34:03;1704501243;18162;1;9,484904
06/01/2024 01:34:04;1704501244;18208;1;9,484806
06/01/2024 01:34:04;1704501244;18253;1;7,484798
06/01/2024 01:34:05;1704501245;18296;1;10,9857
06/01/2024 01:34:06;1704501246;18341;1;9,984909
06/01/2024 01:34:06;1704501246;18386;1;7,985299
06/01/2024 01:34:07;1704501247;18430;1;11,985
06/01/2024 01:34:08;1704501248;18475;1;10,48511
06/01/2024 01:34:08;1704501248;18520;1;10,98511
06/01/2024 01:34:09;1704501249;18567;1;8,484205
06/01/2024 01:34:10;1704501250;18618;1;10,48301
06/01/2024 01:34:10;1704501250;18663;1;9,985003
06/01/2024 01:34:11;1704501251;18708;1;9,985104
06/01/2024 01:34:12;1704501252;18755;1;7,984203
06/01/2024 01:34:12;1704501252;18799;1;10,4855
06/01/2024 01:34:13;1704501253;18843;1;9,485402
06/01/2024 01:34:14;1704501254;18888;1;10,48471
06/01/2024 01:34:14;1704501254;18935;1;7,484403
06/01/2024 01:34:15;1704501255;18980;1;10,48521
06/01/2024 01:34:16;1704501256;19025;1;11,985
06/01/2024 01:34:16;1704501256;19070;1;9,985008
06/01/2024 01:34:17;1704501257;19117;1;8,9842
06/01/2024 01:34:17;1704501257;19161;1;8,985201
06/01/2024 01:34:18;1704501258;19208;1;10,48451
06/01/2024 01:34:19;1704501259;19256;1;11,4841
06/01/2024 01:34:19;1704501259;19302;1;10,48471
06/01/2024 01:34:20;1704501260;19349;1;11,9842
06/01/2024 01:34:21;1704501261;19392;1;10,9856
06/01/2024 01:34:21;1704501261;19437;1;6,484999
06/01/2024 01:34:22;1704501262;19481;1;9,485403
06/01/2024 01:34:23;1704501263;19524;1;11,4857
06/01/2024 01:34:23;1704501263;19569;1;10,9848
06/01/2024 01:34:24;1704501264;19613;1;10,9857
06/01/2024 01:34:25;1704501265;19659;1;10,9846
06/01/2024 01:34:25;1704501265;19702;1;11,4855
06/01/2024 01:34:26;1704501266;19747;1;10,98501
06/01/2024 01:34:27;1704501267;19793;1;10,9848
06/01/2024 01:34:27;1704501267;19837;1;7,485099
06/01/2024 01:34:28;1704501268;19886;1;8,4839
06/01/2024 01:34:29;1704501269;19935;1;11,9837
06/01/2024 01:34:29;1704501269;19980;1;8,984707
06/01/2024 01:34:30;1704501270;20024;1;10,4854
06/01/2024 01:34:31;1704501271;20069;1;9,985106
06/01/2024 01:34:31;1704501271;20117;1;9,983909
06/01/2024 01:34:32;1704501272;20162;1;9,985008
06/01/2024 01:34:33;1704501273;20209;1;9,484407
06/01/2024 01:34:33;1704501273;20258;1;6,483702
06/01/2024 01:34:34;1704501274;20304;1;11,4848
06/01/2024 01:34:34;1704501274;20350;1;11,9846
06/01/2024 01:34:35;1704501275;20392;1;8,485901
06/01/2024 01:34:36;1704501276;20442;1;8,9835
06/01/2024 01:34:36;1704501276;20487;1;6,484999
06/01/2024 01:34:37;1704501277;20529;1;9,485804
06/01/2024 01:34:38;1704501278;20573;1;11,9853
06/01/2024 01:34:38;1704501278;20618;1;8,485103
06/01/2024 01:34:39;1704501279;20665;1;8,4843
06/01/2024 01:34:40;1704501280;20711;1;9,984806
06/01/2024 01:34:40;1704501280;20754;1;11,4857
06/01/2024 01:34:41;1704501281;20799;1;10,485
06/01/2024 01:34:42;1704501282;20844;1;10,985
06/01/2024 01:34:42;1704501282;20890;1;9,484503
06/01/2024 01:34:43;1704501283;20934;1;9,985308
06/01/2024 01:34:44;1704501284;20979;1;9,985006
06/01/2024 01:34:44;1704501284;21023;1;7,985501
06/01/2024 01:34:45;1704501285;21065;1;10,486
06/01/2024 01:34:46;1704501286;21107;1;11,9859
06/01/2024 01:34:46;1704501286;21149;1;10,9859
06/01/2024 01:34:47;1704501287;21192;1;5,9857
06/01/2024 01:34:48;1704501288;21237;1;11,485
06/01/2024 01:34:48;1704501288;21282;1;10,985
06/01/2024 01:34:49;1704501289;21328;1;9,484705
06/01/2024 01:34:50;1704501290;21374;1;9,984709
06/01/2024 01:34:50;1704501290;21417;1;9,485605
06/01/2024 01:34:51;1704501291;21462;1;9,985005
06/01/2024 01:34:52;1704501292;21506;1;10,48551
06/01/2024 01:34:52;1704501292;21549;1;10,98561
06/01/2024 01:34:53;1704501293;21593;1;9,485306
06/01/2024 01:34:54;1704501294;21640;1;11,4845
06/01/2024 01:34:54;1704501294;21685;1;8,484905
06/01/2024 01:34:55;1704501295;21732;1;8,484301
06/01/2024 01:34:56;1704501296;21774;1;10,986
06/01/2024 01:34:56;1704501296;21820;1;9,98461
06/01/2024 01:34:57;1704501297;21868;1;11,984
06/01/2024 01:34:58;1704501298;21914;1;10,48481
06/01/2024 01:34:58;1704501298;21960;1;10,9847
06/01/2024 01:34:59;1704501299;22007;1;9,484202
06/01/2024 01:34:59;1704501299;22051;1;8,485202
06/01/2024 01:35:00;1704501300;22097;1;11,4849
06/01/2024 01:35:01;1704501301;22144;1;9,984204
06/01/2024 01:35:01;1704501301;22189;1;10,4851
06/01/2024 01:35:02;1704501302;22233;1;5,985398
06/01/2024 01:35:03;1704501303;22278;1;9,985006
06/01/2024 01:35:03;1704501303;22323;1;9,485003
06/01/2024 01:35:04;1704501304;22371;1;10,98391
06/01/2024 01:35:05;1704501305;22417;1;7,4847
06/01/2024 01:35:05;1704501305;22460;1;10,4856
06/01/2024 01:35:06;1704501306;22507;1;8,484204
06/01/2024 01:35:07;1704501307;22551;1;8,9855
06/01/2024 01:35:07;1704501307;22594;1;11,4858
