07/01/2024 21:57:27;1704661047;45700;0,6709096;0,07541592;Agent;Large;078eac21-609d-4a51-b915-1a6ed381d79e
07/01/2024 21:57:27;1704661047;45700;-0,6499726;-0,9296622;Agent;Large;952d760c-799c-476a-80e4-4c4a007d2e11
07/01/2024 21:57:27;1704661047;45727;-0,3571498;0,2503107;Agent;Medium;63139346-12e2-45cc-9605-1957eb1d514d
07/01/2024 21:57:27;1704661047;45727;-0,3571498;0,2503107;Agent;Medium;63139346-12e2-45cc-9605-1957eb1d514d
07/01/2024 21:57:27;1704661047;45727;-0,7065102;-0,9301002;Agent;Medium;6d76ad7d-c890-4f27-9c23-d49579907d81
07/01/2024 21:57:27;1704661047;45727;-0,7065102;-0,9301002;Agent;Medium;6d76ad7d-c890-4f27-9c23-d49579907d81
07/01/2024 21:57:27;1704661047;45727;-0,7065102;-0,9301002;Agent;Large;6d76ad7d-c890-4f27-9c23-d49579907d81
07/01/2024 21:57:27;1704661047;45727;-0,7065102;-0,9301002;Agent;Medium;6d76ad7d-c890-4f27-9c23-d49579907d81
07/01/2024 21:57:27;1704661047;45727;-0,7065102;-0,9301002;Agent;Medium;6d76ad7d-c890-4f27-9c23-d49579907d81
07/01/2024 21:57:27;1704661047;45727;-0,7065102;-0,9301002;Agent;Medium;6d76ad7d-c890-4f27-9c23-d49579907d81
07/01/2024 21:57:27;1704661047;45727;-0,7065102;-0,9301002;Agent;Large;6d76ad7d-c890-4f27-9c23-d49579907d81
07/01/2024 21:57:27;1704661047;45727;-0,07715306;-0,1080688;Agent;Medium;63139346-12e2-45cc-9605-1957eb1d514d
07/01/2024 21:57:27;1704661047;45727;-0,07715306;-0,1080688;Agent;Small;63139346-12e2-45cc-9605-1957eb1d514d
07/01/2024 21:57:27;1704661047;45727;-0,8411911;-0,5155943;Agent;Small;6d76ad7d-c890-4f27-9c23-d49579907d81
07/01/2024 21:57:27;1704661047;45727;-0,8411911;-0,5155943;Agent;Small;6d76ad7d-c890-4f27-9c23-d49579907d81
07/01/2024 21:57:27;1704661047;45727;-0,8411911;-0,5155943;Agent;Small;6d76ad7d-c890-4f27-9c23-d49579907d81
07/01/2024 21:57:29;1704661049;45804;-0,4461365;0,6545366;Agent;Large;64301679-485e-4684-a1b7-cd0d0f9398b9
07/01/2024 21:57:29;1704661049;45831;-2,004369;0,7192904;Wall;Small;133f1cfa-a499-440d-9534-79631548fcd9
07/01/2024 21:57:30;1704661050;45843;0,3255416;0,3193022;Agent;Large;f8ae5f70-e1ce-43d0-bd4c-f67b56ee9dc9
07/01/2024 21:57:30;1704661050;45843;0,3255416;0,3193022;Agent;Medium;f8ae5f70-e1ce-43d0-bd4c-f67b56ee9dc9
07/01/2024 21:57:30;1704661050;45843;-0,6291518;-0,576795;Agent;Large;71bb8a8f-d6ed-42ad-92e3-93a656d40704
07/01/2024 21:57:30;1704661050;45843;-0,6536797;-0,1087782;Agent;Medium;71bb8a8f-d6ed-42ad-92e3-93a656d40704
07/01/2024 21:57:32;1704661052;45963;0,5077535;0,6239994;Agent;Large;a319a10e-6749-4a1a-96e3-8b204919be98
07/01/2024 21:57:32;1704661052;45963;-0,7960282;-0,4547082;Agent;Large;c264c1e8-a6a1-4009-9cec-8caa449a37cb
07/01/2024 21:57:32;1704661052;45963;-0,7495777;-0,01276326;Agent;Large;c264c1e8-a6a1-4009-9cec-8caa449a37cb
07/01/2024 21:57:33;1704661053;46000;0,4376465;0,5027342;Agent;Large;ca3c766d-59bd-4deb-85fd-a1655ccf91c8
07/01/2024 21:57:33;1704661053;46000;-0,6674672;-0,4481933;Agent;Large;b2a04780-0265-42b5-87be-cc7a707007ed
07/01/2024 21:57:33;1704661053;46000;-0,6674672;-0,4481933;Agent;Large;b2a04780-0265-42b5-87be-cc7a707007ed
07/01/2024 21:57:33;1704661053;46001;-0,6092052;0,02631407;Agent;Large;b2a04780-0265-42b5-87be-cc7a707007ed
07/01/2024 21:57:33;1704661053;46001;-0,6092052;0,02631407;Agent;Medium;b2a04780-0265-42b5-87be-cc7a707007ed
07/01/2024 21:57:35;1704661055;46108;0,6725668;0,6803582;Agent;Large;9ab305c0-be9b-47e6-ab9c-ba4bf7d8dd1a
07/01/2024 21:57:35;1704661055;46108;0,6725668;0,6803582;Agent;Medium;9ab305c0-be9b-47e6-ab9c-ba4bf7d8dd1a
07/01/2024 21:57:35;1704661055;46108;-0,4809042;0,1626345;Agent;Medium;a6184c61-e12d-4d8e-90d8-cbdf4655faf4
07/01/2024 21:57:35;1704661055;46108;-0,4809042;0,1626345;Agent;Medium;a6184c61-e12d-4d8e-90d8-cbdf4655faf4
07/01/2024 21:57:35;1704661055;46108;0,6579612;0,2621171;Agent;Medium;9ab305c0-be9b-47e6-ab9c-ba4bf7d8dd1a
07/01/2024 21:57:35;1704661055;46108;-0,4640206;0,4040843;Agent;Medium;a6184c61-e12d-4d8e-90d8-cbdf4655faf4
07/01/2024 21:57:36;1704661056;46197;-2,094267;0,7987255;Wall;Small;dfdf8982-a6e8-4408-b706-9e1a335e4f02
07/01/2024 21:57:37;1704661057;46222;0,404688;0,07049204;Agent;Large;edf04437-a0ba-4da5-946e-b5c8af402a9c
07/01/2024 21:57:37;1704661057;46222;-1,059516;-0,6666356;Agent;Large;ad33349d-f731-4bb9-af99-fe750b4fbc97
07/01/2024 21:57:37;1704661057;46234;-0,4424538;-0,694128;Agent;Large;51b3ebe5-857d-4a59-9d35-81cc713afc68
07/01/2024 21:57:40;1704661060;46380;-0,2736946;1,244477;Agent;Large;ceb0cbc5-8dba-46f5-8521-a7dd63b7baec
07/01/2024 21:57:40;1704661060;46380;-0,2736946;1,244477;Agent;Large;ceb0cbc5-8dba-46f5-8521-a7dd63b7baec
07/01/2024 21:57:40;1704661060;46380;-0,8475625;-0,3463506;Agent;Large;82370f16-9596-4596-9229-6e4ef664be91
07/01/2024 21:57:40;1704661060;46380;-0,1851723;0,8280118;Agent;Medium;ceb0cbc5-8dba-46f5-8521-a7dd63b7baec
07/01/2024 21:57:40;1704661060;46380;-0,1851723;0,8280118;Agent;Medium;ceb0cbc5-8dba-46f5-8521-a7dd63b7baec
07/01/2024 21:57:40;1704661060;46380;-0,9286028;0,1132504;Agent;Medium;82370f16-9596-4596-9229-6e4ef664be91
07/01/2024 21:57:40;1704661060;46380;-0,9286028;0,1132504;Agent;Medium;82370f16-9596-4596-9229-6e4ef664be91
07/01/2024 21:57:40;1704661060;46380;-0,9286028;0,1132504;Agent;Medium;82370f16-9596-4596-9229-6e4ef664be91
07/01/2024 21:57:41;1704661061;46438;0,8339753;-0,01830634;Agent;Large;3d4faa96-8e70-4c62-8001-263946fc52dc
07/01/2024 21:57:41;1704661061;46451;-0,4760482;-0,6134502;Agent;Large;43b4d68c-3407-4ec5-96cd-612fef0c3bd3
07/01/2024 21:57:43;1704661063;46575;0,9703083;1,11104;Agent;Large;8ca1cd4c-6880-4dbd-9d6f-ba93c7c8e602
07/01/2024 21:57:43;1704661063;46575;-0,3486546;0,4577444;Agent;Large;1b1c5ea0-8bed-4b7a-a30c-9533c5d0df65
07/01/2024 21:57:44;1704661064;46603;0,4587429;-0,05397579;Agent;Large;c9322239-bd54-4f8b-9221-5d5717ab8c25
07/01/2024 21:57:44;1704661064;46603;-1,034811;-0,7975585;Agent;Large;a3323620-916d-4d58-8446-c6f04112fdc6
07/01/2024 21:57:44;1704661064;46604;-0,8883299;-0,3951047;Agent;Large;a3323620-916d-4d58-8446-c6f04112fdc6
07/01/2024 21:57:44;1704661064;46616;0,8978957;-0,4516505;Agent;Large;7b4b39ad-df5b-4534-849f-031a493c9c4d
07/01/2024 21:57:44;1704661064;46616;0,8978957;-0,4516505;Agent;Large;7b4b39ad-df5b-4534-849f-031a493c9c4d
07/01/2024 21:57:44;1704661064;46616;-0,426147;-0,9608792;Agent;Large;9554f2bb-da7c-4aa8-b558-e66d3917bcd0
07/01/2024 21:57:44;1704661064;46631;0,7798465;0,7647923;Agent;Large;e153a274-3414-4d26-af28-bc14f95a7071
07/01/2024 21:57:44;1704661064;46631;0,7798465;0,7647923;Agent;Large;e153a274-3414-4d26-af28-bc14f95a7071
07/01/2024 21:57:44;1704661064;46631;-0,3968622;-0,1172398;Agent;Large;dbef6e9b-5cfe-4bd0-b862-7a72695c255f
07/01/2024 21:57:44;1704661064;46631;-0,3968622;-0,1172398;Agent;Large;dbef6e9b-5cfe-4bd0-b862-7a72695c255f
07/01/2024 21:57:44;1704661064;46632;-0,3886095;0,355559;Agent;Medium;dbef6e9b-5cfe-4bd0-b862-7a72695c255f
07/01/2024 21:57:45;1704661065;46657;0,623469;-0,202502;Agent;Large;cc829652-3c11-4fd1-ae6b-d456ba9b06b9
07/01/2024 21:57:45;1704661065;46682;0,7169196;0,3669018;Agent;Large;2c9dbeb2-08a4-4a49-bdf1-dd6984fa8560
07/01/2024 21:57:45;1704661065;46682;0,7169196;0,3669018;Agent;Large;2c9dbeb2-08a4-4a49-bdf1-dd6984fa8560
07/01/2024 21:57:46;1704661066;46747;-0,7535346;-0,5880156;Agent;Large;0cdf66d4-3038-4e42-98c9-e038011ed42e
07/01/2024 21:57:46;1704661066;46748;0,5479556;-0,09849846;Agent;Large;588f1ebe-58fe-4ac5-8f73-5fb5a436260d
07/01/2024 21:57:46;1704661066;46748;0,5479556;-0,09849846;Agent;Medium;588f1ebe-58fe-4ac5-8f73-5fb5a436260d
07/01/2024 21:57:47;1704661067;46796;0,8207254;-0,2282697;Agent;Large;42e803d3-04db-4499-843b-aa6a1a1be8cb
