07/01/2024 23:18:49;1704665929;16709;-1,16;7,47;Wall;Small;3f6c2ab6-80fd-4705-8830-d65c6d222e21
07/01/2024 23:18:49;1704665929;16709;-1,16;7,47;Wall;Small;3f6c2ab6-80fd-4705-8830-d65c6d222e21
07/01/2024 23:18:49;1704665929;16709;-1,16;7,47;Wall;Small;3f6c2ab6-80fd-4705-8830-d65c6d222e21
07/01/2024 23:18:49;1704665929;16709;-1,16;7,47;Wall;Small;3f6c2ab6-80fd-4705-8830-d65c6d222e21
07/01/2024 23:18:49;1704665929;16709;-1,16;7,47;Wall;Small;3f6c2ab6-80fd-4705-8830-d65c6d222e21
07/01/2024 23:18:49;1704665929;16709;-1,16;7,47;Wall;Small;3f6c2ab6-80fd-4705-8830-d65c6d222e21
07/01/2024 23:18:49;1704665929;16709;-1,16;7,47;Wall;Small;3f6c2ab6-80fd-4705-8830-d65c6d222e21
07/01/2024 23:18:49;1704665929;16709;-1,16;7,47;Wall;Small;3f6c2ab6-80fd-4705-8830-d65c6d222e21
07/01/2024 23:18:49;1704665929;16709;-1,15;5,35;Wall;Small;722e99f9-89e8-4b27-9ef6-48bd4cb58fdc
07/01/2024 23:18:49;1704665929;16709;-1,15;5,35;Wall;Small;722e99f9-89e8-4b27-9ef6-48bd4cb58fdc
07/01/2024 23:18:49;1704665929;16709;-3,36;-1,84;Wall;Small;04fdba8d-3dcc-4886-af2a-20cb0647dba4
07/01/2024 23:18:49;1704665929;16709;-3,36;-1,84;Wall;Small;04fdba8d-3dcc-4886-af2a-20cb0647dba4
07/01/2024 23:18:49;1704665929;16709;-3,36;-1,84;Wall;Small;04fdba8d-3dcc-4886-af2a-20cb0647dba4
07/01/2024 23:18:49;1704665929;16709;-3,36;-1,84;Wall;Small;04fdba8d-3dcc-4886-af2a-20cb0647dba4
07/01/2024 23:18:49;1704665929;16709;-3,36;-1,84;Wall;Small;04fdba8d-3dcc-4886-af2a-20cb0647dba4
07/01/2024 23:18:49;1704665929;16709;-3,36;-1,84;Wall;Small;04fdba8d-3dcc-4886-af2a-20cb0647dba4
07/01/2024 23:18:49;1704665929;16709;-3,36;-1,84;Wall;Small;04fdba8d-3dcc-4886-af2a-20cb0647dba4
07/01/2024 23:18:49;1704665929;16722;3,152305;-1,880067;Wall;Small;a94cc7bf-b6b0-40e9-8bf0-3f79e0f83803
07/01/2024 23:18:49;1704665929;16722;3,152305;-1,880067;Wall;Small;a94cc7bf-b6b0-40e9-8bf0-3f79e0f83803
07/01/2024 23:18:50;1704665930;16765;2,358972;-1,850045;Wall;Small;57986133-1d34-48e6-8b75-68583133b898
07/01/2024 23:18:50;1704665930;16765;2,358972;-1,850045;Wall;Small;57986133-1d34-48e6-8b75-68583133b898
07/01/2024 23:18:50;1704665930;16765;2,787296;-2,014462;Wall;Small;57986133-1d34-48e6-8b75-68583133b898
07/01/2024 23:18:50;1704665930;16765;2,787296;-2,014462;Wall;Small;57986133-1d34-48e6-8b75-68583133b898
07/01/2024 23:18:50;1704665930;16765;2,787296;-2,014462;Wall;Small;57986133-1d34-48e6-8b75-68583133b898
07/01/2024 23:18:50;1704665930;16765;2,787296;-2,014462;Wall;Small;57986133-1d34-48e6-8b75-68583133b898
07/01/2024 23:18:50;1704665930;16765;2,787296;-2,014462;Wall;Small;57986133-1d34-48e6-8b75-68583133b898
07/01/2024 23:18:50;1704665930;16783;5,22733;7,09324;Wall;Small;57986133-1d34-48e6-8b75-68583133b898
07/01/2024 23:18:50;1704665930;16783;5,22733;7,09324;Wall;Small;57986133-1d34-48e6-8b75-68583133b898
07/01/2024 23:18:51;1704665931;16816;7,118573;-7,561495;Wall;Small;6a224d8b-4d4f-4134-b7b4-346af1043bce
07/01/2024 23:18:51;1704665931;16817;7,704761;-6,136441;Wall;Small;6a224d8b-4d4f-4134-b7b4-346af1043bce
07/01/2024 23:18:51;1704665931;16817;7,704761;-6,136441;Wall;Small;6a224d8b-4d4f-4134-b7b4-346af1043bce
07/01/2024 23:18:51;1704665931;16817;7,704761;-6,136441;Wall;Small;6a224d8b-4d4f-4134-b7b4-346af1043bce
07/01/2024 23:18:51;1704665931;16818;7,645022;-5,7114;Wall;Small;6a224d8b-4d4f-4134-b7b4-346af1043bce
07/01/2024 23:18:51;1704665931;16818;7,645022;-5,7114;Wall;Small;6a224d8b-4d4f-4134-b7b4-346af1043bce
07/01/2024 23:18:51;1704665931;16818;7,645022;-5,7114;Wall;Small;6a224d8b-4d4f-4134-b7b4-346af1043bce
07/01/2024 23:18:51;1704665931;16818;7,645022;-5,7114;Wall;Small;6a224d8b-4d4f-4134-b7b4-346af1043bce
07/01/2024 23:18:51;1704665931;16829;5,506521;7,221122;Wall;Small;6a224d8b-4d4f-4134-b7b4-346af1043bce
07/01/2024 23:18:51;1704665931;16829;5,506521;7,221122;Wall;Small;6a224d8b-4d4f-4134-b7b4-346af1043bce
07/01/2024 23:18:51;1704665931;16829;5,506521;7,221122;Wall;Small;6a224d8b-4d4f-4134-b7b4-346af1043bce
07/01/2024 23:18:51;1704665931;16829;5,506521;7,221122;Wall;Small;6a224d8b-4d4f-4134-b7b4-346af1043bce
07/01/2024 23:18:51;1704665931;16839;-7,429125;2,235416;Wall;Small;6a224d8b-4d4f-4134-b7b4-346af1043bce
07/01/2024 23:18:51;1704665931;16839;-7,429125;2,235416;Wall;Small;6a224d8b-4d4f-4134-b7b4-346af1043bce
07/01/2024 23:18:51;1704665931;16839;-7,429125;2,235416;Wall;Small;6a224d8b-4d4f-4134-b7b4-346af1043bce
07/01/2024 23:18:51;1704665931;16856;3,781043;-2,014328;Wall;Small;b4122235-1504-4e74-ab99-554a1e21aae7
07/01/2024 23:18:52;1704665932;16871;7,658154;6,717243;Wall;Small;b4122235-1504-4e74-ab99-554a1e21aae7
07/01/2024 23:18:52;1704665932;16871;7,658154;6,717243;Wall;Small;b4122235-1504-4e74-ab99-554a1e21aae7
07/01/2024 23:18:52;1704665932;16871;7,658154;6,717243;Wall;Small;b4122235-1504-4e74-ab99-554a1e21aae7
07/01/2024 23:18:52;1704665932;16883;-7,671436;2,516176;Wall;Small;b4122235-1504-4e74-ab99-554a1e21aae7
07/01/2024 23:18:52;1704665932;16883;-7,671436;2,516176;Wall;Small;b4122235-1504-4e74-ab99-554a1e21aae7
07/01/2024 23:18:53;1704665933;16927;-6,253386;1,192978;Wall;Small;1449eb50-b5b2-4095-ab0b-5a2fc1383758
07/01/2024 23:18:53;1704665933;16927;-6,253386;1,192978;Wall;Small;1449eb50-b5b2-4095-ab0b-5a2fc1383758
07/01/2024 23:18:53;1704665933;16927;-6,253386;1,192978;Wall;Small;1449eb50-b5b2-4095-ab0b-5a2fc1383758
07/01/2024 23:18:53;1704665933;16927;-6,705041;1,216647;Wall;Small;1449eb50-b5b2-4095-ab0b-5a2fc1383758
07/01/2024 23:18:53;1704665933;16963;7,724292;6,666263;Wall;Small;1e0ee51e-c467-4d83-8080-c0d242ab77d5
07/01/2024 23:18:53;1704665933;16963;7,724292;6,666263;Wall;Small;1e0ee51e-c467-4d83-8080-c0d242ab77d5
07/01/2024 23:18:53;1704665933;16976;-7,292823;2,016595;Wall;Small;1e0ee51e-c467-4d83-8080-c0d242ab77d5
07/01/2024 23:18:53;1704665933;16976;-7,292823;2,016595;Wall;Small;1e0ee51e-c467-4d83-8080-c0d242ab77d5
07/01/2024 23:18:53;1704665933;16977;-7,530431;2,368865;Wall;Small;1e0ee51e-c467-4d83-8080-c0d242ab77d5
07/01/2024 23:18:53;1704665933;16977;-7,530431;2,368865;Wall;Small;1e0ee51e-c467-4d83-8080-c0d242ab77d5
07/01/2024 23:18:54;1704665934;16994;3,642897;-2,100458;Wall;Small;51096b95-c841-4bdc-93c4-992d4e4cb59d
07/01/2024 23:18:54;1704665934;16994;3,642897;-2,100458;Wall;Small;51096b95-c841-4bdc-93c4-992d4e4cb59d
07/01/2024 23:18:54;1704665934;16994;3,894489;-2,459766;Wall;Small;51096b95-c841-4bdc-93c4-992d4e4cb59d
07/01/2024 23:18:54;1704665934;16994;3,894489;-2,459766;Wall;Small;51096b95-c841-4bdc-93c4-992d4e4cb59d
07/01/2024 23:18:54;1704665934;16999;7,098562;-7,607459;Wall;Small;51096b95-c841-4bdc-93c4-992d4e4cb59d
07/01/2024 23:18:54;1704665934;17011;5,552986;7,168558;Wall;Small;51096b95-c841-4bdc-93c4-992d4e4cb59d
07/01/2024 23:18:54;1704665934;17011;5,552986;7,168558;Wall;Small;51096b95-c841-4bdc-93c4-992d4e4cb59d
07/01/2024 23:18:54;1704665934;17011;5,552986;7,168558;Wall;Small;51096b95-c841-4bdc-93c4-992d4e4cb59d
07/01/2024 23:18:54;1704665934;17011;5,552986;7,168558;Wall;Small;51096b95-c841-4bdc-93c4-992d4e4cb59d
07/01/2024 23:18:54;1704665934;17012;5,173113;6,949239;Wall;Small;51096b95-c841-4bdc-93c4-992d4e4cb59d
07/01/2024 23:18:54;1704665934;17012;5,173113;6,949239;Wall;Small;51096b95-c841-4bdc-93c4-992d4e4cb59d
07/01/2024 23:18:54;1704665934;17012;5,173113;6,949239;Wall;Small;51096b95-c841-4bdc-93c4-992d4e4cb59d
07/01/2024 23:18:54;1704665934;17039;2,488986;-1,903893;Wall;Small;9cb9dfb5-f407-462a-9606-2a9b534ce8b6
07/01/2024 23:18:54;1704665934;17039;2,488986;-1,903893;Wall;Small;9cb9dfb5-f407-462a-9606-2a9b534ce8b6
07/01/2024 23:18:54;1704665934;17039;2,488986;-1,903893;Wall;Small;9cb9dfb5-f407-462a-9606-2a9b534ce8b6
07/01/2024 23:18:54;1704665934;17039;2,488986;-1,903893;Wall;Small;9cb9dfb5-f407-462a-9606-2a9b534ce8b6
07/01/2024 23:18:54;1704665934;17039;2,927213;-1,888591;Wall;Small;9cb9dfb5-f407-462a-9606-2a9b534ce8b6
07/01/2024 23:18:54;1704665934;17039;2,927213;-1,888591;Wall;Small;9cb9dfb5-f407-462a-9606-2a9b534ce8b6
07/01/2024 23:18:54;1704665934;17040;3,754424;-2,14941;Wall;Small;9cb9dfb5-f407-462a-9606-2a9b534ce8b6
07/01/2024 23:18:55;1704665935;17078;-7,162595;-1,893738;Wall;Small;24eb19fb-e475-4373-865c-0e3c65cf9163
07/01/2024 23:18:55;1704665935;17090;5,526732;-6,973867;Wall;Small;24eb19fb-e475-4373-865c-0e3c65cf9163
07/01/2024 23:18:55;1704665935;17115;-7,234032;1,921836;Wall;Small;24eb19fb-e475-4373-865c-0e3c65cf9163
07/01/2024 23:18:55;1704665935;17115;-7,479336;2,272168;Wall;Small;24eb19fb-e475-4373-865c-0e3c65cf9163
07/01/2024 23:18:55;1704665935;17115;-7,479336;2,272168;Wall;Small;24eb19fb-e475-4373-865c-0e3c65cf9163
07/01/2024 23:18:55;1704665935;17115;-7,625613;2,674056;Wall;Small;24eb19fb-e475-4373-865c-0e3c65cf9163
07/01/2024 23:18:55;1704665935;17115;-7,625613;2,674056;Wall;Small;24eb19fb-e475-4373-865c-0e3c65cf9163
07/01/2024 23:18:56;1704665936;17132;3,758982;-2,09946;Wall;Small;af1204e5-7ba3-4768-9145-d264b7ecfba5
07/01/2024 23:18:56;1704665936;17136;5,702936;-7,255099;Wall;Small;af1204e5-7ba3-4768-9145-d264b7ecfba5
07/01/2024 23:18:56;1704665936;17136;5,702936;-7,255099;Wall;Small;af1204e5-7ba3-4768-9145-d264b7ecfba5
07/01/2024 23:18:56;1704665936;17174;0,5983913;-1,915822;Wall;Small;1a68168a-b6b9-4c25-88d7-bcac71fa651f
07/01/2024 23:18:56;1704665936;17174;0,5983913;-1,915822;Wall;Small;1a68168a-b6b9-4c25-88d7-bcac71fa651f
07/01/2024 23:18:56;1704665936;17174;0,5983913;-1,915822;Wall;Small;1a68168a-b6b9-4c25-88d7-bcac71fa651f
07/01/2024 23:18:56;1704665936;17174;0,5983913;-1,915822;Wall;Small;1a68168a-b6b9-4c25-88d7-bcac71fa651f
07/01/2024 23:18:56;1704665936;17174;0,5983913;-1,915822;Wall;Small;1a68168a-b6b9-4c25-88d7-bcac71fa651f
07/01/2024 23:18:56;1704665936;17175;1,031689;-2,000046;Wall;Small;1a68168a-b6b9-4c25-88d7-bcac71fa651f
07/01/2024 23:18:56;1704665936;17175;1,031689;-2,000046;Wall;Small;1a68168a-b6b9-4c25-88d7-bcac71fa651f
07/01/2024 23:18:56;1704665936;17175;1,031689;-2,000046;Wall;Small;1a68168a-b6b9-4c25-88d7-bcac71fa651f
07/01/2024 23:18:56;1704665936;17175;1,031689;-2,000046;Wall;Small;1a68168a-b6b9-4c25-88d7-bcac71fa651f
07/01/2024 23:18:56;1704665936;17175;1,031689;-2,000046;Wall;Small;1a68168a-b6b9-4c25-88d7-bcac71fa651f
07/01/2024 23:18:56;1704665936;17175;1,466391;-1,923396;Wall;Small;1a68168a-b6b9-4c25-88d7-bcac71fa651f
07/01/2024 23:18:56;1704665936;17175;1,466391;-1,923396;Wall;Small;1a68168a-b6b9-4c25-88d7-bcac71fa651f
07/01/2024 23:18:56;1704665936;17177;3,886108;-2,039657;Wall;Small;1a68168a-b6b9-4c25-88d7-bcac71fa651f
07/01/2024 23:18:56;1704665936;17177;4,072654;-2,439707;Wall;Small;1a68168a-b6b9-4c25-88d7-bcac71fa651f
07/01/2024 23:18:57;1704665937;17193;7,673456;6,888549;Wall;Small;1a68168a-b6b9-4c25-88d7-bcac71fa651f
07/01/2024 23:18:57;1704665937;17214;-7,12515;-1,933879;Wall;Small;11f5784a-d62b-44b1-a8a8-ceccb71c2a62
07/01/2024 23:18:57;1704665937;17214;-7,12515;-1,933879;Wall;Small;11f5784a-d62b-44b1-a8a8-ceccb71c2a62
07/01/2024 23:18:58;1704665938;17270;7,050461;-7,634604;Wall;Small;9a34485e-6ab4-4973-84c2-8c4d5eb4aa27
07/01/2024 23:18:58;1704665938;17283;6,175032;7,450167;Wall;Small;9a34485e-6ab4-4973-84c2-8c4d5eb4aa27
07/01/2024 23:18:58;1704665938;17283;6,175032;7,450167;Wall;Small;9a34485e-6ab4-4973-84c2-8c4d5eb4aa27
07/01/2024 23:18:58;1704665938;17283;5,816131;7,189406;Wall;Small;9a34485e-6ab4-4973-84c2-8c4d5eb4aa27
07/01/2024 23:18:58;1704665938;17283;5,816131;7,189406;Wall;Small;9a34485e-6ab4-4973-84c2-8c4d5eb4aa27
07/01/2024 23:18:58;1704665938;17283;5,816131;7,189406;Wall;Small;9a34485e-6ab4-4973-84c2-8c4d5eb4aa27
07/01/2024 23:18:58;1704665938;17283;5,816131;7,189406;Wall;Small;9a34485e-6ab4-4973-84c2-8c4d5eb4aa27
07/01/2024 23:18:58;1704665938;17283;5,816131;7,189406;Wall;Small;9a34485e-6ab4-4973-84c2-8c4d5eb4aa27
07/01/2024 23:18:58;1704665938;17283;5,380654;7,104756;Wall;Small;9a34485e-6ab4-4973-84c2-8c4d5eb4aa27
07/01/2024 23:18:58;1704665938;17283;5,380654;7,104756;Wall;Small;9a34485e-6ab4-4973-84c2-8c4d5eb4aa27
07/01/2024 23:18:59;1704665939;17337;-6,854263;1,167623;Wall;Small;d32eaa0f-ccfb-4490-983c-e50b33b7db3b
07/01/2024 23:18:59;1704665939;17337;-6,854263;1,167623;Wall;Small;d32eaa0f-ccfb-4490-983c-e50b33b7db3b
07/01/2024 23:18:59;1704665939;17337;-7,304195;1,206987;Wall;Small;d32eaa0f-ccfb-4490-983c-e50b33b7db3b
07/01/2024 23:18:59;1704665939;17359;7,509307;-7,396165;Wall;Small;df9feaea-04f5-45ad-a6f5-2d890d05b49a
07/01/2024 23:18:59;1704665939;17368;7,674801;6,786278;Wall;Small;df9feaea-04f5-45ad-a6f5-2d890d05b49a
07/01/2024 23:18:59;1704665939;17368;7,674801;6,786278;Wall;Small;df9feaea-04f5-45ad-a6f5-2d890d05b49a
07/01/2024 23:19:00;1704665940;17379;-7,579021;2,221747;Wall;Small;df9feaea-04f5-45ad-a6f5-2d890d05b49a
07/01/2024 23:19:00;1704665940;17379;-7,579021;2,221747;Wall;Small;df9feaea-04f5-45ad-a6f5-2d890d05b49a
07/01/2024 23:19:01;1704665941;17448;6,797282;-7,603704;Wall;Small;c329c5b9-debb-47bc-8cc9-692cbdcb90d4
07/01/2024 23:19:01;1704665941;17448;6,797282;-7,603704;Wall;Small;c329c5b9-debb-47bc-8cc9-692cbdcb90d4
07/01/2024 23:19:01;1704665941;17448;6,797282;-7,603704;Wall;Small;c329c5b9-debb-47bc-8cc9-692cbdcb90d4
07/01/2024 23:19:01;1704665941;17459;7,658745;6,921659;Wall;Small;c329c5b9-debb-47bc-8cc9-692cbdcb90d4
07/01/2024 23:19:01;1704665941;17459;7,658745;6,921659;Wall;Small;c329c5b9-debb-47bc-8cc9-692cbdcb90d4
07/01/2024 23:19:01;1704665941;17461;5,692078;7,390774;Wall;Small;c329c5b9-debb-47bc-8cc9-692cbdcb90d4
07/01/2024 23:19:01;1704665941;17461;5,692078;7,390774;Wall;Small;c329c5b9-debb-47bc-8cc9-692cbdcb90d4
07/01/2024 23:19:01;1704665941;17472;-7,344939;2,025919;Wall;Small;c329c5b9-debb-47bc-8cc9-692cbdcb90d4
07/01/2024 23:19:01;1704665941;17472;-7,344939;2,025919;Wall;Small;c329c5b9-debb-47bc-8cc9-692cbdcb90d4
07/01/2024 23:19:01;1704665941;17472;-7,599205;2,351361;Wall;Small;c329c5b9-debb-47bc-8cc9-692cbdcb90d4
07/01/2024 23:19:01;1704665941;17489;3,868503;-2,212245;Wall;Small;c4cbc852-694b-462c-925d-6935fb9286ef
07/01/2024 23:19:01;1704665941;17489;3,868503;-2,212245;Wall;Small;c4cbc852-694b-462c-925d-6935fb9286ef
07/01/2024 23:19:01;1704665941;17494;7,21743;-7,544687;Wall;Small;c4cbc852-694b-462c-925d-6935fb9286ef
07/01/2024 23:19:02;1704665942;17531;0,6974559;-1,851404;Wall;Small;ac4ad7ed-9063-4d13-ad2a-a270ff87e92d
07/01/2024 23:19:02;1704665942;17531;0,6974559;-1,851404;Wall;Small;ac4ad7ed-9063-4d13-ad2a-a270ff87e92d
07/01/2024 23:19:02;1704665942;17537;5,577722;-7,281489;Wall;Small;ac4ad7ed-9063-4d13-ad2a-a270ff87e92d
07/01/2024 23:19:02;1704665942;17561;-7,469211;2,215283;Wall;Small;ac4ad7ed-9063-4d13-ad2a-a270ff87e92d
07/01/2024 23:19:02;1704665942;17561;-7,469211;2,215283;Wall;Small;ac4ad7ed-9063-4d13-ad2a-a270ff87e92d
07/01/2024 23:19:02;1704665942;17561;-7,652281;2,626458;Wall;Small;ac4ad7ed-9063-4d13-ad2a-a270ff87e92d
07/01/2024 23:19:03;1704665943;17593;7,679996;5,944352;Wall;Small;0559c3db-7da3-4377-8f16-412d2291e20f
07/01/2024 23:19:03;1704665943;17593;7,679996;5,944352;Wall;Small;0559c3db-7da3-4377-8f16-412d2291e20f
07/01/2024 23:19:03;1704665943;17593;7,679996;5,944352;Wall;Small;0559c3db-7da3-4377-8f16-412d2291e20f
07/01/2024 23:19:03;1704665943;17593;7,687856;6,394491;Wall;Small;0559c3db-7da3-4377-8f16-412d2291e20f
07/01/2024 23:19:03;1704665943;17593;7,687856;6,394491;Wall;Small;0559c3db-7da3-4377-8f16-412d2291e20f
07/01/2024 23:19:03;1704665943;17624;3,857292;-2,080353;Wall;Small;2c6acbc2-cd2f-4050-ace3-34fc46ab16e8
07/01/2024 23:19:04;1704665944;17630;7,492863;-7,368467;Wall;Small;2c6acbc2-cd2f-4050-ace3-34fc46ab16e8
07/01/2024 23:19:04;1704665944;17653;-7,454364;2,223333;Wall;Small;2c6acbc2-cd2f-4050-ace3-34fc46ab16e8
07/01/2024 23:19:04;1704665944;17653;-7,454364;2,223333;Wall;Small;2c6acbc2-cd2f-4050-ace3-34fc46ab16e8
07/01/2024 23:19:04;1704665944;17653;-7,454364;2,223333;Wall;Small;2c6acbc2-cd2f-4050-ace3-34fc46ab16e8
07/01/2024 23:19:04;1704665944;17654;-7,650423;2,592068;Wall;Small;2c6acbc2-cd2f-4050-ace3-34fc46ab16e8
07/01/2024 23:19:05;1704665945;17711;-1,252043;-1,887336;Wall;Small;aee8c389-c948-4e9d-a011-f0574647bb4a
07/01/2024 23:19:05;1704665945;17711;-1,252043;-1,887336;Wall;Small;aee8c389-c948-4e9d-a011-f0574647bb4a
07/01/2024 23:19:05;1704665945;17711;-1,252043;-1,887336;Wall;Small;aee8c389-c948-4e9d-a011-f0574647bb4a
07/01/2024 23:19:05;1704665945;17711;-1,252043;-1,887336;Wall;Small;aee8c389-c948-4e9d-a011-f0574647bb4a
07/01/2024 23:19:05;1704665945;17711;-0,8218042;-1,864788;Wall;Small;aee8c389-c948-4e9d-a011-f0574647bb4a
07/01/2024 23:19:05;1704665945;17711;-0,8218042;-1,864788;Wall;Small;aee8c389-c948-4e9d-a011-f0574647bb4a
07/01/2024 23:19:05;1704665945;17712;-0,3915653;-1,842239;Wall;Small;aee8c389-c948-4e9d-a011-f0574647bb4a
07/01/2024 23:19:05;1704665945;17712;-0,3915653;-1,842239;Wall;Small;aee8c389-c948-4e9d-a011-f0574647bb4a
07/01/2024 23:19:05;1704665945;17715;3,967457;-2,339471;Wall;Small;aee8c389-c948-4e9d-a011-f0574647bb4a
07/01/2024 23:19:05;1704665945;17715;3,967457;-2,339471;Wall;Small;aee8c389-c948-4e9d-a011-f0574647bb4a
07/01/2024 23:19:05;1704665945;17730;7,714089;6,129094;Wall;Small;aee8c389-c948-4e9d-a011-f0574647bb4a
07/01/2024 23:19:05;1704665945;17730;7,714089;6,129094;Wall;Small;aee8c389-c948-4e9d-a011-f0574647bb4a
07/01/2024 23:19:05;1704665945;17730;7,714089;6,129094;Wall;Small;aee8c389-c948-4e9d-a011-f0574647bb4a
07/01/2024 23:19:05;1704665945;17731;7,736634;6,559335;Wall;Small;aee8c389-c948-4e9d-a011-f0574647bb4a
07/01/2024 23:19:05;1704665945;17743;-7,285206;1,965764;Wall;Small;aee8c389-c948-4e9d-a011-f0574647bb4a
07/01/2024 23:19:05;1704665945;17743;-7,460437;2,359347;Wall;Small;aee8c389-c948-4e9d-a011-f0574647bb4a
07/01/2024 23:19:05;1704665945;17743;-7,460437;2,359347;Wall;Small;aee8c389-c948-4e9d-a011-f0574647bb4a
07/01/2024 23:19:05;1704665945;17743;-7,460437;2,359347;Wall;Small;aee8c389-c948-4e9d-a011-f0574647bb4a
07/01/2024 23:19:05;1704665945;17744;-7,6493;2,746572;Wall;Small;aee8c389-c948-4e9d-a011-f0574647bb4a
07/01/2024 23:19:05;1704665945;17755;-4,479637;-1,844071;Wall;Small;cdc7109b-7692-410d-916e-2601d64635c4
07/01/2024 23:19:05;1704665945;17755;-4,479637;-1,844071;Wall;Small;cdc7109b-7692-410d-916e-2601d64635c4
07/01/2024 23:19:05;1704665945;17755;-4,040319;-1,859412;Wall;Small;cdc7109b-7692-410d-916e-2601d64635c4
07/01/2024 23:19:05;1704665945;17755;-4,040319;-1,859412;Wall;Small;cdc7109b-7692-410d-916e-2601d64635c4
07/01/2024 23:19:06;1704665946;17789;-7,473331;2,115169;Wall;Small;cdc7109b-7692-410d-916e-2601d64635c4
07/01/2024 23:19:06;1704665946;17806;3,802578;-1,973657;Wall;Small;2b1f0bc8-8d28-4f7e-b97d-5b46b5af8a04
07/01/2024 23:19:06;1704665946;17809;5,522367;-6,674554;Wall;Small;2b1f0bc8-8d28-4f7e-b97d-5b46b5af8a04
07/01/2024 23:19:06;1704665946;17809;5,522367;-6,674554;Wall;Small;2b1f0bc8-8d28-4f7e-b97d-5b46b5af8a04
07/01/2024 23:19:06;1704665946;17809;5,522367;-6,674554;Wall;Small;2b1f0bc8-8d28-4f7e-b97d-5b46b5af8a04
07/01/2024 23:19:06;1704665946;17820;7,68074;6,836854;Wall;Small;2b1f0bc8-8d28-4f7e-b97d-5b46b5af8a04
07/01/2024 23:19:06;1704665946;17820;7,68074;6,836854;Wall;Small;2b1f0bc8-8d28-4f7e-b97d-5b46b5af8a04
07/01/2024 23:19:07;1704665947;17832;-7,537124;2,21014;Wall;Small;2b1f0bc8-8d28-4f7e-b97d-5b46b5af8a04
07/01/2024 23:19:07;1704665947;17832;-7,537124;2,21014;Wall;Small;2b1f0bc8-8d28-4f7e-b97d-5b46b5af8a04
07/01/2024 23:19:07;1704665947;17852;5,51103;-6,584762;Wall;Small;dbc65d9a-9bec-46e5-ab24-5ea2d82ac2f4
07/01/2024 23:19:07;1704665947;17852;5,51103;-6,584762;Wall;Small;dbc65d9a-9bec-46e5-ab24-5ea2d82ac2f4
07/01/2024 23:19:07;1704665947;17852;5,51103;-6,584762;Wall;Small;dbc65d9a-9bec-46e5-ab24-5ea2d82ac2f4
07/01/2024 23:19:07;1704665947;17866;5,818079;7,472501;Wall;Small;dbc65d9a-9bec-46e5-ab24-5ea2d82ac2f4
07/01/2024 23:19:07;1704665947;17866;5,818079;7,472501;Wall;Small;dbc65d9a-9bec-46e5-ab24-5ea2d82ac2f4
07/01/2024 23:19:07;1704665947;17867;5,452154;7,216275;Wall;Small;dbc65d9a-9bec-46e5-ab24-5ea2d82ac2f4
07/01/2024 23:19:07;1704665947;17867;5,452154;7,216275;Wall;Small;dbc65d9a-9bec-46e5-ab24-5ea2d82ac2f4
07/01/2024 23:19:08;1704665948;17911;5,780339;7,456198;Wall;Small;c52e20a9-8790-40ea-94f7-9ef9def65790
07/01/2024 23:19:08;1704665948;17911;5,780339;7,456198;Wall;Small;c52e20a9-8790-40ea-94f7-9ef9def65790
07/01/2024 23:19:08;1704665948;17943;6,864594;-7,578021;Wall;Small;d8f150c6-cda1-4d5f-9afd-2644ba3e5156
07/01/2024 23:19:08;1704665948;17943;6,864594;-7,578021;Wall;Small;d8f150c6-cda1-4d5f-9afd-2644ba3e5156
07/01/2024 23:19:08;1704665948;17943;6,864594;-7,578021;Wall;Small;d8f150c6-cda1-4d5f-9afd-2644ba3e5156
07/01/2024 23:19:09;1704665949;17966;-7,656941;2,3286;Wall;Small;d8f150c6-cda1-4d5f-9afd-2644ba3e5156
07/01/2024 23:19:09;1704665949;17997;7,735707;6,418508;Wall;Small;38e87ff4-be4c-4c98-9d39-c71e711cdd42
07/01/2024 23:19:09;1704665949;17998;7,541487;6,835008;Wall;Small;38e87ff4-be4c-4c98-9d39-c71e711cdd42
07/01/2024 23:19:09;1704665949;17998;7,541487;6,835008;Wall;Small;38e87ff4-be4c-4c98-9d39-c71e711cdd42
07/01/2024 23:19:09;1704665949;17998;7,541487;6,835008;Wall;Small;38e87ff4-be4c-4c98-9d39-c71e711cdd42
07/01/2024 23:19:09;1704665949;17998;7,340028;7,248061;Wall;Small;38e87ff4-be4c-4c98-9d39-c71e711cdd42
07/01/2024 23:19:10;1704665950;18027;3,782409;-1,969434;Wall;Small;16facc81-9a7c-476d-be58-d28dc2c809fd
07/01/2024 23:19:10;1704665950;18027;3,985219;-2,350865;Wall;Small;16facc81-9a7c-476d-be58-d28dc2c809fd
07/01/2024 23:19:10;1704665950;18027;3,985219;-2,350865;Wall;Small;16facc81-9a7c-476d-be58-d28dc2c809fd
07/01/2024 23:19:10;1704665950;18027;4,04036;-2,663586;Wall;Small;16facc81-9a7c-476d-be58-d28dc2c809fd
07/01/2024 23:19:10;1704665950;18027;4,04036;-2,663586;Wall;Small;16facc81-9a7c-476d-be58-d28dc2c809fd
07/01/2024 23:19:10;1704665950;18030;5,465886;-6,669383;Wall;Small;16facc81-9a7c-476d-be58-d28dc2c809fd
07/01/2024 23:19:10;1704665950;18031;5,953927;-7,366378;Wall;Small;16facc81-9a7c-476d-be58-d28dc2c809fd
07/01/2024 23:19:10;1704665950;18031;5,953927;-7,366378;Wall;Small;16facc81-9a7c-476d-be58-d28dc2c809fd
07/01/2024 23:19:10;1704665950;18032;7,084968;-7,586226;Wall;Small;16facc81-9a7c-476d-be58-d28dc2c809fd
07/01/2024 23:19:10;1704665950;18042;7,719055;6,471003;Wall;Small;16facc81-9a7c-476d-be58-d28dc2c809fd
07/01/2024 23:19:10;1704665950;18042;7,719055;6,471003;Wall;Small;16facc81-9a7c-476d-be58-d28dc2c809fd
07/01/2024 23:19:10;1704665950;18042;7,719055;6,471003;Wall;Small;16facc81-9a7c-476d-be58-d28dc2c809fd
07/01/2024 23:19:10;1704665950;18043;7,673901;6,900635;Wall;Small;16facc81-9a7c-476d-be58-d28dc2c809fd
07/01/2024 23:19:10;1704665950;18056;-7,544699;2,23488;Wall;Small;16facc81-9a7c-476d-be58-d28dc2c809fd
07/01/2024 23:19:10;1704665950;18056;-7,544699;2,23488;Wall;Small;16facc81-9a7c-476d-be58-d28dc2c809fd
07/01/2024 23:19:10;1704665950;18071;2,323968;-1,911911;Wall;Small;7e566523-78c9-463a-b040-576d489323b2
07/01/2024 23:19:10;1704665950;18071;2,323968;-1,911911;Wall;Small;7e566523-78c9-463a-b040-576d489323b2
07/01/2024 23:19:10;1704665950;18071;2,323968;-1,911911;Wall;Small;7e566523-78c9-463a-b040-576d489323b2
07/01/2024 23:19:10;1704665950;18071;2,323968;-1,911911;Wall;Small;7e566523-78c9-463a-b040-576d489323b2
07/01/2024 23:19:10;1704665950;18071;2,323968;-1,911911;Wall;Small;7e566523-78c9-463a-b040-576d489323b2
07/01/2024 23:19:10;1704665950;18072;2,77253;-2,02375;Wall;Small;7e566523-78c9-463a-b040-576d489323b2
07/01/2024 23:19:10;1704665950;18072;2,77253;-2,02375;Wall;Small;7e566523-78c9-463a-b040-576d489323b2
07/01/2024 23:19:10;1704665950;18072;2,77253;-2,02375;Wall;Small;7e566523-78c9-463a-b040-576d489323b2
07/01/2024 23:19:10;1704665950;18072;2,77253;-2,02375;Wall;Small;7e566523-78c9-463a-b040-576d489323b2
07/01/2024 23:19:10;1704665950;18072;2,77253;-2,02375;Wall;Small;7e566523-78c9-463a-b040-576d489323b2
07/01/2024 23:19:11;1704665951;18100;-7,449;2,115974;Wall;Small;7e566523-78c9-463a-b040-576d489323b2
07/01/2024 23:19:11;1704665951;18135;7,727235;6,599051;Wall;Small;ed7b782b-b6c0-47b2-9d0a-2bd8416dabd2
07/01/2024 23:19:11;1704665951;18135;7,727235;6,599051;Wall;Small;ed7b782b-b6c0-47b2-9d0a-2bd8416dabd2
07/01/2024 23:19:12;1704665952;18148;-7,489339;2,183663;Wall;Small;ed7b782b-b6c0-47b2-9d0a-2bd8416dabd2
07/01/2024 23:19:12;1704665952;18148;-7,489339;2,183663;Wall;Small;ed7b782b-b6c0-47b2-9d0a-2bd8416dabd2
07/01/2024 23:19:13;1704665953;18243;-7,332335;2,084095;Wall;Small;9b83b7d0-203b-40e4-8a38-d5cafedf9e49
07/01/2024 23:19:13;1704665953;18243;-7,332335;2,084095;Wall;Small;9b83b7d0-203b-40e4-8a38-d5cafedf9e49
07/01/2024 23:19:13;1704665953;18244;-7,526805;2,449841;Wall;Small;9b83b7d0-203b-40e4-8a38-d5cafedf9e49
07/01/2024 23:19:13;1704665953;18244;-7,526805;2,449841;Wall;Small;9b83b7d0-203b-40e4-8a38-d5cafedf9e49
07/01/2024 23:19:13;1704665953;18255;-5,028156;-1,861613;Wall;Small;852fa2cc-b2b9-435a-bdd8-0d31b5ec0462
07/01/2024 23:19:13;1704665953;18255;-5,028156;-1,861613;Wall;Small;852fa2cc-b2b9-435a-bdd8-0d31b5ec0462
07/01/2024 23:19:13;1704665953;18255;-5,028156;-1,861613;Wall;Small;852fa2cc-b2b9-435a-bdd8-0d31b5ec0462
07/01/2024 23:19:13;1704665953;18255;-4,630209;-1,960831;Wall;Small;852fa2cc-b2b9-435a-bdd8-0d31b5ec0462
07/01/2024 23:19:13;1704665953;18255;-4,630209;-1,960831;Wall;Small;852fa2cc-b2b9-435a-bdd8-0d31b5ec0462
07/01/2024 23:19:13;1704665953;18255;-4,630209;-1,960831;Wall;Small;852fa2cc-b2b9-435a-bdd8-0d31b5ec0462
07/01/2024 23:19:13;1704665953;18255;-4,630209;-1,960831;Wall;Small;852fa2cc-b2b9-435a-bdd8-0d31b5ec0462
07/01/2024 23:19:13;1704665953;18255;-4,630209;-1,960831;Wall;Small;852fa2cc-b2b9-435a-bdd8-0d31b5ec0462
07/01/2024 23:19:13;1704665953;18255;-4,187967;-2,007312;Wall;Small;852fa2cc-b2b9-435a-bdd8-0d31b5ec0462
07/01/2024 23:19:13;1704665953;18255;-4,187967;-2,007312;Wall;Small;852fa2cc-b2b9-435a-bdd8-0d31b5ec0462
07/01/2024 23:19:13;1704665953;18255;-4,187967;-2,007312;Wall;Small;852fa2cc-b2b9-435a-bdd8-0d31b5ec0462
07/01/2024 23:19:13;1704665953;18255;-4,187967;-2,007312;Wall;Small;852fa2cc-b2b9-435a-bdd8-0d31b5ec0462
07/01/2024 23:19:13;1704665953;18255;-4,187967;-2,007312;Wall;Small;852fa2cc-b2b9-435a-bdd8-0d31b5ec0462
07/01/2024 23:19:13;1704665953;18256;-3,74498;-1,968556;Wall;Small;852fa2cc-b2b9-435a-bdd8-0d31b5ec0462
07/01/2024 23:19:13;1704665953;18256;-3,74498;-1,968556;Wall;Small;852fa2cc-b2b9-435a-bdd8-0d31b5ec0462
07/01/2024 23:19:13;1704665953;18256;-3,74498;-1,968556;Wall;Small;852fa2cc-b2b9-435a-bdd8-0d31b5ec0462
07/01/2024 23:19:13;1704665953;18260;2,635442;-1,834217;Wall;Small;852fa2cc-b2b9-435a-bdd8-0d31b5ec0462
07/01/2024 23:19:13;1704665953;18261;3,077684;-1,880697;Wall;Small;852fa2cc-b2b9-435a-bdd8-0d31b5ec0462
07/01/2024 23:19:13;1704665953;18261;3,077684;-1,880697;Wall;Small;852fa2cc-b2b9-435a-bdd8-0d31b5ec0462
07/01/2024 23:19:13;1704665953;18277;7,695507;6,900445;Wall;Small;852fa2cc-b2b9-435a-bdd8-0d31b5ec0462
07/01/2024 23:19:14;1704665954;18312;5,61754;-7,281937;Wall;Small;6f7a3546-2b37-43ef-abae-05abe4d2abf2
07/01/2024 23:19:14;1704665954;18312;5,61754;-7,281937;Wall;Small;6f7a3546-2b37-43ef-abae-05abe4d2abf2
07/01/2024 23:19:14;1704665954;18313;7,124083;-7,531454;Wall;Small;6f7a3546-2b37-43ef-abae-05abe4d2abf2
07/01/2024 23:19:14;1704665954;18338;-7,65872;2,391929;Wall;Small;6f7a3546-2b37-43ef-abae-05abe4d2abf2
07/01/2024 23:19:14;1704665954;18338;-7,65872;2,391929;Wall;Small;6f7a3546-2b37-43ef-abae-05abe4d2abf2
07/01/2024 23:19:15;1704665955;18354;4,054713;-2,375836;Wall;Small;e53d8d6c-96ef-4d7d-8bb7-ce0f09405ebf
07/01/2024 23:19:15;1704665955;18355;4,071242;-2,849218;Wall;Small;e53d8d6c-96ef-4d7d-8bb7-ce0f09405ebf
07/01/2024 23:19:15;1704665955;18355;4,071242;-2,849218;Wall;Small;e53d8d6c-96ef-4d7d-8bb7-ce0f09405ebf
07/01/2024 23:19:15;1704665955;18355;4,071242;-2,849218;Wall;Small;e53d8d6c-96ef-4d7d-8bb7-ce0f09405ebf
07/01/2024 23:19:15;1704665955;18355;4,112527;-3,321086;Wall;Small;e53d8d6c-96ef-4d7d-8bb7-ce0f09405ebf
07/01/2024 23:19:15;1704665955;18355;4,112527;-3,321086;Wall;Small;e53d8d6c-96ef-4d7d-8bb7-ce0f09405ebf
07/01/2024 23:19:15;1704665955;18355;4,079482;-3,793602;Wall;Small;e53d8d6c-96ef-4d7d-8bb7-ce0f09405ebf
07/01/2024 23:19:15;1704665955;18355;4,079482;-3,793602;Wall;Small;e53d8d6c-96ef-4d7d-8bb7-ce0f09405ebf
07/01/2024 23:19:15;1704665955;18355;4,079482;-3,793602;Wall;Small;e53d8d6c-96ef-4d7d-8bb7-ce0f09405ebf
07/01/2024 23:19:15;1704665955;18382;-7,676111;2,316934;Wall;Small;e53d8d6c-96ef-4d7d-8bb7-ce0f09405ebf
07/01/2024 23:19:15;1704665955;18405;6,734056;-7,600271;Wall;Small;bf4781cc-eceb-4fae-92ed-a0266bcc4d69
07/01/2024 23:19:15;1704665955;18405;6,734056;-7,600271;Wall;Small;bf4781cc-eceb-4fae-92ed-a0266bcc4d69
07/01/2024 23:19:15;1704665955;18405;6,734056;-7,600271;Wall;Small;bf4781cc-eceb-4fae-92ed-a0266bcc4d69
07/01/2024 23:19:16;1704665956;18427;-6,170712;1,138045;Wall;Small;bf4781cc-eceb-4fae-92ed-a0266bcc4d69
07/01/2024 23:19:16;1704665956;18427;-6,170712;1,138045;Wall;Small;bf4781cc-eceb-4fae-92ed-a0266bcc4d69
07/01/2024 23:19:16;1704665956;18427;-6,170712;1,138045;Wall;Small;bf4781cc-eceb-4fae-92ed-a0266bcc4d69
07/01/2024 23:19:16;1704665956;18427;-6,170712;1,138045;Wall;Small;bf4781cc-eceb-4fae-92ed-a0266bcc4d69
07/01/2024 23:19:16;1704665956;18427;-6,170712;1,138045;Wall;Small;bf4781cc-eceb-4fae-92ed-a0266bcc4d69
07/01/2024 23:19:16;1704665956;18427;-6,615365;1,176948;Wall;Small;bf4781cc-eceb-4fae-92ed-a0266bcc4d69
07/01/2024 23:19:16;1704665956;18427;-6,615365;1,176948;Wall;Small;bf4781cc-eceb-4fae-92ed-a0266bcc4d69
07/01/2024 23:19:16;1704665956;18429;-7,47212;2,037395;Wall;Small;bf4781cc-eceb-4fae-92ed-a0266bcc4d69
07/01/2024 23:19:16;1704665956;18438;-7,391021;-2,015484;Wall;Small;0d6e15b1-cec8-4fee-bbce-726b6e205022
07/01/2024 23:19:16;1704665956;18452;7,021787;-7,569576;Wall;Small;0d6e15b1-cec8-4fee-bbce-726b6e205022
07/01/2024 23:19:16;1704665956;18452;7,021787;-7,569576;Wall;Small;0d6e15b1-cec8-4fee-bbce-726b6e205022
07/01/2024 23:19:16;1704665956;18452;7,3842;-7,351817;Wall;Small;0d6e15b1-cec8-4fee-bbce-726b6e205022
07/01/2024 23:19:16;1704665956;18462;7,694128;6,957296;Wall;Small;0d6e15b1-cec8-4fee-bbce-726b6e205022
07/01/2024 23:19:16;1704665956;18465;5,66572;7,32993;Wall;Small;0d6e15b1-cec8-4fee-bbce-726b6e205022
07/01/2024 23:19:16;1704665956;18465;5,66572;7,32993;Wall;Small;0d6e15b1-cec8-4fee-bbce-726b6e205022
07/01/2024 23:19:16;1704665956;18465;5,66572;7,32993;Wall;Small;0d6e15b1-cec8-4fee-bbce-726b6e205022
07/01/2024 23:19:16;1704665956;18476;-7,660752;2,411702;Wall;Small;0d6e15b1-cec8-4fee-bbce-726b6e205022
07/01/2024 23:19:16;1704665956;18476;-7,660752;2,411702;Wall;Small;0d6e15b1-cec8-4fee-bbce-726b6e205022
07/01/2024 23:19:17;1704665957;18487;-5,192245;-1,876172;Wall;Small;04a475f9-b004-4b29-ba0d-7a4758ec4044
07/01/2024 23:19:17;1704665957;18487;-5,192245;-1,876172;Wall;Small;04a475f9-b004-4b29-ba0d-7a4758ec4044
07/01/2024 23:19:17;1704665957;18487;-5,192245;-1,876172;Wall;Small;04a475f9-b004-4b29-ba0d-7a4758ec4044
07/01/2024 23:19:17;1704665957;18487;-4,880972;-1,908887;Wall;Small;04a475f9-b004-4b29-ba0d-7a4758ec4044
07/01/2024 23:19:17;1704665957;18487;-4,880972;-1,908887;Wall;Small;04a475f9-b004-4b29-ba0d-7a4758ec4044
07/01/2024 23:19:17;1704665957;18487;-4,880972;-1,908887;Wall;Small;04a475f9-b004-4b29-ba0d-7a4758ec4044
07/01/2024 23:19:17;1704665957;18512;6,19426;7,577617;Wall;Small;04a475f9-b004-4b29-ba0d-7a4758ec4044
07/01/2024 23:19:17;1704665957;18512;6,19426;7,577617;Wall;Small;04a475f9-b004-4b29-ba0d-7a4758ec4044
07/01/2024 23:19:17;1704665957;18522;-6,840497;1,169935;Wall;Small;04a475f9-b004-4b29-ba0d-7a4758ec4044
07/01/2024 23:19:17;1704665957;18534;-7,109014;-1,885157;Wall;Small;c4c97ceb-7c93-4490-9542-3885a1c1e903
07/01/2024 23:19:17;1704665957;18542;3,888179;-2,225395;Wall;Small;c4c97ceb-7c93-4490-9542-3885a1c1e903
07/01/2024 23:19:18;1704665958;18546;6,724398;-7,618172;Wall;Small;c4c97ceb-7c93-4490-9542-3885a1c1e903
07/01/2024 23:19:18;1704665958;18546;6,724398;-7,618172;Wall;Small;c4c97ceb-7c93-4490-9542-3885a1c1e903
07/01/2024 23:19:18;1704665958;18558;7,690231;6,905188;Wall;Small;c4c97ceb-7c93-4490-9542-3885a1c1e903
07/01/2024 23:19:18;1704665958;18559;6,034206;7,492055;Wall;Small;c4c97ceb-7c93-4490-9542-3885a1c1e903
07/01/2024 23:19:18;1704665958;18560;5,641631;7,33344;Wall;Small;c4c97ceb-7c93-4490-9542-3885a1c1e903
07/01/2024 23:19:18;1704665958;18570;-7,611365;2,238758;Wall;Small;c4c97ceb-7c93-4490-9542-3885a1c1e903
07/01/2024 23:19:18;1704665958;18570;-7,611365;2,238758;Wall;Small;c4c97ceb-7c93-4490-9542-3885a1c1e903
07/01/2024 23:19:18;1704665958;18591;5,474458;-6,515865;Wall;Small;0f93e2be-3ffa-4852-9b84-92c8cd39dea8
07/01/2024 23:19:18;1704665958;18591;5,474458;-6,515865;Wall;Small;0f93e2be-3ffa-4852-9b84-92c8cd39dea8
07/01/2024 23:19:18;1704665958;18593;7,466502;-7,433624;Wall;Small;0f93e2be-3ffa-4852-9b84-92c8cd39dea8
07/01/2024 23:19:18;1704665958;18602;7,678761;6,717378;Wall;Small;0f93e2be-3ffa-4852-9b84-92c8cd39dea8
07/01/2024 23:19:18;1704665958;18602;7,678761;6,717378;Wall;Small;0f93e2be-3ffa-4852-9b84-92c8cd39dea8
07/01/2024 23:19:18;1704665958;18602;7,678761;6,717378;Wall;Small;0f93e2be-3ffa-4852-9b84-92c8cd39dea8
07/01/2024 23:19:19;1704665959;18615;-7,659273;2,250004;Wall;Small;0f93e2be-3ffa-4852-9b84-92c8cd39dea8
07/01/2024 23:19:19;1704665959;18647;7,697653;6,6032;Wall;Small;e85852cb-18f9-4253-b40a-d482b38a45f1
07/01/2024 23:19:19;1704665959;18647;7,697653;6,6032;Wall;Small;e85852cb-18f9-4253-b40a-d482b38a45f1
07/01/2024 23:19:19;1704665959;18647;7,697653;6,6032;Wall;Small;e85852cb-18f9-4253-b40a-d482b38a45f1
07/01/2024 23:19:21;1704665961;18749;-7,522023;2,352518;Wall;Small;e7074382-17de-4cd8-95f1-cba06f50a6dc
07/01/2024 23:19:21;1704665961;18749;-7,522023;2,352518;Wall;Small;e7074382-17de-4cd8-95f1-cba06f50a6dc
07/01/2024 23:19:21;1704665961;18749;-7,522023;2,352518;Wall;Small;e7074382-17de-4cd8-95f1-cba06f50a6dc
07/01/2024 23:19:21;1704665961;18793;-7,706466;2,344069;Wall;Small;c4ab94f8-76a4-4366-9ae5-45ee09687806
07/01/2024 23:19:22;1704665962;18810;3,915766;-2,310058;Wall;Small;96d70397-00a9-4688-9f44-93a6574d863e
07/01/2024 23:19:22;1704665962;18836;-6,468965;1,213855;Wall;Small;96d70397-00a9-4688-9f44-93a6574d863e
07/01/2024 23:19:22;1704665962;18837;-6,924747;1,149798;Wall;Small;96d70397-00a9-4688-9f44-93a6574d863e
07/01/2024 23:19:22;1704665962;18837;-6,924747;1,149798;Wall;Small;96d70397-00a9-4688-9f44-93a6574d863e
07/01/2024 23:19:22;1704665962;18837;-6,924747;1,149798;Wall;Small;96d70397-00a9-4688-9f44-93a6574d863e
07/01/2024 23:19:23;1704665963;18884;-7,524941;2,16443;Wall;Small;3713471f-dd8d-4455-a817-867ff87f35de
07/01/2024 23:19:23;1704665963;18884;-7,524941;2,16443;Wall;Small;3713471f-dd8d-4455-a817-867ff87f35de
07/01/2024 23:19:23;1704665963;18884;-7,647293;2,591134;Wall;Small;3713471f-dd8d-4455-a817-867ff87f35de
07/01/2024 23:19:23;1704665963;18884;-7,647293;2,591134;Wall;Small;3713471f-dd8d-4455-a817-867ff87f35de
07/01/2024 23:19:23;1704665963;18915;7,703832;6,571817;Wall;Small;ae6cbdd9-2718-479b-b0a2-2b98f1873bea
07/01/2024 23:19:23;1704665963;18915;7,703832;6,571817;Wall;Small;ae6cbdd9-2718-479b-b0a2-2b98f1873bea
07/01/2024 23:19:23;1704665963;18915;7,703832;6,571817;Wall;Small;ae6cbdd9-2718-479b-b0a2-2b98f1873bea
07/01/2024 23:19:23;1704665963;18917;6,243651;7,610747;Wall;Small;ae6cbdd9-2718-479b-b0a2-2b98f1873bea
07/01/2024 23:19:23;1704665963;18917;5,838609;7,386229;Wall;Small;ae6cbdd9-2718-479b-b0a2-2b98f1873bea
07/01/2024 23:19:23;1704665963;18917;5,838609;7,386229;Wall;Small;ae6cbdd9-2718-479b-b0a2-2b98f1873bea
07/01/2024 23:19:23;1704665963;18917;5,838609;7,386229;Wall;Small;ae6cbdd9-2718-479b-b0a2-2b98f1873bea
07/01/2024 23:19:24;1704665964;18945;3,708741;-2,010378;Wall;Small;dfaee523-414d-4c65-86b2-f90b35560bfa
07/01/2024 23:19:24;1704665964;18945;3,708741;-2,010378;Wall;Small;dfaee523-414d-4c65-86b2-f90b35560bfa
07/01/2024 23:19:26;1704665966;19064;-7,387148;2,030919;Wall;Small;a110541d-1409-4d68-adc8-994acf3928dc
07/01/2024 23:19:26;1704665966;19064;-7,576562;2,456349;Wall;Small;a110541d-1409-4d68-adc8-994acf3928dc
07/01/2024 23:19:26;1704665966;19064;-7,576562;2,456349;Wall;Small;a110541d-1409-4d68-adc8-994acf3928dc
07/01/2024 23:19:26;1704665966;19098;7,70515;6,804988;Wall;Small;bca5ed87-b55e-4513-b268-add88dc205ff
07/01/2024 23:19:26;1704665966;19098;7,70515;6,804988;Wall;Small;bca5ed87-b55e-4513-b268-add88dc205ff
07/01/2024 23:19:26;1704665966;19101;5,597685;7,277328;Wall;Small;bca5ed87-b55e-4513-b268-add88dc205ff
07/01/2024 23:19:26;1704665966;19101;5,597685;7,277328;Wall;Small;bca5ed87-b55e-4513-b268-add88dc205ff
07/01/2024 23:19:26;1704665966;19101;5,597685;7,277328;Wall;Small;bca5ed87-b55e-4513-b268-add88dc205ff
07/01/2024 23:19:26;1704665966;19101;5,218206;7,083973;Wall;Small;bca5ed87-b55e-4513-b268-add88dc205ff
07/01/2024 23:19:26;1704665966;19101;5,218206;7,083973;Wall;Small;bca5ed87-b55e-4513-b268-add88dc205ff
07/01/2024 23:19:27;1704665967;19181;6,78266;-7,611081;Wall;Small;87688870-29da-4f94-aae8-cab1aa417abe
07/01/2024 23:19:27;1704665967;19181;6,78266;-7,611081;Wall;Small;87688870-29da-4f94-aae8-cab1aa417abe
07/01/2024 23:19:27;1704665967;19181;6,78266;-7,611081;Wall;Small;87688870-29da-4f94-aae8-cab1aa417abe
07/01/2024 23:19:27;1704665967;19181;7,177861;-7,435128;Wall;Small;87688870-29da-4f94-aae8-cab1aa417abe
07/01/2024 23:19:28;1704665968;19204;-7,257269;1,207269;Wall;Small;87688870-29da-4f94-aae8-cab1aa417abe
07/01/2024 23:19:28;1704665968;19204;-7,257269;1,207269;Wall;Small;87688870-29da-4f94-aae8-cab1aa417abe
07/01/2024 23:19:28;1704665968;19223;3,843561;-2,088806;Wall;Small;fabf3b22-5c34-4e9e-a2a9-7d01c9cab2de
07/01/2024 23:19:28;1704665968;19223;3,843561;-2,088806;Wall;Small;fabf3b22-5c34-4e9e-a2a9-7d01c9cab2de
07/01/2024 23:19:28;1704665968;19224;4,095598;-2,939682;Wall;Small;fabf3b22-5c34-4e9e-a2a9-7d01c9cab2de
07/01/2024 23:19:28;1704665968;19224;4,095598;-2,939682;Wall;Small;fabf3b22-5c34-4e9e-a2a9-7d01c9cab2de
07/01/2024 23:19:29;1704665969;19286;6,101626;7,579987;Wall;Small;0df28f1d-c963-47d1-82d9-f5739cd26dd3
07/01/2024 23:19:29;1704665969;19286;5,705374;7,395215;Wall;Small;0df28f1d-c963-47d1-82d9-f5739cd26dd3
07/01/2024 23:19:29;1704665969;19296;-7,61629;2,196799;Wall;Small;0df28f1d-c963-47d1-82d9-f5739cd26dd3
07/01/2024 23:19:29;1704665969;19317;5,532854;-6,835947;Wall;Small;a1661508-2022-45bd-9d66-eef30c42453e
07/01/2024 23:19:30;1704665970;19357;3,892251;-2,176809;Wall;Small;65fd3bc8-a63e-404e-a2f4-b008e9e6e450
07/01/2024 23:19:30;1704665970;19361;5,539451;-6,901649;Wall;Small;65fd3bc8-a63e-404e-a2f4-b008e9e6e450
07/01/2024 23:19:30;1704665970;19374;7,556126;7,310157;Wall;Small;65fd3bc8-a63e-404e-a2f4-b008e9e6e450
07/01/2024 23:19:30;1704665970;19387;-7,441087;2,043082;Wall;Small;65fd3bc8-a63e-404e-a2f4-b008e9e6e450
07/01/2024 23:19:31;1704665971;19404;3,728591;-2,008734;Wall;Small;fdd556da-f491-414b-9cde-99bb7946e0b1
07/01/2024 23:19:31;1704665971;19404;3,728591;-2,008734;Wall;Small;fdd556da-f491-414b-9cde-99bb7946e0b1
07/01/2024 23:19:31;1704665971;19405;3,996347;-2,364059;Wall;Small;fdd556da-f491-414b-9cde-99bb7946e0b1
07/01/2024 23:19:31;1704665971;19410;6,856912;-7,627719;Wall;Small;fdd556da-f491-414b-9cde-99bb7946e0b1
07/01/2024 23:19:31;1704665971;19455;5,608824;-7,298927;Wall;Small;daf6591e-3f73-458c-a0b7-b14bbe8f5d83
07/01/2024 23:19:31;1704665971;19457;7,116812;-7,58244;Wall;Small;daf6591e-3f73-458c-a0b7-b14bbe8f5d83
07/01/2024 23:19:32;1704665972;19468;7,58822;7,35868;Wall;Small;daf6591e-3f73-458c-a0b7-b14bbe8f5d83
07/01/2024 23:19:32;1704665972;19469;6,418927;7,628059;Wall;Small;daf6591e-3f73-458c-a0b7-b14bbe8f5d83
07/01/2024 23:19:32;1704665972;19469;6,418927;7,628059;Wall;Small;daf6591e-3f73-458c-a0b7-b14bbe8f5d83
07/01/2024 23:19:32;1704665972;19470;5,646079;7,292011;Wall;Small;daf6591e-3f73-458c-a0b7-b14bbe8f5d83
07/01/2024 23:19:32;1704665972;19470;5,646079;7,292011;Wall;Small;daf6591e-3f73-458c-a0b7-b14bbe8f5d83
07/01/2024 23:19:32;1704665972;19491;-5,045966;-1,893512;Wall;Small;1d5f9ee0-d366-4628-9ea8-db4da06dceff
07/01/2024 23:19:32;1704665972;19491;-5,045966;-1,893512;Wall;Small;1d5f9ee0-d366-4628-9ea8-db4da06dceff
07/01/2024 23:19:32;1704665972;19491;-5,045966;-1,893512;Wall;Small;1d5f9ee0-d366-4628-9ea8-db4da06dceff
07/01/2024 23:19:32;1704665972;19491;-4,591471;-1,837705;Wall;Small;1d5f9ee0-d366-4628-9ea8-db4da06dceff
07/01/2024 23:19:32;1704665972;19503;7,491787;-7,357359;Wall;Small;1d5f9ee0-d366-4628-9ea8-db4da06dceff
07/01/2024 23:19:32;1704665972;19524;-7,260216;1,940163;Wall;Small;1d5f9ee0-d366-4628-9ea8-db4da06dceff
07/01/2024 23:19:32;1704665972;19524;-7,479335;2,241751;Wall;Small;1d5f9ee0-d366-4628-9ea8-db4da06dceff
07/01/2024 23:19:32;1704665972;19524;-7,479335;2,241751;Wall;Small;1d5f9ee0-d366-4628-9ea8-db4da06dceff
07/01/2024 23:19:32;1704665972;19525;-7,66558;2,660072;Wall;Small;1d5f9ee0-d366-4628-9ea8-db4da06dceff
07/01/2024 23:19:34;1704665974;19613;-7,58528;2,139157;Wall;Small;a8b5bb50-a70c-4c77-bbf3-c28d5cea4eca
07/01/2024 23:19:35;1704665975;19668;-7,242931;-1,993551;Wall;Small;cd7a1f12-084e-4eea-9871-cda0b81d4bd6
07/01/2024 23:19:35;1704665975;19668;-7,242931;-1,993551;Wall;Small;cd7a1f12-084e-4eea-9871-cda0b81d4bd6
07/01/2024 23:19:35;1704665975;19668;-7,242931;-1,993551;Wall;Small;cd7a1f12-084e-4eea-9871-cda0b81d4bd6
07/01/2024 23:19:35;1704665975;19702;-7,567702;2,275643;Wall;Small;cd7a1f12-084e-4eea-9871-cda0b81d4bd6
07/01/2024 23:19:35;1704665975;19702;-7,567702;2,275643;Wall;Small;cd7a1f12-084e-4eea-9871-cda0b81d4bd6
07/01/2024 23:19:36;1704665976;19776;7,661965;6,526265;Wall;Small;32d10fc4-5c9b-4b46-b093-8fbd3a04167f
07/01/2024 23:19:36;1704665976;19776;7,661965;6,526265;Wall;Small;32d10fc4-5c9b-4b46-b093-8fbd3a04167f
07/01/2024 23:19:36;1704665976;19776;7,661965;6,526265;Wall;Small;32d10fc4-5c9b-4b46-b093-8fbd3a04167f
07/01/2024 23:19:36;1704665976;19776;7,661965;6,526265;Wall;Small;32d10fc4-5c9b-4b46-b093-8fbd3a04167f
07/01/2024 23:19:37;1704665977;19789;-7,587303;2,352723;Wall;Small;32d10fc4-5c9b-4b46-b093-8fbd3a04167f
07/01/2024 23:19:37;1704665977;19789;-7,587303;2,352723;Wall;Small;32d10fc4-5c9b-4b46-b093-8fbd3a04167f
07/01/2024 23:19:37;1704665977;19789;-7,713645;2,824244;Wall;Small;32d10fc4-5c9b-4b46-b093-8fbd3a04167f
07/01/2024 23:19:37;1704665977;19806;4,045301;-2,339873;Wall;Small;6457cfd0-49e7-4258-8e58-3368f21a04b7
07/01/2024 23:19:38;1704665978;19854;5,587422;-7,301085;Wall;Small;9fd18458-3b34-48e7-b1f4-5c2f377c9e3f
07/01/2024 23:19:39;1704665979;19967;-7,325997;2,144443;Wall;Small;92fa3e5d-a60f-4aa2-8842-e2f9da19f4b0
07/01/2024 23:19:39;1704665979;19967;-7,325997;2,144443;Wall;Small;92fa3e5d-a60f-4aa2-8842-e2f9da19f4b0
07/01/2024 23:19:39;1704665979;19967;-7,325997;2,144443;Wall;Small;92fa3e5d-a60f-4aa2-8842-e2f9da19f4b0
07/01/2024 23:19:39;1704665979;19967;-7,45259;2,558508;Wall;Small;92fa3e5d-a60f-4aa2-8842-e2f9da19f4b0
07/01/2024 23:19:39;1704665979;19967;-7,45259;2,558508;Wall;Small;92fa3e5d-a60f-4aa2-8842-e2f9da19f4b0
07/01/2024 23:19:39;1704665979;19967;-7,45259;2,558508;Wall;Small;92fa3e5d-a60f-4aa2-8842-e2f9da19f4b0
07/01/2024 23:19:39;1704665979;19967;-7,45259;2,558508;Wall;Small;92fa3e5d-a60f-4aa2-8842-e2f9da19f4b0
07/01/2024 23:19:39;1704665979;19985;3,976146;-2,205958;Wall;Small;105180b7-ef5e-41d1-9532-34a072e8682c
07/01/2024 23:19:40;1704665980;19989;5,70032;-7,330987;Wall;Small;105180b7-ef5e-41d1-9532-34a072e8682c
07/01/2024 23:19:40;1704665980;19989;5,70032;-7,330987;Wall;Small;105180b7-ef5e-41d1-9532-34a072e8682c
07/01/2024 23:19:40;1704665980;20014;-7,479548;2,108265;Wall;Small;105180b7-ef5e-41d1-9532-34a072e8682c
07/01/2024 23:19:41;1704665981;20059;-7,327546;2,114382;Wall;Small;a45fd001-99f4-49dc-8885-1c2ec7ba45b9
07/01/2024 23:19:41;1704665981;20059;-7,327546;2,114382;Wall;Small;a45fd001-99f4-49dc-8885-1c2ec7ba45b9
07/01/2024 23:19:41;1704665981;20059;-7,327546;2,114382;Wall;Small;a45fd001-99f4-49dc-8885-1c2ec7ba45b9
07/01/2024 23:19:41;1704665981;20059;-7,545606;2,507769;Wall;Small;a45fd001-99f4-49dc-8885-1c2ec7ba45b9
07/01/2024 23:19:41;1704665981;20059;-7,545606;2,507769;Wall;Small;a45fd001-99f4-49dc-8885-1c2ec7ba45b9
07/01/2024 23:19:41;1704665981;20081;5,553486;-6,908958;Wall;Small;e313309a-5882-4d44-88b4-45a4af6728c1
07/01/2024 23:19:41;1704665981;20081;5,553486;-6,908958;Wall;Small;e313309a-5882-4d44-88b4-45a4af6728c1
07/01/2024 23:19:41;1704665981;20082;5,810921;-7,250586;Wall;Small;e313309a-5882-4d44-88b4-45a4af6728c1
07/01/2024 23:19:41;1704665981;20082;5,810921;-7,250586;Wall;Small;e313309a-5882-4d44-88b4-45a4af6728c1
07/01/2024 23:19:41;1704665981;20082;6,188612;-7,451408;Wall;Small;e313309a-5882-4d44-88b4-45a4af6728c1
07/01/2024 23:19:41;1704665981;20082;6,188612;-7,451408;Wall;Small;e313309a-5882-4d44-88b4-45a4af6728c1
07/01/2024 23:19:41;1704665981;20082;6,599805;-7,569318;Wall;Small;e313309a-5882-4d44-88b4-45a4af6728c1
07/01/2024 23:19:41;1704665981;20082;6,599805;-7,569318;Wall;Small;e313309a-5882-4d44-88b4-45a4af6728c1
07/01/2024 23:19:41;1704665981;20082;7,025225;-7,524608;Wall;Small;e313309a-5882-4d44-88b4-45a4af6728c1
07/01/2024 23:19:41;1704665981;20106;-6,813428;1,13152;Wall;Small;e313309a-5882-4d44-88b4-45a4af6728c1
07/01/2024 23:19:41;1704665981;20106;-6,813428;1,13152;Wall;Small;e313309a-5882-4d44-88b4-45a4af6728c1
07/01/2024 23:19:41;1704665981;20106;-6,813428;1,13152;Wall;Small;e313309a-5882-4d44-88b4-45a4af6728c1
07/01/2024 23:19:41;1704665981;20118;-5,059935;-1,846685;Wall;Small;71b28adc-510e-4f28-aa62-caac8e834849
07/01/2024 23:19:41;1704665981;20118;-5,059935;-1,846685;Wall;Small;71b28adc-510e-4f28-aa62-caac8e834849
07/01/2024 23:19:41;1704665981;20119;-4,645802;-1,890212;Wall;Small;71b28adc-510e-4f28-aa62-caac8e834849
07/01/2024 23:19:41;1704665981;20119;-4,645802;-1,890212;Wall;Small;71b28adc-510e-4f28-aa62-caac8e834849
07/01/2024 23:19:41;1704665981;20119;-4,645802;-1,890212;Wall;Small;71b28adc-510e-4f28-aa62-caac8e834849
07/01/2024 23:19:41;1704665981;20124;1,824665;-1,83919;Wall;Small;71b28adc-510e-4f28-aa62-caac8e834849
07/01/2024 23:19:41;1704665981;20124;1,824665;-1,83919;Wall;Small;71b28adc-510e-4f28-aa62-caac8e834849
07/01/2024 23:19:41;1704665981;20124;2,237979;-1,88994;Wall;Small;71b28adc-510e-4f28-aa62-caac8e834849
07/01/2024 23:19:41;1704665981;20124;2,237979;-1,88994;Wall;Small;71b28adc-510e-4f28-aa62-caac8e834849
07/01/2024 23:19:41;1704665981;20124;2,237979;-1,88994;Wall;Small;71b28adc-510e-4f28-aa62-caac8e834849
07/01/2024 23:19:41;1704665981;20125;3,778851;-2,038781;Wall;Small;71b28adc-510e-4f28-aa62-caac8e834849
07/01/2024 23:19:41;1704665981;20125;3,778851;-2,038781;Wall;Small;71b28adc-510e-4f28-aa62-caac8e834849
07/01/2024 23:19:42;1704665982;20125;3,967901;-2,409812;Wall;Small;71b28adc-510e-4f28-aa62-caac8e834849
07/01/2024 23:19:42;1704665982;20125;3,967901;-2,409812;Wall;Small;71b28adc-510e-4f28-aa62-caac8e834849
07/01/2024 23:19:42;1704665982;20129;5,463535;-6,687954;Wall;Small;71b28adc-510e-4f28-aa62-caac8e834849
07/01/2024 23:19:42;1704665982;20129;5,463535;-6,687954;Wall;Small;71b28adc-510e-4f28-aa62-caac8e834849
07/01/2024 23:19:42;1704665982;20144;5,705359;7,348645;Wall;Small;71b28adc-510e-4f28-aa62-caac8e834849
07/01/2024 23:19:42;1704665982;20144;5,705359;7,348645;Wall;Small;71b28adc-510e-4f28-aa62-caac8e834849
07/01/2024 23:19:42;1704665982;20144;5,705359;7,348645;Wall;Small;71b28adc-510e-4f28-aa62-caac8e834849
07/01/2024 23:19:42;1704665982;20172;3,769537;-1,978038;Wall;Small;bbcc1d97-de3e-4663-aa95-448203edf904
07/01/2024 23:19:44;1704665984;20276;7,720165;5,907238;Wall;Small;94dd7bd3-011e-41fc-a573-dd433328e783
07/01/2024 23:19:44;1704665984;20276;7,720165;5,907238;Wall;Small;94dd7bd3-011e-41fc-a573-dd433328e783
07/01/2024 23:19:44;1704665984;20276;7,704465;6,356884;Wall;Small;94dd7bd3-011e-41fc-a573-dd433328e783
07/01/2024 23:19:44;1704665984;20276;7,704465;6,356884;Wall;Small;94dd7bd3-011e-41fc-a573-dd433328e783
07/01/2024 23:19:44;1704665984;20277;7,665255;6,805091;Wall;Small;94dd7bd3-011e-41fc-a573-dd433328e783
07/01/2024 23:19:44;1704665984;20277;7,665255;6,805091;Wall;Small;94dd7bd3-011e-41fc-a573-dd433328e783
07/01/2024 23:19:44;1704665984;20288;-6,966533;1,885411;Wall;Small;94dd7bd3-011e-41fc-a573-dd433328e783
07/01/2024 23:19:44;1704665984;20288;-6,966533;1,885411;Wall;Small;94dd7bd3-011e-41fc-a573-dd433328e783
07/01/2024 23:19:44;1704665984;20288;-7,306093;2,180586;Wall;Small;94dd7bd3-011e-41fc-a573-dd433328e783
07/01/2024 23:19:44;1704665984;20288;-7,306093;2,180586;Wall;Small;94dd7bd3-011e-41fc-a573-dd433328e783
07/01/2024 23:19:44;1704665984;20289;-7,58309;2,535128;Wall;Small;94dd7bd3-011e-41fc-a573-dd433328e783
07/01/2024 23:19:44;1704665984;20304;3,724106;-2,046857;Wall;Small;4ba7c30f-3cbf-4697-82ae-09e6b3fe5402
07/01/2024 23:19:45;1704665985;20329;-6,572153;1,206471;Wall;Small;4ba7c30f-3cbf-4697-82ae-09e6b3fe5402
07/01/2024 23:19:45;1704665985;20329;-7,059636;1,206471;Wall;Small;4ba7c30f-3cbf-4697-82ae-09e6b3fe5402
07/01/2024 23:19:45;1704665985;20329;-7,059636;1,206471;Wall;Small;4ba7c30f-3cbf-4697-82ae-09e6b3fe5402
07/01/2024 23:19:45;1704665985;20352;7,519001;-7,420821;Wall;Small;1bf337fd-f96e-47da-857e-326d164b90ed
07/01/2024 23:19:46;1704665986;20374;-7,623281;2,266708;Wall;Small;1bf337fd-f96e-47da-857e-326d164b90ed
07/01/2024 23:19:46;1704665986;20385;-4,554708;-1,902813;Wall;Small;f4b0bc9d-200d-44a3-a09f-4d8900f3f683
07/01/2024 23:19:46;1704665986;20385;-4,554708;-1,902813;Wall;Small;f4b0bc9d-200d-44a3-a09f-4d8900f3f683
07/01/2024 23:19:46;1704665986;20385;-4,554708;-1,902813;Wall;Small;f4b0bc9d-200d-44a3-a09f-4d8900f3f683
07/01/2024 23:19:46;1704665986;20385;-4,554708;-1,902813;Wall;Small;f4b0bc9d-200d-44a3-a09f-4d8900f3f683
07/01/2024 23:19:46;1704665986;20385;-4,554708;-1,902813;Wall;Small;f4b0bc9d-200d-44a3-a09f-4d8900f3f683
07/01/2024 23:19:46;1704665986;20385;-4,130047;-1,887984;Wall;Small;f4b0bc9d-200d-44a3-a09f-4d8900f3f683
07/01/2024 23:19:46;1704665986;20385;-4,130047;-1,887984;Wall;Small;f4b0bc9d-200d-44a3-a09f-4d8900f3f683
07/01/2024 23:19:46;1704665986;20385;-4,130047;-1,887984;Wall;Small;f4b0bc9d-200d-44a3-a09f-4d8900f3f683
07/01/2024 23:19:46;1704665986;20390;2,792618;-1,836316;Wall;Small;f4b0bc9d-200d-44a3-a09f-4d8900f3f683
07/01/2024 23:19:46;1704665986;20391;3,203061;-1,946293;Wall;Small;f4b0bc9d-200d-44a3-a09f-4d8900f3f683
07/01/2024 23:19:46;1704665986;20391;3,602356;-2,091625;Wall;Small;f4b0bc9d-200d-44a3-a09f-4d8900f3f683
07/01/2024 23:19:46;1704665986;20391;3,602356;-2,091625;Wall;Small;f4b0bc9d-200d-44a3-a09f-4d8900f3f683
07/01/2024 23:19:46;1704665986;20409;6,219431;7,560838;Wall;Small;f4b0bc9d-200d-44a3-a09f-4d8900f3f683
07/01/2024 23:19:46;1704665986;20409;6,219431;7,560838;Wall;Small;f4b0bc9d-200d-44a3-a09f-4d8900f3f683
07/01/2024 23:19:46;1704665986;20409;5,815304;7,429531;Wall;Small;f4b0bc9d-200d-44a3-a09f-4d8900f3f683
07/01/2024 23:19:46;1704665986;20421;-7,48877;2,00459;Wall;Small;f4b0bc9d-200d-44a3-a09f-4d8900f3f683
07/01/2024 23:19:47;1704665987;20445;6,329845;-7,535952;Wall;Small;1da8b442-eccb-439a-af7d-eb59e5730bbf
07/01/2024 23:19:47;1704665987;20446;6,701084;-7,555407;Wall;Small;1da8b442-eccb-439a-af7d-eb59e5730bbf
07/01/2024 23:19:47;1704665987;20446;6,701084;-7,555407;Wall;Small;1da8b442-eccb-439a-af7d-eb59e5730bbf
07/01/2024 23:19:47;1704665987;20446;6,701084;-7,555407;Wall;Small;1da8b442-eccb-439a-af7d-eb59e5730bbf
07/01/2024 23:19:47;1704665987;20446;7,079054;-7,447024;Wall;Small;1da8b442-eccb-439a-af7d-eb59e5730bbf
07/01/2024 23:19:47;1704665987;20458;7,717102;6,9341;Wall;Small;1da8b442-eccb-439a-af7d-eb59e5730bbf
07/01/2024 23:19:47;1704665987;20472;-7,421501;2,165188;Wall;Small;1da8b442-eccb-439a-af7d-eb59e5730bbf
07/01/2024 23:19:47;1704665987;20472;-7,421501;2,165188;Wall;Small;1da8b442-eccb-439a-af7d-eb59e5730bbf
07/01/2024 23:19:47;1704665987;20472;-7,606102;2,512366;Wall;Small;1da8b442-eccb-439a-af7d-eb59e5730bbf
07/01/2024 23:19:47;1704665987;20472;-7,606102;2,512366;Wall;Small;1da8b442-eccb-439a-af7d-eb59e5730bbf
07/01/2024 23:19:48;1704665988;20506;7,705401;6,97708;Wall;Small;a1320684-c1c0-4ed9-8a4e-9ae16358d8e0
07/01/2024 23:19:48;1704665988;20519;-7,341086;2,110085;Wall;Small;a1320684-c1c0-4ed9-8a4e-9ae16358d8e0
07/01/2024 23:19:48;1704665988;20519;-7,341086;2,110085;Wall;Small;a1320684-c1c0-4ed9-8a4e-9ae16358d8e0
07/01/2024 23:19:48;1704665988;20519;-7,570769;2,477658;Wall;Small;a1320684-c1c0-4ed9-8a4e-9ae16358d8e0
07/01/2024 23:19:48;1704665988;20519;-7,570769;2,477658;Wall;Small;a1320684-c1c0-4ed9-8a4e-9ae16358d8e0
07/01/2024 23:19:48;1704665988;20561;-7,544762;2,259272;Wall;Small;a2bbb888-cc8e-4fee-b353-481968452e4a
07/01/2024 23:19:48;1704665988;20561;-7,544762;2,259272;Wall;Small;a2bbb888-cc8e-4fee-b353-481968452e4a
07/01/2024 23:19:48;1704665988;20562;-7,651621;2,722125;Wall;Small;a2bbb888-cc8e-4fee-b353-481968452e4a
07/01/2024 23:19:48;1704665988;20562;-7,651621;2,722125;Wall;Small;a2bbb888-cc8e-4fee-b353-481968452e4a
07/01/2024 23:19:49;1704665989;20605;-7,542531;2,268523;Wall;Small;bc569f0e-16a1-4616-9e5a-f4130b297f76
07/01/2024 23:19:49;1704665989;20605;-7,542531;2,268523;Wall;Small;bc569f0e-16a1-4616-9e5a-f4130b297f76
07/01/2024 23:19:49;1704665989;20606;-7,654296;2,716784;Wall;Small;bc569f0e-16a1-4616-9e5a-f4130b297f76
07/01/2024 23:19:49;1704665989;20606;-7,654296;2,716784;Wall;Small;bc569f0e-16a1-4616-9e5a-f4130b297f76
07/01/2024 23:19:50;1704665990;20638;6,113754;7,566905;Wall;Small;af6f58a0-bfe0-45e5-828f-1393a0da6ca2
07/01/2024 23:19:50;1704665990;20647;-6,713337;1,177416;Wall;Small;af6f58a0-bfe0-45e5-828f-1393a0da6ca2
07/01/2024 23:19:50;1704665990;20647;-6,713337;1,177416;Wall;Small;af6f58a0-bfe0-45e5-828f-1393a0da6ca2
07/01/2024 23:19:50;1704665990;20647;-6,713337;1,177416;Wall;Small;af6f58a0-bfe0-45e5-828f-1393a0da6ca2
07/01/2024 23:19:50;1704665990;20659;-4,45576;-1,877921;Wall;Small;ca02a1ae-15f9-4f8a-b7b5-4f0351b74a9c
07/01/2024 23:19:50;1704665990;20659;-4,45576;-1,877921;Wall;Small;ca02a1ae-15f9-4f8a-b7b5-4f0351b74a9c
07/01/2024 23:19:50;1704665990;20659;-4,45576;-1,877921;Wall;Small;ca02a1ae-15f9-4f8a-b7b5-4f0351b74a9c
07/01/2024 23:19:51;1704665991;20682;5,613241;7,329162;Wall;Small;ca02a1ae-15f9-4f8a-b7b5-4f0351b74a9c
07/01/2024 23:19:51;1704665991;20711;3,762486;-1,981111;Wall;Small;c6854620-e8ce-4f21-996e-9cc2e799554e
07/01/2024 23:19:51;1704665991;20711;3,762486;-1,981111;Wall;Small;c6854620-e8ce-4f21-996e-9cc2e799554e
07/01/2024 23:19:51;1704665991;20711;3,97467;-2,348624;Wall;Small;c6854620-e8ce-4f21-996e-9cc2e799554e
07/01/2024 23:19:51;1704665991;20711;3,97467;-2,348624;Wall;Small;c6854620-e8ce-4f21-996e-9cc2e799554e
07/01/2024 23:19:51;1704665991;20711;4,084654;-2,650798;Wall;Small;c6854620-e8ce-4f21-996e-9cc2e799554e
07/01/2024 23:19:51;1704665991;20714;5,504065;-6,620176;Wall;Small;c6854620-e8ce-4f21-996e-9cc2e799554e
07/01/2024 23:19:51;1704665991;20714;5,504065;-6,620176;Wall;Small;c6854620-e8ce-4f21-996e-9cc2e799554e
07/01/2024 23:19:51;1704665991;20714;5,504065;-6,620176;Wall;Small;c6854620-e8ce-4f21-996e-9cc2e799554e
07/01/2024 23:19:51;1704665991;20717;7,230599;-7,517786;Wall;Small;c6854620-e8ce-4f21-996e-9cc2e799554e
07/01/2024 23:19:51;1704665991;20717;7,230599;-7,517786;Wall;Small;c6854620-e8ce-4f21-996e-9cc2e799554e
07/01/2024 23:19:51;1704665991;20729;6,50214;7,558084;Wall;Small;c6854620-e8ce-4f21-996e-9cc2e799554e
07/01/2024 23:19:51;1704665991;20729;6,50214;7,558084;Wall;Small;c6854620-e8ce-4f21-996e-9cc2e799554e
07/01/2024 23:19:51;1704665991;20729;6,50214;7,558084;Wall;Small;c6854620-e8ce-4f21-996e-9cc2e799554e
07/01/2024 23:19:51;1704665991;20729;6,50214;7,558084;Wall;Small;c6854620-e8ce-4f21-996e-9cc2e799554e
07/01/2024 23:19:52;1704665992;20749;-7,347816;-1,963614;Wall;Small;f5bf38f5-a7cd-4614-bf72-4a19cc62ae94
07/01/2024 23:19:52;1704665992;20749;-7,347816;-1,963614;Wall;Small;f5bf38f5-a7cd-4614-bf72-4a19cc62ae94
07/01/2024 23:19:52;1704665992;20761;5,660196;-7,352339;Wall;Small;f5bf38f5-a7cd-4614-bf72-4a19cc62ae94
07/01/2024 23:19:52;1704665992;20803;3,896655;-2,118492;Wall;Small;04bca9de-59fe-40a7-a69d-34ce848c1e96
07/01/2024 23:19:53;1704665993;20808;6,322654;-7,579104;Wall;Small;04bca9de-59fe-40a7-a69d-34ce848c1e96
07/01/2024 23:19:53;1704665993;20808;6,322654;-7,579104;Wall;Small;04bca9de-59fe-40a7-a69d-34ce848c1e96
07/01/2024 23:19:53;1704665993;20808;6,763981;-7,501285;Wall;Small;04bca9de-59fe-40a7-a69d-34ce848c1e96
07/01/2024 23:19:53;1704665993;20808;6,763981;-7,501285;Wall;Small;04bca9de-59fe-40a7-a69d-34ce848c1e96
07/01/2024 23:19:53;1704665993;20808;6,763981;-7,501285;Wall;Small;04bca9de-59fe-40a7-a69d-34ce848c1e96
07/01/2024 23:19:53;1704665993;20832;-7,468429;2,018913;Wall;Small;04bca9de-59fe-40a7-a69d-34ce848c1e96
07/01/2024 23:19:53;1704665993;20832;-7,585895;2,403141;Wall;Small;04bca9de-59fe-40a7-a69d-34ce848c1e96
07/01/2024 23:19:53;1704665993;20832;-7,585895;2,403141;Wall;Small;04bca9de-59fe-40a7-a69d-34ce848c1e96
07/01/2024 23:19:53;1704665993;20832;-7,585895;2,403141;Wall;Small;04bca9de-59fe-40a7-a69d-34ce848c1e96
07/01/2024 23:19:53;1704665993;20865;7,541071;7,381225;Wall;Small;0f72aaf3-8ebb-4849-a64d-f41c91079f37
07/01/2024 23:19:53;1704665993;20866;6,283816;7,611859;Wall;Small;0f72aaf3-8ebb-4849-a64d-f41c91079f37
07/01/2024 23:19:53;1704665993;20866;6,283816;7,611859;Wall;Small;0f72aaf3-8ebb-4849-a64d-f41c91079f37
07/01/2024 23:19:54;1704665994;20877;-7,505498;2,235558;Wall;Small;0f72aaf3-8ebb-4849-a64d-f41c91079f37
07/01/2024 23:19:54;1704665994;20877;-7,505498;2,235558;Wall;Small;0f72aaf3-8ebb-4849-a64d-f41c91079f37
07/01/2024 23:19:54;1704665994;20877;-7,505498;2,235558;Wall;Small;0f72aaf3-8ebb-4849-a64d-f41c91079f37
07/01/2024 23:19:54;1704665994;20877;-7,679791;2,646164;Wall;Small;0f72aaf3-8ebb-4849-a64d-f41c91079f37
07/01/2024 23:19:54;1704665994;20898;5,793238;-7,346593;Wall;Small;f681b8c1-ecf4-4af1-9a35-f19db811deba
07/01/2024 23:19:54;1704665994;20899;6,925967;-7,610179;Wall;Small;f681b8c1-ecf4-4af1-9a35-f19db811deba
07/01/2024 23:19:54;1704665994;20899;6,925967;-7,610179;Wall;Small;f681b8c1-ecf4-4af1-9a35-f19db811deba
07/01/2024 23:19:54;1704665994;20939;3,835957;-2,172996;Wall;Small;09e3adc7-6c36-409e-9453-a42c99721c0c
07/01/2024 23:19:54;1704665994;20939;3,835957;-2,172996;Wall;Small;09e3adc7-6c36-409e-9453-a42c99721c0c
07/01/2024 23:19:54;1704665994;20939;3,835957;-2,172996;Wall;Small;09e3adc7-6c36-409e-9453-a42c99721c0c
07/01/2024 23:19:55;1704665995;20968;-7,678046;2,539756;Wall;Small;09e3adc7-6c36-409e-9453-a42c99721c0c
07/01/2024 23:19:55;1704665995;20968;-7,678046;2,539756;Wall;Small;09e3adc7-6c36-409e-9453-a42c99721c0c
07/01/2024 23:19:56;1704665996;21015;-7,544131;2,202659;Wall;Small;00e77eab-e15d-41de-9b90-8f0fb78bcff0
07/01/2024 23:19:56;1704665996;21015;-7,619991;2,632871;Wall;Small;00e77eab-e15d-41de-9b90-8f0fb78bcff0
07/01/2024 23:19:56;1704665996;21015;-7,619991;2,632871;Wall;Small;00e77eab-e15d-41de-9b90-8f0fb78bcff0
07/01/2024 23:19:56;1704665996;21015;-7,619991;2,632871;Wall;Small;00e77eab-e15d-41de-9b90-8f0fb78bcff0
07/01/2024 23:19:56;1704665996;21036;5,490872;-6,83609;Wall;Small;bee8c060-b3d4-4b99-883f-8e5eb95000d1
07/01/2024 23:19:56;1704665996;21036;5,490872;-6,83609;Wall;Small;bee8c060-b3d4-4b99-883f-8e5eb95000d1
07/01/2024 23:19:56;1704665996;21051;5,524473;7,259192;Wall;Small;bee8c060-b3d4-4b99-883f-8e5eb95000d1
07/01/2024 23:19:56;1704665996;21051;5,524473;7,259192;Wall;Small;bee8c060-b3d4-4b99-883f-8e5eb95000d1
07/01/2024 23:19:56;1704665996;21075;0,05443324;-1,851097;Wall;Small;72f8fdf1-6db3-4727-8122-4d33768923c1
07/01/2024 23:19:56;1704665996;21075;0,05443324;-1,851097;Wall;Small;72f8fdf1-6db3-4727-8122-4d33768923c1
07/01/2024 23:19:56;1704665996;21076;0,5056754;-1,930664;Wall;Small;72f8fdf1-6db3-4727-8122-4d33768923c1
07/01/2024 23:19:56;1704665996;21076;0,5056754;-1,930664;Wall;Small;72f8fdf1-6db3-4727-8122-4d33768923c1
07/01/2024 23:19:56;1704665996;21076;0,5056754;-1,930664;Wall;Small;72f8fdf1-6db3-4727-8122-4d33768923c1
07/01/2024 23:19:56;1704665996;21076;0,5056754;-1,930664;Wall;Small;72f8fdf1-6db3-4727-8122-4d33768923c1
07/01/2024 23:19:56;1704665996;21076;0,9621346;-1,890729;Wall;Small;72f8fdf1-6db3-4727-8122-4d33768923c1
07/01/2024 23:19:56;1704665996;21076;0,9621346;-1,890729;Wall;Small;72f8fdf1-6db3-4727-8122-4d33768923c1
07/01/2024 23:19:57;1704665997;21123;3,786165;-2,039536;Wall;Small;c41246a2-4c84-4f23-9d3f-c2d258be25d5
07/01/2024 23:19:57;1704665997;21123;4,009043;-2,410468;Wall;Small;c41246a2-4c84-4f23-9d3f-c2d258be25d5
07/01/2024 23:19:57;1704665997;21124;4,105845;-2,727094;Wall;Small;c41246a2-4c84-4f23-9d3f-c2d258be25d5
07/01/2024 23:19:57;1704665997;21129;7,484506;-7,423814;Wall;Small;c41246a2-4c84-4f23-9d3f-c2d258be25d5
07/01/2024 23:19:58;1704665998;21152;-7,49409;2,117614;Wall;Small;c41246a2-4c84-4f23-9d3f-c2d258be25d5
07/01/2024 23:19:58;1704665998;21153;-7,656195;2,518843;Wall;Small;c41246a2-4c84-4f23-9d3f-c2d258be25d5
07/01/2024 23:19:58;1704665998;21153;-7,656195;2,518843;Wall;Small;c41246a2-4c84-4f23-9d3f-c2d258be25d5
07/01/2024 23:19:58;1704665998;21187;5,643979;7,367361;Wall;Small;f3b81a24-7068-4493-bc90-71886227c12e
07/01/2024 23:19:58;1704665998;21197;-7,489172;2,121042;Wall;Small;f3b81a24-7068-4493-bc90-71886227c12e
07/01/2024 23:19:59;1704665999;21215;3,778186;-1,958852;Wall;Small;e5881c6e-d794-4a88-9a03-dae1025ce892
07/01/2024 23:19:59;1704665999;21215;3,778186;-1,958852;Wall;Small;e5881c6e-d794-4a88-9a03-dae1025ce892
