07/01/2024 23:24:37;1704666277;32431;0,2126063;0,9129509;Agent;Large;dc7b7110-ae4a-4619-8eb6-01cfb1e14545
07/01/2024 23:24:37;1704666277;32431;0,2126063;0,9129509;Agent;Large;dc7b7110-ae4a-4619-8eb6-01cfb1e14545
07/01/2024 23:24:37;1704666277;32431;0,2126063;0,9129509;Agent;Large;dc7b7110-ae4a-4619-8eb6-01cfb1e14545
07/01/2024 23:24:37;1704666277;32431;-0,7096263;-0,3399812;Agent;Large;d3e4fe86-9910-419d-a61b-076247b9d2d4
07/01/2024 23:24:37;1704666277;32431;-0,7096263;-0,3399812;Agent;Large;d3e4fe86-9910-419d-a61b-076247b9d2d4
07/01/2024 23:24:37;1704666277;32432;0,1508326;0,4734075;Agent;Medium;dc7b7110-ae4a-4619-8eb6-01cfb1e14545
07/01/2024 23:24:37;1704666277;32432;0,1508326;0,4734075;Agent;Medium;dc7b7110-ae4a-4619-8eb6-01cfb1e14545
07/01/2024 23:24:37;1704666277;32432;-0,7786672;0,09592592;Agent;Medium;d3e4fe86-9910-419d-a61b-076247b9d2d4
07/01/2024 23:24:37;1704666277;32432;-0,7786672;0,09592592;Agent;Medium;d3e4fe86-9910-419d-a61b-076247b9d2d4
07/01/2024 23:24:38;1704666278;32442;0,2624537;0,6343503;Agent;Large;cc521178-f89e-4d99-b00c-23049aadab4f
07/01/2024 23:24:38;1704666278;32442;0,2624537;0,6343503;Agent;Large;cc521178-f89e-4d99-b00c-23049aadab4f
07/01/2024 23:24:38;1704666278;32442;0,2624537;0,6343503;Agent;Large;cc521178-f89e-4d99-b00c-23049aadab4f
07/01/2024 23:24:38;1704666278;32442;0,2624537;0,6343503;Agent;Large;cc521178-f89e-4d99-b00c-23049aadab4f
07/01/2024 23:24:38;1704666278;32442;0,2624537;0,6343503;Agent;Large;cc521178-f89e-4d99-b00c-23049aadab4f
07/01/2024 23:24:38;1704666278;32442;0,2624537;0,6343503;Agent;Large;cc521178-f89e-4d99-b00c-23049aadab4f
07/01/2024 23:24:38;1704666278;32442;-0,02445608;-0,7734643;Agent;Large;845f5c38-509a-4ca4-ae4f-4a9ac6a272e5
07/01/2024 23:24:38;1704666278;32442;-0,02445608;-0,7734643;Agent;Large;845f5c38-509a-4ca4-ae4f-4a9ac6a272e5
07/01/2024 23:24:38;1704666278;32442;-0,02445608;-0,7734643;Agent;Large;845f5c38-509a-4ca4-ae4f-4a9ac6a272e5
07/01/2024 23:24:38;1704666278;32442;-0,02445608;-0,7734643;Agent;Large;845f5c38-509a-4ca4-ae4f-4a9ac6a272e5
07/01/2024 23:24:38;1704666278;32442;-0,02445608;-0,7734643;Agent;Large;845f5c38-509a-4ca4-ae4f-4a9ac6a272e5
07/01/2024 23:24:38;1704666278;32442;-0,02445608;-0,7734643;Agent;Large;845f5c38-509a-4ca4-ae4f-4a9ac6a272e5
07/01/2024 23:24:38;1704666278;32442;-0,02445608;-0,7734643;Agent;Large;845f5c38-509a-4ca4-ae4f-4a9ac6a272e5
07/01/2024 23:24:38;1704666278;32443;0,2785107;0,1745312;Agent;Small;cc521178-f89e-4d99-b00c-23049aadab4f
07/01/2024 23:24:38;1704666278;32443;0,2785107;0,1745312;Agent;Small;cc521178-f89e-4d99-b00c-23049aadab4f
07/01/2024 23:24:38;1704666278;32443;0,2785107;0,1745312;Agent;Small;cc521178-f89e-4d99-b00c-23049aadab4f
07/01/2024 23:24:38;1704666278;32443;0,2785107;0,1745312;Agent;Small;cc521178-f89e-4d99-b00c-23049aadab4f
07/01/2024 23:24:38;1704666278;32443;0,2785107;0,1745312;Agent;Small;cc521178-f89e-4d99-b00c-23049aadab4f
07/01/2024 23:24:38;1704666278;32443;0,2785107;0,1745312;Agent;Small;cc521178-f89e-4d99-b00c-23049aadab4f
07/01/2024 23:24:38;1704666278;32443;-0,05696395;-0,3085801;Agent;Small;845f5c38-509a-4ca4-ae4f-4a9ac6a272e5
07/01/2024 23:24:38;1704666278;32443;-0,05696395;-0,3085801;Agent;Small;845f5c38-509a-4ca4-ae4f-4a9ac6a272e5
07/01/2024 23:24:38;1704666278;32443;-0,05696395;-0,3085801;Agent;Small;845f5c38-509a-4ca4-ae4f-4a9ac6a272e5
07/01/2024 23:24:38;1704666278;32443;-0,05696395;-0,3085801;Agent;Small;845f5c38-509a-4ca4-ae4f-4a9ac6a272e5
07/01/2024 23:24:38;1704666278;32443;-0,05696395;-0,3085801;Agent;Small;845f5c38-509a-4ca4-ae4f-4a9ac6a272e5
07/01/2024 23:24:38;1704666278;32443;0,3873586;0,08902019;Agent;Small;cc521178-f89e-4d99-b00c-23049aadab4f
07/01/2024 23:24:38;1704666278;32443;0,3873586;0,08902019;Agent;Small;cc521178-f89e-4d99-b00c-23049aadab4f
07/01/2024 23:24:38;1704666278;32443;0,3873586;0,08902019;Agent;Small;cc521178-f89e-4d99-b00c-23049aadab4f
07/01/2024 23:24:38;1704666278;32443;0,3873586;0,08902019;Agent;Small;cc521178-f89e-4d99-b00c-23049aadab4f
07/01/2024 23:24:38;1704666278;32443;-0,07450693;-0,2919306;Agent;Small;845f5c38-509a-4ca4-ae4f-4a9ac6a272e5
07/01/2024 23:24:38;1704666278;32443;-0,07450693;-0,2919306;Agent;Small;845f5c38-509a-4ca4-ae4f-4a9ac6a272e5
07/01/2024 23:24:38;1704666278;32443;-0,07450693;-0,2919306;Agent;Small;845f5c38-509a-4ca4-ae4f-4a9ac6a272e5
07/01/2024 23:24:38;1704666278;32443;-0,07450693;-0,2919306;Agent;Small;845f5c38-509a-4ca4-ae4f-4a9ac6a272e5
07/01/2024 23:24:38;1704666278;32443;-0,07450693;-0,2919306;Agent;Small;845f5c38-509a-4ca4-ae4f-4a9ac6a272e5
07/01/2024 23:24:38;1704666278;32454;0,5155594;0,6674259;Agent;Medium;eaabea9f-6db1-405b-ac40-f905e66eb66d
07/01/2024 23:24:38;1704666278;32454;0,5155594;0,6674259;Agent;Medium;eaabea9f-6db1-405b-ac40-f905e66eb66d
07/01/2024 23:24:38;1704666278;32454;-0,3952784;-0,0350377;Agent;Medium;e7e2a118-ba9e-444c-a47e-a09163ebded0
07/01/2024 23:24:38;1704666278;32454;-0,3952784;-0,0350377;Agent;Medium;e7e2a118-ba9e-444c-a47e-a09163ebded0
07/01/2024 23:24:38;1704666278;32465;0,1009961;0,3534362;Agent;Large;5107253a-c3bc-4c51-b857-1a192dcba47d
07/01/2024 23:24:38;1704666278;32465;0,1009961;0,3534362;Agent;Medium;5107253a-c3bc-4c51-b857-1a192dcba47d
07/01/2024 23:24:38;1704666278;32465;0,1009961;0,3534362;Agent;Medium;5107253a-c3bc-4c51-b857-1a192dcba47d
07/01/2024 23:24:38;1704666278;32465;0,1009961;0,3534362;Agent;Large;5107253a-c3bc-4c51-b857-1a192dcba47d
07/01/2024 23:24:38;1704666278;32465;-0,4889084;-0,7398348;Agent;Large;7da304a5-ec92-42ff-a634-3f9dd741b353
07/01/2024 23:24:38;1704666278;32465;-0,4889084;-0,7398348;Agent;Medium;7da304a5-ec92-42ff-a634-3f9dd741b353
07/01/2024 23:24:38;1704666278;32465;-0,4889084;-0,7398348;Agent;Medium;7da304a5-ec92-42ff-a634-3f9dd741b353
07/01/2024 23:24:38;1704666278;32465;0,1427986;-0,1243684;Agent;Small;5107253a-c3bc-4c51-b857-1a192dcba47d
07/01/2024 23:24:38;1704666278;32465;0,1427986;-0,1243684;Agent;Small;5107253a-c3bc-4c51-b857-1a192dcba47d
07/01/2024 23:24:38;1704666278;32465;0,1427986;-0,1243684;Agent;Small;5107253a-c3bc-4c51-b857-1a192dcba47d
07/01/2024 23:24:38;1704666278;32465;-0,545891;-0,3343829;Agent;Small;7da304a5-ec92-42ff-a634-3f9dd741b353
07/01/2024 23:24:38;1704666278;32465;-0,545891;-0,3343829;Agent;Small;7da304a5-ec92-42ff-a634-3f9dd741b353
07/01/2024 23:24:38;1704666278;32465;-0,545891;-0,3343829;Agent;Small;7da304a5-ec92-42ff-a634-3f9dd741b353
07/01/2024 23:24:38;1704666278;32476;0,4909585;0,5649719;Agent;Large;9bfa0a40-7de4-4024-8b3d-7f3a86f96caf
07/01/2024 23:24:38;1704666278;32476;0,4909585;0,5649719;Agent;Large;9bfa0a40-7de4-4024-8b3d-7f3a86f96caf
07/01/2024 23:24:38;1704666278;32476;-0,8009936;-0,15339;Agent;Large;c6fad24e-d03c-4fd0-81ca-a4c0cab99589
07/01/2024 23:24:38;1704666278;32487;0,4164589;0,9203615;Agent;Large;d960f4bc-68c8-4d37-8d69-f7d901e6c8b5
07/01/2024 23:24:38;1704666278;32487;-0,5095183;-0,4718589;Agent;Large;4359e50f-0f55-4de2-9910-fce1b78f9615
07/01/2024 23:24:38;1704666278;32487;0,5216516;0,4647213;Agent;Medium;d960f4bc-68c8-4d37-8d69-f7d901e6c8b5
07/01/2024 23:24:38;1704666278;32487;0,5216516;0,4647213;Agent;Medium;d960f4bc-68c8-4d37-8d69-f7d901e6c8b5
07/01/2024 23:24:38;1704666278;32487;-0,5698036;-0,04290611;Agent;Medium;4359e50f-0f55-4de2-9910-fce1b78f9615
07/01/2024 23:24:38;1704666278;32487;-0,5698036;-0,04290611;Agent;Medium;4359e50f-0f55-4de2-9910-fce1b78f9615
07/01/2024 23:24:39;1704666279;32498;0,4879506;0,355057;Agent;Large;0fd65f13-6754-463e-8ef5-a0f6520cb946
07/01/2024 23:24:39;1704666279;32498;-0,7037795;-0,2524109;Agent;Large;a06addab-c66e-40c2-a34d-55c062b12208
07/01/2024 23:24:39;1704666279;32509;0,7246991;0,6412963;Agent;Large;3331ff27-3946-4753-b63a-2af978f6b2e7
07/01/2024 23:24:39;1704666279;32509;0,7246991;0,6412963;Agent;Large;3331ff27-3946-4753-b63a-2af978f6b2e7
07/01/2024 23:24:39;1704666279;32509;-0,5824349;-0,09392783;Agent;Large;b47d03bf-6188-40a0-a255-481d8a644146
07/01/2024 23:24:39;1704666279;32520;0,5298422;0,9798358;Agent;Large;ef27f440-b265-48e9-a077-cec0a7861c75
07/01/2024 23:24:39;1704666279;32520;0,5298422;0,9798358;Agent;Large;ef27f440-b265-48e9-a077-cec0a7861c75
07/01/2024 23:24:39;1704666279;32520;-0,4043504;-0,03945363;Agent;Large;f3c589fd-a01f-4a02-9fc1-18aa9050bec2
07/01/2024 23:24:39;1704666279;32520;-0,4043504;-0,03945363;Agent;Large;f3c589fd-a01f-4a02-9fc1-18aa9050bec2
07/01/2024 23:24:39;1704666279;32520;-0,4439063;0,412668;Agent;Medium;f3c589fd-a01f-4a02-9fc1-18aa9050bec2
07/01/2024 23:24:39;1704666279;32531;0,4416708;1,037326;Agent;Large;9bf1b97d-2db3-48be-9c2f-a08d2d560730
07/01/2024 23:24:39;1704666279;32531;0,4416708;1,037326;Agent;Large;9bf1b97d-2db3-48be-9c2f-a08d2d560730
07/01/2024 23:24:39;1704666279;32531;-0,615881;0,1326912;Agent;Large;91b0b132-8829-4e30-82b0-cfe35bafd6a5
07/01/2024 23:24:39;1704666279;32531;0,409698;0,5800908;Agent;Medium;9bf1b97d-2db3-48be-9c2f-a08d2d560730
07/01/2024 23:24:40;1704666280;32553;0,4289488;0,03157245;Agent;Medium;71f4485c-4dd6-4122-a77d-54408a1b3bcc
07/01/2024 23:24:40;1704666280;32553;0,4289488;0,03157245;Agent;Medium;71f4485c-4dd6-4122-a77d-54408a1b3bcc
07/01/2024 23:24:40;1704666280;32553;-0,5724055;-0,5620354;Agent;Medium;4aeab5b3-599c-448f-93f7-c67b78f762b7
07/01/2024 23:24:40;1704666280;32553;-0,5724055;-0,5620354;Agent;Medium;4aeab5b3-599c-448f-93f7-c67b78f762b7
07/01/2024 23:24:40;1704666280;32563;0,2803258;0,7748377;Agent;Large;74f11e2d-e7de-48e7-abe6-fb75036f3a85
07/01/2024 23:24:40;1704666280;32563;0,2803258;0,7748377;Agent;Large;74f11e2d-e7de-48e7-abe6-fb75036f3a85
07/01/2024 23:24:40;1704666280;32563;-0,4038769;-0,5917841;Agent;Large;34858102-bdc2-4db2-a324-b7e036603766
07/01/2024 23:24:40;1704666280;32563;-0,4038769;-0,5917841;Agent;Large;34858102-bdc2-4db2-a324-b7e036603766
07/01/2024 23:24:40;1704666280;32563;0,3472773;0,3521223;Agent;Medium;74f11e2d-e7de-48e7-abe6-fb75036f3a85
07/01/2024 23:24:40;1704666280;32563;0,3472773;0,3521223;Agent;Medium;74f11e2d-e7de-48e7-abe6-fb75036f3a85
07/01/2024 23:24:40;1704666280;32563;0,3472773;0,3521223;Agent;Medium;74f11e2d-e7de-48e7-abe6-fb75036f3a85
07/01/2024 23:24:40;1704666280;32563;-0,4663625;-0,1471749;Agent;Medium;34858102-bdc2-4db2-a324-b7e036603766
07/01/2024 23:24:40;1704666280;32563;-0,4663625;-0,1471749;Agent;Medium;34858102-bdc2-4db2-a324-b7e036603766
07/01/2024 23:24:40;1704666280;32563;-0,4663625;-0,1471749;Agent;Medium;34858102-bdc2-4db2-a324-b7e036603766
07/01/2024 23:24:40;1704666280;32585;0,6171589;0,7917242;Agent;Large;67c9872f-a0fb-43eb-ab95-90ac4d32634f
07/01/2024 23:24:40;1704666280;32585;-0,1211477;-0,6780156;Agent;Large;7581c59d-0c1c-4821-abaa-c1659a8bc1f3
07/01/2024 23:24:40;1704666280;32585;-0,1211477;-0,6780156;Agent;Large;7581c59d-0c1c-4821-abaa-c1659a8bc1f3
07/01/2024 23:24:40;1704666280;32585;0,6326129;0,3491731;Agent;Medium;67c9872f-a0fb-43eb-ab95-90ac4d32634f
07/01/2024 23:24:40;1704666280;32585;0,6326129;0,3491731;Agent;Medium;67c9872f-a0fb-43eb-ab95-90ac4d32634f
07/01/2024 23:24:40;1704666280;32585;-0,0572178;-0,274378;Agent;Medium;7581c59d-0c1c-4821-abaa-c1659a8bc1f3
07/01/2024 23:24:40;1704666280;32585;-0,0572178;-0,274378;Agent;Medium;7581c59d-0c1c-4821-abaa-c1659a8bc1f3
07/01/2024 23:24:40;1704666280;32585;-0,0572178;-0,274378;Agent;Medium;7581c59d-0c1c-4821-abaa-c1659a8bc1f3
07/01/2024 23:24:40;1704666280;32585;-0,0572178;-0,274378;Agent;Medium;7581c59d-0c1c-4821-abaa-c1659a8bc1f3
07/01/2024 23:24:40;1704666280;32585;-0,0358297;0,1337308;Agent;Medium;7581c59d-0c1c-4821-abaa-c1659a8bc1f3
07/01/2024 23:24:40;1704666280;32585;-0,0358297;0,1337308;Agent;Small;7581c59d-0c1c-4821-abaa-c1659a8bc1f3
07/01/2024 23:24:40;1704666280;32596;0,5265943;0,5039905;Agent;Medium;eb3cda0c-4842-4313-b447-481da979d7eb
07/01/2024 23:24:40;1704666280;32596;0,5265943;0,5039905;Agent;Medium;eb3cda0c-4842-4313-b447-481da979d7eb
07/01/2024 23:24:40;1704666280;32596;-0,4975843;-0,127055;Agent;Medium;7b7a8934-61b5-4777-bfb5-188e06dd06ec
07/01/2024 23:24:41;1704666281;32607;0,5676689;0,763571;Agent;Large;d952c99b-c68e-4722-90bb-5c96a0591203
07/01/2024 23:24:41;1704666281;32607;-0,6291627;0,1643442;Agent;Large;59503e7d-714e-46ec-a473-551d415f0864
07/01/2024 23:24:41;1704666281;32618;0,4351528;0,7929859;Agent;Large;0ba81738-1c98-4d88-8002-da43996b3a76
07/01/2024 23:24:41;1704666281;32618;-0,7107792;-0,2924167;Agent;Large;b3352720-5a42-4570-88f6-17101ff10c5d
07/01/2024 23:24:41;1704666281;32618;-0,7107792;-0,2924167;Agent;Large;b3352720-5a42-4570-88f6-17101ff10c5d
07/01/2024 23:24:41;1704666281;32628;0,252482;0,7250053;Agent;Large;0150c23c-e09c-4392-aea3-d255884ec9f2
07/01/2024 23:24:41;1704666281;32628;0,252482;0,7250053;Agent;Large;0150c23c-e09c-4392-aea3-d255884ec9f2
07/01/2024 23:24:41;1704666281;32628;-0,7226314;-0,1851167;Agent;Large;20649eb3-981f-4386-8d4a-fa7daef2f1c1
07/01/2024 23:24:41;1704666281;32628;-0,7226314;-0,1851167;Agent;Large;20649eb3-981f-4386-8d4a-fa7daef2f1c1
07/01/2024 23:24:41;1704666281;32629;0,252482;0,2822471;Agent;Medium;0150c23c-e09c-4392-aea3-d255884ec9f2
07/01/2024 23:24:41;1704666281;32639;0,4525919;0,6952068;Agent;Large;486cde4d-9d3f-4520-97a0-294b2f83111d
07/01/2024 23:24:41;1704666281;32639;0,4525919;0,6952068;Agent;Large;486cde4d-9d3f-4520-97a0-294b2f83111d
07/01/2024 23:24:41;1704666281;32639;-0,4915267;-0,4524521;Agent;Large;f4ad213d-3343-4f86-8b45-15d292a82a24
07/01/2024 23:24:41;1704666281;32639;-0,4915267;-0,4524521;Agent;Large;f4ad213d-3343-4f86-8b45-15d292a82a24
07/01/2024 23:24:41;1704666281;32640;0,5994796;0,291636;Agent;Medium;486cde4d-9d3f-4520-97a0-294b2f83111d
07/01/2024 23:24:41;1704666281;32640;-0,4621691;-0,0326145;Agent;Medium;f4ad213d-3343-4f86-8b45-15d292a82a24
07/01/2024 23:24:41;1704666281;32640;-0,4621691;-0,0326145;Agent;Medium;f4ad213d-3343-4f86-8b45-15d292a82a24
07/01/2024 23:24:42;1704666282;32650;-0,5930689;-0,5714719;Agent;Large;aad91e37-ef1d-49f2-93d8-7e403f56e16f
07/01/2024 23:24:42;1704666282;32661;0,7351833;0,1461376;Agent;Large;ba030275-7fc4-4f76-b2db-06044e760d9d
07/01/2024 23:24:42;1704666282;32661;0,7351833;0,1461376;Agent;Large;ba030275-7fc4-4f76-b2db-06044e760d9d
07/01/2024 23:24:42;1704666282;32661;-0,2153982;-0,7717993;Agent;Large;f3b01182-d2cc-4735-8d6d-288d5165cc60
07/01/2024 23:24:42;1704666282;32661;-0,2153982;-0,7717993;Agent;Large;f3b01182-d2cc-4735-8d6d-288d5165cc60
07/01/2024 23:24:42;1704666282;32672;0,5338306;0,4116888;Agent;Large;66075fa9-7016-4514-bdf5-adb31876e316
07/01/2024 23:24:42;1704666282;32672;0,5338306;0,4116888;Agent;Large;66075fa9-7016-4514-bdf5-adb31876e316
07/01/2024 23:24:42;1704666282;32672;-0,3216159;-0,7131467;Agent;Large;195499e0-226c-48b7-9ba1-55fc4c93e049
07/01/2024 23:24:42;1704666282;32672;-0,3216159;-0,7131467;Agent;Large;195499e0-226c-48b7-9ba1-55fc4c93e049
07/01/2024 23:24:42;1704666282;32673;0,6575841;0,05228177;Agent;Medium;66075fa9-7016-4514-bdf5-adb31876e316
07/01/2024 23:24:42;1704666282;32673;-0,3677696;-0,2740244;Agent;Medium;195499e0-226c-48b7-9ba1-55fc4c93e049
07/01/2024 23:24:42;1704666282;32673;-0,3677696;-0,2740244;Agent;Medium;195499e0-226c-48b7-9ba1-55fc4c93e049
07/01/2024 23:24:42;1704666282;32683;0,2389767;0,4619307;Agent;Large;cdd9ec51-e790-49c8-a647-3fcc96851be2
07/01/2024 23:24:42;1704666282;32683;0,2389767;0,4619307;Agent;Large;cdd9ec51-e790-49c8-a647-3fcc96851be2
07/01/2024 23:24:42;1704666282;32683;-0,7666456;-0,4019263;Agent;Large;c38a76e6-02a6-44f5-9ab2-da2526ca441d
07/01/2024 23:24:42;1704666282;32684;0,2813104;0,1946468;Agent;Medium;cdd9ec51-e790-49c8-a647-3fcc96851be2
07/01/2024 23:24:42;1704666282;32684;-0,8320066;0,06314149;Agent;Medium;c38a76e6-02a6-44f5-9ab2-da2526ca441d
07/01/2024 23:24:42;1704666282;32694;0,4219916;1,094648;Agent;Large;78fc9a12-c84c-4465-bf5e-d70661ca7fce
07/01/2024 23:24:42;1704666282;32694;0,4219916;1,094648;Agent;Large;78fc9a12-c84c-4465-bf5e-d70661ca7fce
07/01/2024 23:24:42;1704666282;32694;-0,7307016;-0,02431902;Agent;Large;9a24e26f-9c14-4ee3-a9ec-6c47589adf2c
07/01/2024 23:24:42;1704666282;32694;0,406298;0,6452441;Agent;Large;78fc9a12-c84c-4465-bf5e-d70661ca7fce
07/01/2024 23:24:42;1704666282;32694;0,406298;0,6452441;Agent;Medium;78fc9a12-c84c-4465-bf5e-d70661ca7fce
07/01/2024 23:24:43;1704666283;32705;0,1966978;0,4645621;Agent;Medium;86f61146-464f-4bc0-9a07-cfc5807abfe9
07/01/2024 23:24:43;1704666283;32705;0,1966978;0,4645621;Agent;Medium;86f61146-464f-4bc0-9a07-cfc5807abfe9
07/01/2024 23:24:43;1704666283;32705;-0,6882136;-0,3221357;Agent;Medium;fb46ac18-96ad-4e34-ace8-16e9c8f1a19a
07/01/2024 23:24:43;1704666283;32705;-0,6882136;-0,3221357;Agent;Medium;fb46ac18-96ad-4e34-ace8-16e9c8f1a19a
07/01/2024 23:24:43;1704666283;32716;0,5241848;1,034367;Agent;Large;a33797b1-96e7-4e7f-bdd8-6c7b010f9962
07/01/2024 23:24:43;1704666283;32716;-0,730988;0,3536212;Agent;Large;2a347767-d37a-42aa-b949-63a50782b3f4
07/01/2024 23:24:43;1704666283;32727;0,421995;0,5721176;Agent;Large;07d65ee0-5568-4977-88ec-163fb4756d1a
07/01/2024 23:24:43;1704666283;32727;0,421995;0,5721176;Agent;Large;07d65ee0-5568-4977-88ec-163fb4756d1a
07/01/2024 23:24:43;1704666283;32727;-0,4560884;-0,6317073;Agent;Large;048088bd-9f5f-4148-b36c-c5cfcc0bf2ab
07/01/2024 23:24:43;1704666283;32727;-0,4560884;-0,6317073;Agent;Large;048088bd-9f5f-4148-b36c-c5cfcc0bf2ab
07/01/2024 23:24:43;1704666283;32727;0,3062518;0,1401582;Agent;Medium;07d65ee0-5568-4977-88ec-163fb4756d1a
07/01/2024 23:24:43;1704666283;32727;0,3062518;0,1401582;Agent;Medium;07d65ee0-5568-4977-88ec-163fb4756d1a
07/01/2024 23:24:43;1704666283;32727;0,3062518;0,1401582;Agent;Medium;07d65ee0-5568-4977-88ec-163fb4756d1a
07/01/2024 23:24:43;1704666283;32727;-0,5643219;-0,2277738;Agent;Medium;048088bd-9f5f-4148-b36c-c5cfcc0bf2ab
07/01/2024 23:24:43;1704666283;32727;-0,5643219;-0,2277738;Agent;Medium;048088bd-9f5f-4148-b36c-c5cfcc0bf2ab
07/01/2024 23:24:43;1704666283;32738;0,4898512;0,6266713;Agent;Medium;cf30f372-d578-487a-92ab-37d32d0fc39c
07/01/2024 23:24:43;1704666283;32738;0,4898512;0,6266713;Agent;Large;cf30f372-d578-487a-92ab-37d32d0fc39c
07/01/2024 23:24:43;1704666283;32738;-0,4095291;-0,2657101;Agent;Large;ff96fa8a-87b3-4101-aafd-627ba135dfac
07/01/2024 23:24:43;1704666283;32738;-0,4095291;-0,2657101;Agent;Medium;ff96fa8a-87b3-4101-aafd-627ba135dfac
07/01/2024 23:24:43;1704666283;32738;-0,4095291;-0,2657101;Agent;Large;ff96fa8a-87b3-4101-aafd-627ba135dfac
07/01/2024 23:24:43;1704666283;32738;0,5450932;0,176759;Agent;Medium;cf30f372-d578-487a-92ab-37d32d0fc39c
07/01/2024 23:24:43;1704666283;32750;0,5357223;0,4700717;Agent;Large;00bc3362-3636-4e63-8397-de1a48ad3e32
07/01/2024 23:24:43;1704666283;32750;-0,3827775;-0,9334922;Agent;Large;da9af7c3-6be5-46aa-9554-18efb99cdc91
07/01/2024 23:24:43;1704666283;32750;0,5959799;0,04131433;Agent;Medium;00bc3362-3636-4e63-8397-de1a48ad3e32
07/01/2024 23:24:43;1704666283;32750;-0,4999002;-0,5250364;Agent;Large;da9af7c3-6be5-46aa-9554-18efb99cdc91
07/01/2024 23:24:43;1704666283;32750;-0,4999002;-0,5250364;Agent;Medium;da9af7c3-6be5-46aa-9554-18efb99cdc91
07/01/2024 23:24:44;1704666284;32761;0,6352687;0,6133575;Agent;Large;b9fbe59d-7b83-4488-8522-3dfeecff9e2c
07/01/2024 23:24:44;1704666284;32761;0,6352687;0,6133575;Agent;Large;b9fbe59d-7b83-4488-8522-3dfeecff9e2c
07/01/2024 23:24:44;1704666284;32761;-0,4515643;-0,4684285;Agent;Large;66dc4fb3-441f-4f73-91cf-f2702124b8bf
07/01/2024 23:24:44;1704666284;32761;-0,4515643;-0,4684285;Agent;Large;66dc4fb3-441f-4f73-91cf-f2702124b8bf
07/01/2024 23:24:44;1704666284;32762;-0,4745473;-0,02989081;Agent;Medium;66dc4fb3-441f-4f73-91cf-f2702124b8bf
07/01/2024 23:24:44;1704666284;32772;0,4368676;0,7259399;Agent;Medium;1bb56cf6-163d-418d-827a-f2a1ecc0acb5
07/01/2024 23:24:44;1704666284;32772;0,4368676;0,7259399;Agent;Medium;1bb56cf6-163d-418d-827a-f2a1ecc0acb5
07/01/2024 23:24:44;1704666284;32772;-0,546815;-0,003312588;Agent;Large;005d62c2-e47a-4d8a-b198-d5cffb296396
07/01/2024 23:24:44;1704666284;32772;-0,546815;-0,003312588;Agent;Medium;005d62c2-e47a-4d8a-b198-d5cffb296396
07/01/2024 23:24:44;1704666284;32784;0,5623435;0,5389529;Agent;Large;15f37574-d28a-4a5b-8492-0f11a6d88607
07/01/2024 23:24:44;1704666284;32784;-0,4787283;-0,6681716;Agent;Large;19e430bb-2c5a-4619-a7b0-704b78968731
07/01/2024 23:24:44;1704666284;32795;0,2696527;0,7146314;Agent;Large;fa8d0c19-8a72-48a5-a9e5-0f80b337c1aa
07/01/2024 23:24:44;1704666284;32795;0,2696527;0,7146314;Agent;Large;fa8d0c19-8a72-48a5-a9e5-0f80b337c1aa
07/01/2024 23:24:44;1704666284;32795;-0,7904482;-0,4137954;Agent;Large;eff8b856-0622-46b7-966b-bd223f1b09ab
07/01/2024 23:24:44;1704666284;32795;-0,7904482;-0,4137954;Agent;Large;eff8b856-0622-46b7-966b-bd223f1b09ab
07/01/2024 23:24:44;1704666284;32795;0,2388015;0,2734376;Agent;Medium;fa8d0c19-8a72-48a5-a9e5-0f80b337c1aa
07/01/2024 23:24:44;1704666284;32795;0,2388015;0,2734376;Agent;Medium;fa8d0c19-8a72-48a5-a9e5-0f80b337c1aa
07/01/2024 23:24:45;1704666285;32805;0,628785;0,4434707;Agent;Large;9fc7c12c-6420-41ed-9be9-c9307be703a2
07/01/2024 23:24:45;1704666285;32805;0,628785;0,4434707;Agent;Medium;9fc7c12c-6420-41ed-9be9-c9307be703a2
07/01/2024 23:24:45;1704666285;32805;0,628785;0,4434707;Agent;Large;9fc7c12c-6420-41ed-9be9-c9307be703a2
07/01/2024 23:24:45;1704666285;32805;-0,1974719;-0,4516318;Agent;Medium;35c16de4-df51-4823-acf4-87fdaa95ddab
07/01/2024 23:24:45;1704666285;32805;-0,1974719;-0,4516318;Agent;Medium;35c16de4-df51-4823-acf4-87fdaa95ddab
07/01/2024 23:24:45;1704666285;32806;-0,1735756;0,004333884;Agent;Medium;35c16de4-df51-4823-acf4-87fdaa95ddab
07/01/2024 23:24:45;1704666285;32817;0,6584208;0,601616;Agent;Large;60bff57f-7511-4fd2-8828-dfc5458626dc
07/01/2024 23:24:45;1704666285;32817;0,6584208;0,601616;Agent;Medium;60bff57f-7511-4fd2-8828-dfc5458626dc
07/01/2024 23:24:45;1704666285;32817;0,6584208;0,601616;Agent;Medium;60bff57f-7511-4fd2-8828-dfc5458626dc
07/01/2024 23:24:45;1704666285;32817;-0,2733611;-0,2106438;Agent;Large;8409e1b4-7ad0-4f41-ae2e-8691446687b4
07/01/2024 23:24:45;1704666285;32817;-0,2733611;-0,2106438;Agent;Medium;8409e1b4-7ad0-4f41-ae2e-8691446687b4
07/01/2024 23:24:45;1704666285;32817;-0,2733611;-0,2106438;Agent;Medium;8409e1b4-7ad0-4f41-ae2e-8691446687b4
07/01/2024 23:24:45;1704666285;32817;0,6584208;0,1688457;Agent;Medium;60bff57f-7511-4fd2-8828-dfc5458626dc
07/01/2024 23:24:45;1704666285;32828;0,5148843;1,4048;Agent;Large;dd4224e7-2a43-420d-8451-d837d7777dc7
07/01/2024 23:24:45;1704666285;32828;0,5148843;1,4048;Agent;Large;dd4224e7-2a43-420d-8451-d837d7777dc7
07/01/2024 23:24:45;1704666285;32828;-0,6825311;0,3429747;Agent;Large;d2c30b8f-2bd1-4600-9763-b61997eab888
07/01/2024 23:24:45;1704666285;32839;0,1878592;0,6749723;Agent;Medium;5cba094b-607f-4a24-88c6-8f1f62d0bb7c
07/01/2024 23:24:45;1704666285;32839;0,1878592;0,6749723;Agent;Medium;5cba094b-607f-4a24-88c6-8f1f62d0bb7c
07/01/2024 23:24:45;1704666285;32839;-0,2827672;-0,4472816;Agent;Medium;899e0818-7c0c-4def-9959-f6299a5ddf8b
07/01/2024 23:24:45;1704666285;32839;-0,2827672;-0,4472816;Agent;Medium;899e0818-7c0c-4def-9959-f6299a5ddf8b
07/01/2024 23:24:45;1704666285;32839;-0,2827672;-0,4472816;Agent;Medium;899e0818-7c0c-4def-9959-f6299a5ddf8b
07/01/2024 23:24:45;1704666285;32839;0,4301199;0,2379224;Agent;Small;5cba094b-607f-4a24-88c6-8f1f62d0bb7c
07/01/2024 23:24:45;1704666285;32839;-0,3721513;0,01255976;Agent;Medium;899e0818-7c0c-4def-9959-f6299a5ddf8b
07/01/2024 23:24:45;1704666285;32839;-0,3721513;0,01255976;Agent;Small;899e0818-7c0c-4def-9959-f6299a5ddf8b
07/01/2024 23:24:45;1704666285;32839;-0,3721513;0,01255976;Agent;Small;899e0818-7c0c-4def-9959-f6299a5ddf8b
07/01/2024 23:24:45;1704666285;32850;0,4866676;-0,1150497;Agent;Large;e51c4653-51bd-472b-942a-634993645c07
07/01/2024 23:24:45;1704666285;32850;-0,6372198;-1,147909;Agent;Large;3f561b3d-263a-4641-ae93-80d4fe220ff1
07/01/2024 23:24:45;1704666285;32850;-0,6141966;-0,7085977;Agent;Large;3f561b3d-263a-4641-ae93-80d4fe220ff1
07/01/2024 23:24:45;1704666285;32850;-0,6141966;-0,7085977;Agent;Medium;3f561b3d-263a-4641-ae93-80d4fe220ff1
07/01/2024 23:24:46;1704666286;32861;0,7947532;0,3787797;Agent;Large;bdfd5f10-6411-4c9d-9b31-72b486a1df4e
07/01/2024 23:24:46;1704666286;32861;-0,5639601;-0,3187803;Agent;Large;17e65528-c6fe-4cb1-8b08-c6ce3823a196
07/01/2024 23:24:46;1704666286;32871;0,6539411;0,9553231;Agent;Large;86533f74-1a76-4e58-be54-5d53300d6294
07/01/2024 23:24:46;1704666286;32871;-0,5966469;-0,05317245;Agent;Large;d7632b8e-1e20-4b89-b072-1f4891cd2a20
07/01/2024 23:24:46;1704666286;32872;0,5957077;0,5409683;Agent;Large;86533f74-1a76-4e58-be54-5d53300d6294
07/01/2024 23:24:46;1704666286;32883;0,3498812;0,9940284;Agent;Large;6baf75ab-9c30-486b-be9f-34636cc8e3e7
07/01/2024 23:24:46;1704666286;32883;0,3498812;0,9940284;Agent;Medium;6baf75ab-9c30-486b-be9f-34636cc8e3e7
07/01/2024 23:24:46;1704666286;32883;0,3498812;0,9940284;Agent;Medium;6baf75ab-9c30-486b-be9f-34636cc8e3e7
07/01/2024 23:24:46;1704666286;32883;0,3498812;0,9940284;Agent;Large;6baf75ab-9c30-486b-be9f-34636cc8e3e7
07/01/2024 23:24:46;1704666286;32883;-0,405728;-0,05562705;Agent;Medium;1816d841-4d33-4102-b734-9676adbdde0c
07/01/2024 23:24:46;1704666286;32883;-0,405728;-0,05562705;Agent;Medium;1816d841-4d33-4102-b734-9676adbdde0c
07/01/2024 23:24:46;1704666286;32883;0,274318;0,5654874;Agent;Small;6baf75ab-9c30-486b-be9f-34636cc8e3e7
07/01/2024 23:24:46;1704666286;32883;0,274318;0,5654874;Agent;Small;6baf75ab-9c30-486b-be9f-34636cc8e3e7
07/01/2024 23:24:46;1704666286;32883;0,274318;0,5654874;Agent;Small;6baf75ab-9c30-486b-be9f-34636cc8e3e7
07/01/2024 23:24:46;1704666286;32883;0,274318;0,5654874;Agent;Small;6baf75ab-9c30-486b-be9f-34636cc8e3e7
07/01/2024 23:24:46;1704666286;32883;-0,3981021;0,3812694;Agent;Small;1816d841-4d33-4102-b734-9676adbdde0c
07/01/2024 23:24:46;1704666286;32883;-0,3981021;0,3812694;Agent;Small;1816d841-4d33-4102-b734-9676adbdde0c
07/01/2024 23:24:46;1704666286;32883;-0,3981021;0,3812694;Agent;Small;1816d841-4d33-4102-b734-9676adbdde0c
07/01/2024 23:24:46;1704666286;32883;-0,3981021;0,3812694;Agent;Small;1816d841-4d33-4102-b734-9676adbdde0c
07/01/2024 23:24:46;1704666286;32894;0,4585381;0,8796721;Agent;Large;e5ef37b8-fa4d-4de8-8409-0d696da38ee8
07/01/2024 23:24:46;1704666286;32894;0,4585381;0,8796721;Agent;Large;e5ef37b8-fa4d-4de8-8409-0d696da38ee8
07/01/2024 23:24:46;1704666286;32894;-0,5069377;-0,04703577;Agent;Large;a211107d-7839-4e9c-8b63-80ee0449bc91
07/01/2024 23:24:46;1704666286;32894;-0,5069377;-0,04703577;Agent;Large;a211107d-7839-4e9c-8b63-80ee0449bc91
07/01/2024 23:24:46;1704666286;32894;-0,5463734;0,4037169;Agent;Medium;a211107d-7839-4e9c-8b63-80ee0449bc91
07/01/2024 23:24:46;1704666286;32905;0,4478256;1,084546;Agent;Large;dd981e53-e0ba-4a6e-ac1d-58500aabf4f0
07/01/2024 23:24:46;1704666286;32905;0,4478256;1,084546;Agent;Large;dd981e53-e0ba-4a6e-ac1d-58500aabf4f0
07/01/2024 23:24:46;1704666286;32905;-0,580872;-0,2323281;Agent;Large;8841c33f-7088-4994-bd3a-f9e9d71f836e
07/01/2024 23:24:46;1704666286;32905;0,4011167;0,6401386;Agent;Medium;dd981e53-e0ba-4a6e-ac1d-58500aabf4f0
07/01/2024 23:24:46;1704666286;32905;0,4011167;0,6401386;Agent;Medium;dd981e53-e0ba-4a6e-ac1d-58500aabf4f0
07/01/2024 23:24:46;1704666286;32905;-0,7021508;0,2202898;Agent;Medium;8841c33f-7088-4994-bd3a-f9e9d71f836e
07/01/2024 23:24:47;1704666287;32916;0,7284318;0,8520377;Agent;Large;cbe32aae-4087-4fdd-a235-72cf59aaaf9c
07/01/2024 23:24:47;1704666287;32916;-0,5490914;-0,2148598;Agent;Large;42434bcb-5527-4a27-b8ea-e4a17ca3f897
07/01/2024 23:24:47;1704666287;32926;0,8571858;0,2117754;Agent;Large;27013b28-083e-476f-acdd-2aa34051250c
07/01/2024 23:24:47;1704666287;32926;-0,5719022;-0,3340006;Agent;Large;e5ec8ab0-c29d-4c95-b623-de69eaafb50b
07/01/2024 23:24:47;1704666287;32937;0,4341351;0,8114135;Agent;Large;0d9c63f9-a419-4418-a2a7-2c7eb2310c0e
07/01/2024 23:24:47;1704666287;32937;0,4341351;0,8114135;Agent;Large;0d9c63f9-a419-4418-a2a7-2c7eb2310c0e
07/01/2024 23:24:47;1704666287;32937;-0,3083526;-0,6104417;Agent;Large;7cbe3be3-9ee6-4891-b1e4-2b0c875b8a8e
07/01/2024 23:24:47;1704666287;32937;-0,3083526;-0,6104417;Agent;Large;7cbe3be3-9ee6-4891-b1e4-2b0c875b8a8e
07/01/2024 23:24:47;1704666287;32937;-0,3083526;-0,6104417;Agent;Large;7cbe3be3-9ee6-4891-b1e4-2b0c875b8a8e
07/01/2024 23:24:47;1704666287;32937;0,4564444;0,3857308;Agent;Small;0d9c63f9-a419-4418-a2a7-2c7eb2310c0e
07/01/2024 23:24:47;1704666287;32937;0,4564444;0,3857308;Agent;Small;0d9c63f9-a419-4418-a2a7-2c7eb2310c0e
07/01/2024 23:24:47;1704666287;32937;0,4564444;0,3857308;Agent;Small;0d9c63f9-a419-4418-a2a7-2c7eb2310c0e
07/01/2024 23:24:47;1704666287;32937;-0,1762745;-0,1498308;Agent;Medium;7cbe3be3-9ee6-4891-b1e4-2b0c875b8a8e
07/01/2024 23:24:47;1704666287;32937;-0,1762745;-0,1498308;Agent;Small;7cbe3be3-9ee6-4891-b1e4-2b0c875b8a8e
07/01/2024 23:24:47;1704666287;32937;-0,1762745;-0,1498308;Agent;Small;7cbe3be3-9ee6-4891-b1e4-2b0c875b8a8e
07/01/2024 23:24:47;1704666287;32937;-0,1762745;-0,1498308;Agent;Small;7cbe3be3-9ee6-4891-b1e4-2b0c875b8a8e
07/01/2024 23:24:47;1704666287;32948;0,3912875;0,5674778;Agent;Medium;2f86abf0-32a4-4df7-ac6b-51600fa996d4
07/01/2024 23:24:47;1704666287;32948;0,3912875;0,5674778;Agent;Large;2f86abf0-32a4-4df7-ac6b-51600fa996d4
07/01/2024 23:24:47;1704666287;32948;-0,5173506;-0,3837683;Agent;Large;ad0ba95b-2d69-4dac-aa2e-1e9eb9119786
07/01/2024 23:24:47;1704666287;32948;-0,5173506;-0,3837683;Agent;Large;ad0ba95b-2d69-4dac-aa2e-1e9eb9119786
07/01/2024 23:24:47;1704666287;32959;-0,6825138;-0,7558685;Agent;Large;93531931-ede5-4019-8f40-660f17e08911
07/01/2024 23:24:48;1704666288;32970;0,7691149;-0,2167372;Agent;Large;241139fa-e52c-436a-819d-5a9e8eff1b0a
07/01/2024 23:24:48;1704666288;32970;0,7691149;-0,2167372;Agent;Large;241139fa-e52c-436a-819d-5a9e8eff1b0a
07/01/2024 23:24:48;1704666288;32970;-0,4028832;-1,226353;Agent;Large;2fc5d3eb-1ea9-4346-b93d-aa27768ef12e
07/01/2024 23:24:48;1704666288;32970;-0,4028832;-1,226353;Agent;Large;2fc5d3eb-1ea9-4346-b93d-aa27768ef12e
07/01/2024 23:24:48;1704666288;32971;0,7767788;-0,6558005;Agent;Medium;241139fa-e52c-436a-819d-5a9e8eff1b0a
07/01/2024 23:24:48;1704666288;32971;-0,3256423;-0,7882968;Agent;Medium;2fc5d3eb-1ea9-4346-b93d-aa27768ef12e
07/01/2024 23:24:48;1704666288;32971;-0,3256423;-0,7882968;Agent;Medium;2fc5d3eb-1ea9-4346-b93d-aa27768ef12e
07/01/2024 23:24:48;1704666288;32982;0,5589631;0,5678027;Agent;Large;c4d2a3b3-a9b1-46ba-9c13-ed634daea454
07/01/2024 23:24:48;1704666288;32982;-0,7890897;0,09260619;Agent;Large;c118fc79-1dd4-4773-bf76-6c3043051a33
07/01/2024 23:24:49;1704666289;33015;0,1784568;0,9584682;Agent;Large;4efe403b-ef81-4741-84d5-b1de9f5af9f8
07/01/2024 23:24:49;1704666289;33015;0,1784568;0,9584682;Agent;Large;4efe403b-ef81-4741-84d5-b1de9f5af9f8
07/01/2024 23:24:49;1704666289;33015;-0,3546941;-0,3563336;Agent;Large;845a5d45-e479-4395-ae55-00bb312685cb
07/01/2024 23:24:49;1704666289;33015;-0,3546941;-0,3563336;Agent;Large;845a5d45-e479-4395-ae55-00bb312685cb
07/01/2024 23:24:49;1704666289;33015;-0,3546941;-0,3563336;Agent;Large;845a5d45-e479-4395-ae55-00bb312685cb
07/01/2024 23:24:49;1704666289;33015;0,2849753;0,4970853;Agent;Small;4efe403b-ef81-4741-84d5-b1de9f5af9f8
07/01/2024 23:24:49;1704666289;33015;0,2849753;0,4970853;Agent;Small;4efe403b-ef81-4741-84d5-b1de9f5af9f8
07/01/2024 23:24:49;1704666289;33015;0,2849753;0,4970853;Agent;Small;4efe403b-ef81-4741-84d5-b1de9f5af9f8
07/01/2024 23:24:49;1704666289;33015;0,2849753;0,4970853;Agent;Small;4efe403b-ef81-4741-84d5-b1de9f5af9f8
07/01/2024 23:24:49;1704666289;33015;-0,3379674;0,1226544;Agent;Small;845a5d45-e479-4395-ae55-00bb312685cb
07/01/2024 23:24:49;1704666289;33015;-0,3379674;0,1226544;Agent;Small;845a5d45-e479-4395-ae55-00bb312685cb
07/01/2024 23:24:49;1704666289;33015;-0,3379674;0,1226544;Agent;Small;845a5d45-e479-4395-ae55-00bb312685cb
07/01/2024 23:24:49;1704666289;33026;0,2983401;1,035902;Agent;Medium;017e1c65-0c18-4468-a00c-ca5ed94ab02c
07/01/2024 23:24:49;1704666289;33026;0,2983401;1,035902;Agent;Medium;017e1c65-0c18-4468-a00c-ca5ed94ab02c
07/01/2024 23:24:49;1704666289;33026;-0,5372732;0,2107072;Agent;Medium;f17fed71-a67b-4d18-b747-bf11cb42f599
07/01/2024 23:24:49;1704666289;33026;-0,5372732;0,2107072;Agent;Medium;f17fed71-a67b-4d18-b747-bf11cb42f599
07/01/2024 23:24:49;1704666289;33026;0,3281256;0,6099522;Agent;Medium;017e1c65-0c18-4468-a00c-ca5ed94ab02c
07/01/2024 23:24:49;1704666289;33026;0,3281256;0,6099522;Agent;Small;017e1c65-0c18-4468-a00c-ca5ed94ab02c
07/01/2024 23:24:49;1704666289;33026;-0,5577286;0,601024;Agent;Small;f17fed71-a67b-4d18-b747-bf11cb42f599
07/01/2024 23:24:49;1704666289;33026;-0,5577286;0,601024;Agent;Small;f17fed71-a67b-4d18-b747-bf11cb42f599
07/01/2024 23:24:49;1704666289;33037;0,550961;0,6146002;Agent;Large;b90b56eb-7bbf-4c0f-b823-52366aeaf737
07/01/2024 23:24:49;1704666289;33037;-0,6243873;-0,5560498;Agent;Large;29afd7dd-3c71-4e8a-bb75-220579d83be3
07/01/2024 23:24:49;1704666289;33048;0,5562269;0,275493;Agent;Large;cc507e3c-973e-4cd4-bc91-7cf0e9392486
07/01/2024 23:24:49;1704666289;33048;0,5562269;0,275493;Agent;Large;cc507e3c-973e-4cd4-bc91-7cf0e9392486
07/01/2024 23:24:49;1704666289;33048;-0,3676329;-0,7838807;Agent;Large;07573789-0b83-4942-a58b-aa8677d292ce
07/01/2024 23:24:49;1704666289;33048;-0,3676329;-0,7838807;Agent;Large;07573789-0b83-4942-a58b-aa8677d292ce
07/01/2024 23:24:49;1704666289;33048;0,6373548;-0,1846046;Agent;Medium;cc507e3c-973e-4cd4-bc91-7cf0e9392486
07/01/2024 23:24:49;1704666289;33048;-0,4568203;-0,3250522;Agent;Medium;07573789-0b83-4942-a58b-aa8677d292ce
07/01/2024 23:24:50;1704666290;33058;0,4643825;0,6249717;Agent;Large;46f4914c-cd44-4eb5-bdd5-cd6da81daf3a
07/01/2024 23:24:50;1704666290;33058;-0,2195396;-0,8462553;Agent;Large;15e2d651-ed54-40f9-ad83-c491649941bd
07/01/2024 23:24:50;1704666290;33058;0,5655508;0,1867646;Agent;Medium;46f4914c-cd44-4eb5-bdd5-cd6da81daf3a
07/01/2024 23:24:50;1704666290;33058;0,5655508;0,1867646;Agent;Medium;46f4914c-cd44-4eb5-bdd5-cd6da81daf3a
07/01/2024 23:24:50;1704666290;33058;0,5655508;0,1867646;Agent;Medium;46f4914c-cd44-4eb5-bdd5-cd6da81daf3a
07/01/2024 23:24:50;1704666290;33058;-0,2750892;-0,3938407;Agent;Medium;15e2d651-ed54-40f9-ad83-c491649941bd
07/01/2024 23:24:50;1704666290;33058;-0,2750892;-0,3938407;Agent;Medium;15e2d651-ed54-40f9-ad83-c491649941bd
07/01/2024 23:24:50;1704666290;33069;0,58206;0,2642364;Agent;Large;02f5c0e3-a4de-48fc-bfac-17517ac531f4
07/01/2024 23:24:50;1704666290;33069;0,58206;0,2642364;Agent;Large;02f5c0e3-a4de-48fc-bfac-17517ac531f4
07/01/2024 23:24:50;1704666290;33069;-0,5059593;-0,4297683;Agent;Large;fc2a5f20-637a-4479-b06f-aa89979ade83
07/01/2024 23:24:50;1704666290;33069;-0,5059593;-0,4297683;Agent;Medium;fc2a5f20-637a-4479-b06f-aa89979ade83
07/01/2024 23:24:50;1704666290;33079;0,8059024;0,5225538;Agent;Large;af89d71e-65e6-4af6-a097-690cd3c83719
07/01/2024 23:24:50;1704666290;33079;-0,3426261;-0,3731216;Agent;Large;a458ae5f-7ee7-4340-87c7-02a31d16685f
07/01/2024 23:24:50;1704666290;33090;0,3808783;1,118012;Agent;Medium;32c5f717-e91e-45b9-ba1f-da3956133695
07/01/2024 23:24:50;1704666290;33090;0,3808783;1,118012;Agent;Medium;32c5f717-e91e-45b9-ba1f-da3956133695
07/01/2024 23:24:50;1704666290;33090;-0,4944059;0,320232;Agent;Medium;5f22800f-be5f-41e7-bbcf-b9c590251380
07/01/2024 23:24:50;1704666290;33090;-0,4944059;0,320232;Agent;Medium;5f22800f-be5f-41e7-bbcf-b9c590251380
07/01/2024 23:24:50;1704666290;33090;0,3149979;0,7020605;Agent;Medium;32c5f717-e91e-45b9-ba1f-da3956133695
07/01/2024 23:24:51;1704666291;33102;0,2986436;0,840297;Agent;Large;6ce75ceb-74a0-4164-a74c-d47afe1be8d8
07/01/2024 23:24:51;1704666291;33102;-0,53234;-0,3817093;Agent;Large;86c62741-887e-4ffd-8bf3-28f73c07f619
07/01/2024 23:24:51;1704666291;33102;-0,631217;0,04657383;Agent;Medium;86c62741-887e-4ffd-8bf3-28f73c07f619
07/01/2024 23:24:51;1704666291;33102;-0,631217;0,04657383;Agent;Medium;86c62741-887e-4ffd-8bf3-28f73c07f619
07/01/2024 23:24:51;1704666291;33112;0,6633905;0,9606633;Agent;Large;1ca3e966-e8d3-4195-8c09-c00e38337afd
07/01/2024 23:24:51;1704666291;33112;0,6633905;0,9606633;Agent;Large;1ca3e966-e8d3-4195-8c09-c00e38337afd
07/01/2024 23:24:51;1704666291;33112;-0,1536567;-0,1113778;Agent;Large;9f661128-80a8-4603-95f0-8a93a8e67c90
07/01/2024 23:24:51;1704666291;33112;-0,1536567;-0,1113778;Agent;Large;9f661128-80a8-4603-95f0-8a93a8e67c90
07/01/2024 23:24:51;1704666291;33112;-0,1536567;-0,1113778;Agent;Large;9f661128-80a8-4603-95f0-8a93a8e67c90
07/01/2024 23:24:51;1704666291;33113;-0,1204561;0,3634134;Agent;Medium;9f661128-80a8-4603-95f0-8a93a8e67c90
07/01/2024 23:24:51;1704666291;33113;-0,1204561;0,3634134;Agent;Medium;9f661128-80a8-4603-95f0-8a93a8e67c90
07/01/2024 23:24:51;1704666291;33123;0,3368689;0,9650265;Agent;Large;0bd3c9fe-9ef4-49d0-b41a-36722a877705
07/01/2024 23:24:51;1704666291;33123;0,3368689;0,9650265;Agent;Large;0bd3c9fe-9ef4-49d0-b41a-36722a877705
07/01/2024 23:24:51;1704666291;33123;0,3368689;0,9650265;Agent;Large;0bd3c9fe-9ef4-49d0-b41a-36722a877705
07/01/2024 23:24:51;1704666291;33123;0,3368689;0,9650265;Agent;Large;0bd3c9fe-9ef4-49d0-b41a-36722a877705
07/01/2024 23:24:51;1704666291;33123;-0,284732;-0,2905209;Agent;Large;c2592261-78de-4213-82f1-ceb440b1c264
07/01/2024 23:24:51;1704666291;33123;-0,284732;-0,2905209;Agent;Large;c2592261-78de-4213-82f1-ceb440b1c264
07/01/2024 23:24:51;1704666291;33123;0,3061268;0,5253946;Agent;Small;0bd3c9fe-9ef4-49d0-b41a-36722a877705
07/01/2024 23:24:51;1704666291;33123;0,3061268;0,5253946;Agent;Small;0bd3c9fe-9ef4-49d0-b41a-36722a877705
07/01/2024 23:24:51;1704666291;33123;0,3061268;0,5253946;Agent;Small;0bd3c9fe-9ef4-49d0-b41a-36722a877705
07/01/2024 23:24:51;1704666291;33123;-0,4105093;0,1481166;Agent;Small;c2592261-78de-4213-82f1-ceb440b1c264
07/01/2024 23:24:51;1704666291;33123;-0,4105093;0,1481166;Agent;Small;c2592261-78de-4213-82f1-ceb440b1c264
07/01/2024 23:24:51;1704666291;33123;-0,4105093;0,1481166;Agent;Small;c2592261-78de-4213-82f1-ceb440b1c264
07/01/2024 23:24:51;1704666291;33134;0,3216731;0,7655612;Agent;Large;46667d75-a9ef-4bb7-80d3-9010846132bc
07/01/2024 23:24:51;1704666291;33134;0,3216731;0,7655612;Agent;Large;46667d75-a9ef-4bb7-80d3-9010846132bc
07/01/2024 23:24:51;1704666291;33134;-0,7737697;0,03876981;Agent;Large;fe006e3c-dacc-484c-8b87-ef66517a19eb
07/01/2024 23:24:52;1704666292;33146;0,7675647;0,4243005;Agent;Large;08505ada-540f-47c2-ab8e-a0a1343fbe9e
07/01/2024 23:24:52;1704666292;33156;0,3495814;0,539585;Agent;Large;85acb715-d611-4052-830b-3ee6527c5799
07/01/2024 23:24:52;1704666292;33156;0,3495814;0,539585;Agent;Medium;85acb715-d611-4052-830b-3ee6527c5799
07/01/2024 23:24:52;1704666292;33156;0,3495814;0,539585;Agent;Large;85acb715-d611-4052-830b-3ee6527c5799
07/01/2024 23:24:52;1704666292;33156;-0,4981076;-0,4456273;Agent;Large;6e9118ae-6e81-4e08-8842-0934f46cdf3c
07/01/2024 23:24:52;1704666292;33156;-0,4981076;-0,4456273;Agent;Medium;6e9118ae-6e81-4e08-8842-0934f46cdf3c
07/01/2024 23:24:52;1704666292;33157;0,2816795;0,1108696;Agent;Medium;85acb715-d611-4052-830b-3ee6527c5799
07/01/2024 23:24:52;1704666292;33157;0,2816795;0,1108696;Agent;Medium;85acb715-d611-4052-830b-3ee6527c5799
07/01/2024 23:24:52;1704666292;33157;-0,6313008;-0,03570041;Agent;Medium;6e9118ae-6e81-4e08-8842-0934f46cdf3c
07/01/2024 23:24:52;1704666292;33167;0,6250312;0,9440728;Agent;Large;2f1558e2-fdd7-4aee-adad-645e6bfb3617
07/01/2024 23:24:52;1704666292;33167;0,6250312;0,9440728;Agent;Large;2f1558e2-fdd7-4aee-adad-645e6bfb3617
07/01/2024 23:24:52;1704666292;33167;-0,2166703;-0,2537913;Agent;Large;0d3f89e1-1529-4fd1-a40e-1f5ebc2c6bda
07/01/2024 23:24:52;1704666292;33167;-0,2166703;-0,2537913;Agent;Large;0d3f89e1-1529-4fd1-a40e-1f5ebc2c6bda
07/01/2024 23:24:52;1704666292;33167;-0,2166703;-0,2537913;Agent;Large;0d3f89e1-1529-4fd1-a40e-1f5ebc2c6bda
07/01/2024 23:24:52;1704666292;33168;0,592539;0,4794114;Agent;Small;2f1558e2-fdd7-4aee-adad-645e6bfb3617
07/01/2024 23:24:52;1704666292;33168;0,592539;0,4794114;Agent;Small;2f1558e2-fdd7-4aee-adad-645e6bfb3617
07/01/2024 23:24:52;1704666292;33168;0,592539;0,4794114;Agent;Small;2f1558e2-fdd7-4aee-adad-645e6bfb3617
07/01/2024 23:24:52;1704666292;33168;-0,1540847;0,1915273;Agent;Medium;0d3f89e1-1529-4fd1-a40e-1f5ebc2c6bda
07/01/2024 23:24:52;1704666292;33168;-0,1540847;0,1915273;Agent;Small;0d3f89e1-1529-4fd1-a40e-1f5ebc2c6bda
07/01/2024 23:24:52;1704666292;33168;-0,1540847;0,1915273;Agent;Small;0d3f89e1-1529-4fd1-a40e-1f5ebc2c6bda
07/01/2024 23:24:52;1704666292;33178;0,3169359;-0,04876284;Agent;Large;e145ce2c-f5d6-41ff-8f1e-a21cccf5235f
07/01/2024 23:24:52;1704666292;33178;0,3169359;-0,04876284;Agent;Large;e145ce2c-f5d6-41ff-8f1e-a21cccf5235f
07/01/2024 23:24:52;1704666292;33178;-0,6773894;-0,9521757;Agent;Large;e4e451dd-b368-4a32-a240-9597e3d7b964
07/01/2024 23:24:52;1704666292;33178;-0,6773894;-0,9521757;Agent;Large;e4e451dd-b368-4a32-a240-9597e3d7b964
07/01/2024 23:24:53;1704666293;33190;0,2985296;0,2589175;Agent;Medium;e74d3b18-d523-4628-949b-97330f32fd8e
07/01/2024 23:24:53;1704666293;33190;0,2985296;0,2589175;Agent;Medium;e74d3b18-d523-4628-949b-97330f32fd8e
07/01/2024 23:24:53;1704666293;33190;-0,2833702;-0,7897553;Agent;Medium;24e10cd2-8280-45ff-9574-2fcd75a2b09b
07/01/2024 23:24:53;1704666293;33190;-0,2833702;-0,7897553;Agent;Medium;24e10cd2-8280-45ff-9574-2fcd75a2b09b
07/01/2024 23:24:53;1704666293;33190;0,4070652;-0,176395;Agent;Small;e74d3b18-d523-4628-949b-97330f32fd8e
07/01/2024 23:24:53;1704666293;33190;0,4070652;-0,176395;Agent;Small;e74d3b18-d523-4628-949b-97330f32fd8e
07/01/2024 23:24:53;1704666293;33190;0,4070652;-0,176395;Agent;Small;e74d3b18-d523-4628-949b-97330f32fd8e
07/01/2024 23:24:53;1704666293;33190;-0,3187659;-0,38518;Agent;Small;24e10cd2-8280-45ff-9574-2fcd75a2b09b
07/01/2024 23:24:53;1704666293;33190;-0,3187659;-0,38518;Agent;Small;24e10cd2-8280-45ff-9574-2fcd75a2b09b
07/01/2024 23:24:53;1704666293;33190;-0,3187659;-0,38518;Agent;Small;24e10cd2-8280-45ff-9574-2fcd75a2b09b
07/01/2024 23:24:53;1704666293;33201;0,7745365;0,02970582;Agent;Large;d5156852-6fa9-4101-901c-3f3367da64c0
07/01/2024 23:24:53;1704666293;33201;-0,4631445;-0,9013227;Agent;Large;fb747730-cafe-418c-a746-1924cb2ec141
07/01/2024 23:24:53;1704666293;33212;0,2636486;0,6494246;Agent;Large;06fdde66-2412-4e77-9082-fd8d2dbb9456
07/01/2024 23:24:53;1704666293;33212;0,2636486;0,6494246;Agent;Large;06fdde66-2412-4e77-9082-fd8d2dbb9456
07/01/2024 23:24:53;1704666293;33212;-0,4522085;-0,5010275;Agent;Large;648fedaa-e17e-4d6c-8bb0-8b14f53af025
07/01/2024 23:24:53;1704666293;33212;-0,4522085;-0,5010275;Agent;Large;648fedaa-e17e-4d6c-8bb0-8b14f53af025
07/01/2024 23:24:53;1704666293;33213;0,3101161;0,2073143;Agent;Medium;06fdde66-2412-4e77-9082-fd8d2dbb9456
07/01/2024 23:24:53;1704666293;33213;0,3101161;0,2073143;Agent;Small;06fdde66-2412-4e77-9082-fd8d2dbb9456
07/01/2024 23:24:53;1704666293;33213;-0,5521653;-0,06806758;Agent;Medium;648fedaa-e17e-4d6c-8bb0-8b14f53af025
07/01/2024 23:24:53;1704666293;33213;-0,5521653;-0,06806758;Agent;Small;648fedaa-e17e-4d6c-8bb0-8b14f53af025
07/01/2024 23:24:53;1704666293;33213;-0,5521653;-0,06806758;Agent;Small;648fedaa-e17e-4d6c-8bb0-8b14f53af025
07/01/2024 23:24:53;1704666293;33223;0,5655082;0,4611201;Agent;Large;91f3af24-d9a5-4b0a-b499-e5c765f164cd
07/01/2024 23:24:53;1704666293;33223;0,5655082;0,4611201;Agent;Medium;91f3af24-d9a5-4b0a-b499-e5c765f164cd
07/01/2024 23:24:53;1704666293;33223;-0,564472;-0,1429599;Agent;Large;acafd294-1cf8-4623-9b58-f309675d0cb7
07/01/2024 23:24:53;1704666293;33223;-0,564472;-0,1429599;Agent;Medium;acafd294-1cf8-4623-9b58-f309675d0cb7
07/01/2024 23:24:53;1704666293;33234;0,04232019;0,977942;Agent;Large;6a534d6b-01f9-4ff1-864d-fb2cc2be5b9b
07/01/2024 23:24:53;1704666293;33234;0,04232019;0,977942;Agent;Large;6a534d6b-01f9-4ff1-864d-fb2cc2be5b9b
07/01/2024 23:24:53;1704666293;33234;0,04232019;0,977942;Agent;Large;6a534d6b-01f9-4ff1-864d-fb2cc2be5b9b
07/01/2024 23:24:53;1704666293;33234;-0,1573207;-0,6229038;Agent;Large;208b0035-07f0-443d-8c4e-5770e6b68df2
07/01/2024 23:24:53;1704666293;33234;-0,1573207;-0,6229038;Agent;Large;208b0035-07f0-443d-8c4e-5770e6b68df2
07/01/2024 23:24:53;1704666293;33234;-0,1573207;-0,6229038;Agent;Large;208b0035-07f0-443d-8c4e-5770e6b68df2
07/01/2024 23:24:53;1704666293;33234;-0,1573207;-0,6229038;Agent;Large;208b0035-07f0-443d-8c4e-5770e6b68df2
07/01/2024 23:24:53;1704666293;33234;-0,1573207;-0,6229038;Agent;Large;208b0035-07f0-443d-8c4e-5770e6b68df2
07/01/2024 23:24:53;1704666293;33234;0,07362995;0,8755326;Agent;Medium;6a534d6b-01f9-4ff1-864d-fb2cc2be5b9b
07/01/2024 23:24:53;1704666293;33234;0,07362995;0,8755326;Agent;Medium;6a534d6b-01f9-4ff1-864d-fb2cc2be5b9b
07/01/2024 23:24:53;1704666293;33234;0,07362995;0,8755326;Agent;Medium;6a534d6b-01f9-4ff1-864d-fb2cc2be5b9b
07/01/2024 23:24:53;1704666293;33234;0,07362995;0,8755326;Agent;Medium;6a534d6b-01f9-4ff1-864d-fb2cc2be5b9b
07/01/2024 23:24:53;1704666293;33234;-0,1652267;-0,1699743;Agent;Medium;208b0035-07f0-443d-8c4e-5770e6b68df2
07/01/2024 23:24:53;1704666293;33234;-0,1652267;-0,1699743;Agent;Medium;208b0035-07f0-443d-8c4e-5770e6b68df2
07/01/2024 23:24:53;1704666293;33234;-0,1652267;-0,1699743;Agent;Medium;208b0035-07f0-443d-8c4e-5770e6b68df2
07/01/2024 23:24:53;1704666293;33234;-0,1652267;-0,1699743;Agent;Medium;208b0035-07f0-443d-8c4e-5770e6b68df2
07/01/2024 23:24:53;1704666293;33234;-0,1652267;-0,1699743;Agent;Medium;208b0035-07f0-443d-8c4e-5770e6b68df2
07/01/2024 23:24:53;1704666293;33234;-0,1652267;-0,1699743;Agent;Medium;208b0035-07f0-443d-8c4e-5770e6b68df2
07/01/2024 23:24:53;1704666293;33234;0,1935389;0,6625689;Agent;Small;6a534d6b-01f9-4ff1-864d-fb2cc2be5b9b
07/01/2024 23:24:53;1704666293;33234;0,1935389;0,6625689;Agent;Small;6a534d6b-01f9-4ff1-864d-fb2cc2be5b9b
07/01/2024 23:24:53;1704666293;33234;0,1935389;0,6625689;Agent;Small;6a534d6b-01f9-4ff1-864d-fb2cc2be5b9b
07/01/2024 23:24:53;1704666293;33234;0,1935389;0,6625689;Agent;Small;6a534d6b-01f9-4ff1-864d-fb2cc2be5b9b
07/01/2024 23:24:53;1704666293;33234;0,1935389;0,6625689;Agent;Small;6a534d6b-01f9-4ff1-864d-fb2cc2be5b9b
07/01/2024 23:24:53;1704666293;33234;-0,1854239;0,2226361;Agent;Small;208b0035-07f0-443d-8c4e-5770e6b68df2
07/01/2024 23:24:53;1704666293;33234;-0,1854239;0,2226361;Agent;Small;208b0035-07f0-443d-8c4e-5770e6b68df2
07/01/2024 23:24:53;1704666293;33234;-0,1854239;0,2226361;Agent;Small;208b0035-07f0-443d-8c4e-5770e6b68df2
07/01/2024 23:24:53;1704666293;33234;-0,1854239;0,2226361;Agent;Small;208b0035-07f0-443d-8c4e-5770e6b68df2
07/01/2024 23:24:53;1704666293;33234;-0,1854239;0,2226361;Agent;Small;208b0035-07f0-443d-8c4e-5770e6b68df2
07/01/2024 23:24:53;1704666293;33234;-0,1854239;0,2226361;Agent;Small;208b0035-07f0-443d-8c4e-5770e6b68df2
07/01/2024 23:24:53;1704666293;33234;-0,2578415;0,2952998;Agent;Small;208b0035-07f0-443d-8c4e-5770e6b68df2
07/01/2024 23:24:53;1704666293;33234;-0,2578415;0,2952998;Agent;Small;208b0035-07f0-443d-8c4e-5770e6b68df2
07/01/2024 23:24:54;1704666294;33245;0,2455329;0,9506282;Agent;Large;60b4db59-983f-4f56-9907-dfaaca775dcf
07/01/2024 23:24:54;1704666294;33245;0,2455329;0,9506282;Agent;Medium;60b4db59-983f-4f56-9907-dfaaca775dcf
07/01/2024 23:24:54;1704666294;33245;0,2455329;0,9506282;Agent;Medium;60b4db59-983f-4f56-9907-dfaaca775dcf
07/01/2024 23:24:54;1704666294;33245;-0,2467427;-0,2429746;Agent;Large;e1e830e1-43b6-4116-be47-950a42e89c60
07/01/2024 23:24:54;1704666294;33245;-0,2467427;-0,2429746;Agent;Medium;e1e830e1-43b6-4116-be47-950a42e89c60
07/01/2024 23:24:54;1704666294;33245;0,2837119;0,5142399;Agent;Small;60b4db59-983f-4f56-9907-dfaaca775dcf
07/01/2024 23:24:54;1704666294;33245;0,2837119;0,5142399;Agent;Small;60b4db59-983f-4f56-9907-dfaaca775dcf
07/01/2024 23:24:54;1704666294;33245;0,2837119;0,5142399;Agent;Small;60b4db59-983f-4f56-9907-dfaaca775dcf
07/01/2024 23:24:54;1704666294;33245;0,2837119;0,5142399;Agent;Small;60b4db59-983f-4f56-9907-dfaaca775dcf
07/01/2024 23:24:54;1704666294;33245;-0,368017;0,1799597;Agent;Small;e1e830e1-43b6-4116-be47-950a42e89c60
07/01/2024 23:24:54;1704666294;33245;-0,368017;0,1799597;Agent;Small;e1e830e1-43b6-4116-be47-950a42e89c60
07/01/2024 23:24:54;1704666294;33245;-0,368017;0,1799597;Agent;Small;e1e830e1-43b6-4116-be47-950a42e89c60
07/01/2024 23:24:54;1704666294;33256;0,5396864;1,009015;Agent;Large;99a4c996-9faa-40d9-8b3f-f36deb367596
07/01/2024 23:24:54;1704666294;33256;0,5396864;1,009015;Agent;Large;99a4c996-9faa-40d9-8b3f-f36deb367596
07/01/2024 23:24:54;1704666294;33256;-0,3945686;-0,0829064;Agent;Large;8cbf3c53-f8cd-47fe-a651-b42605cd25f3
07/01/2024 23:24:54;1704666294;33256;-0,3945686;-0,0829064;Agent;Large;8cbf3c53-f8cd-47fe-a651-b42605cd25f3
07/01/2024 23:24:54;1704666294;33256;0,5475614;0,5578495;Agent;Medium;99a4c996-9faa-40d9-8b3f-f36deb367596
07/01/2024 23:24:54;1704666294;33256;0,5475614;0,5578495;Agent;Medium;99a4c996-9faa-40d9-8b3f-f36deb367596
07/01/2024 23:24:54;1704666294;33256;-0,4502763;0,3707965;Agent;Medium;8cbf3c53-f8cd-47fe-a651-b42605cd25f3
07/01/2024 23:24:54;1704666294;33267;0,5126892;0,5220217;Agent;Large;001d8ce9-92fc-4d6b-b628-1710bf8e1616
07/01/2024 23:24:54;1704666294;33267;0,5126892;0,5220217;Agent;Large;001d8ce9-92fc-4d6b-b628-1710bf8e1616
07/01/2024 23:24:54;1704666294;33267;-0,450926;-0,6621258;Agent;Large;15ce5575-29f8-4342-bdf4-6be2bd9fca05
07/01/2024 23:24:54;1704666294;33267;-0,450926;-0,6621258;Agent;Large;15ce5575-29f8-4342-bdf4-6be2bd9fca05
07/01/2024 23:24:54;1704666294;33267;0,6672541;0,07313256;Agent;Medium;001d8ce9-92fc-4d6b-b628-1710bf8e1616
07/01/2024 23:24:54;1704666294;33267;-0,4818774;-0,2195006;Agent;Medium;15ce5575-29f8-4342-bdf4-6be2bd9fca05
07/01/2024 23:24:54;1704666294;33267;-0,4818774;-0,2195006;Agent;Medium;15ce5575-29f8-4342-bdf4-6be2bd9fca05
07/01/2024 23:24:54;1704666294;33277;0,2986089;0,3559717;Agent;Medium;2c0a1e8d-ffd9-421b-a419-788ee880bcdf
07/01/2024 23:24:54;1704666294;33277;0,2986089;0,3559717;Agent;Medium;2c0a1e8d-ffd9-421b-a419-788ee880bcdf
07/01/2024 23:24:54;1704666294;33277;0,2986089;0,3559717;Agent;Medium;2c0a1e8d-ffd9-421b-a419-788ee880bcdf
07/01/2024 23:24:54;1704666294;33277;0,2986089;0,3559717;Agent;Medium;2c0a1e8d-ffd9-421b-a419-788ee880bcdf
07/01/2024 23:24:54;1704666294;33277;-0,2989745;-0,4151235;Agent;Medium;d2986461-09ea-4902-90b4-01f46f8ccd0b
07/01/2024 23:24:54;1704666294;33277;-0,2989745;-0,4151235;Agent;Medium;d2986461-09ea-4902-90b4-01f46f8ccd0b
07/01/2024 23:24:54;1704666294;33277;-0,2989745;-0,4151235;Agent;Medium;d2986461-09ea-4902-90b4-01f46f8ccd0b
07/01/2024 23:24:54;1704666294;33278;0,3064825;-0,0951117;Agent;Small;2c0a1e8d-ffd9-421b-a419-788ee880bcdf
07/01/2024 23:24:54;1704666294;33278;0,3064825;-0,0951117;Agent;Small;2c0a1e8d-ffd9-421b-a419-788ee880bcdf
07/01/2024 23:24:54;1704666294;33278;-0,4037581;0,00514023;Agent;Small;d2986461-09ea-4902-90b4-01f46f8ccd0b
07/01/2024 23:24:55;1704666295;33289;0,5643497;0,1972736;Agent;Large;e51a68ca-017d-47d8-b164-6aa804c6254b
07/01/2024 23:24:55;1704666295;33289;0,5643497;0,1972736;Agent;Large;e51a68ca-017d-47d8-b164-6aa804c6254b
07/01/2024 23:24:55;1704666295;33289;-0,1702796;-0,9055595;Agent;Large;0016dbff-9aaa-453f-8096-dffadcdaf5d6
07/01/2024 23:24:55;1704666295;33289;-0,1702796;-0,9055595;Agent;Large;0016dbff-9aaa-453f-8096-dffadcdaf5d6
07/01/2024 23:24:55;1704666295;33289;-0,1702796;-0,9055595;Agent;Large;0016dbff-9aaa-453f-8096-dffadcdaf5d6
07/01/2024 23:24:55;1704666295;33289;0,6886244;-0,2361235;Agent;Medium;e51a68ca-017d-47d8-b164-6aa804c6254b
07/01/2024 23:24:55;1704666295;33289;-0,2409846;-0,4591452;Agent;Medium;0016dbff-9aaa-453f-8096-dffadcdaf5d6
07/01/2024 23:24:55;1704666295;33301;0,281606;1,215253;Agent;Medium;ebbd4736-14c9-44d9-ac62-847aec939926
07/01/2024 23:24:55;1704666295;33301;0,281606;1,215253;Agent;Medium;ebbd4736-14c9-44d9-ac62-847aec939926
07/01/2024 23:24:55;1704666295;33301;-0,4549159;0,4092174;Agent;Medium;1b1b275f-c88e-4c18-b0ed-3a8f7e13a716
07/01/2024 23:24:55;1704666295;33301;-0,4549159;0,4092174;Agent;Medium;1b1b275f-c88e-4c18-b0ed-3a8f7e13a716
07/01/2024 23:24:55;1704666295;33301;-0,4549159;0,4092174;Agent;Medium;1b1b275f-c88e-4c18-b0ed-3a8f7e13a716
07/01/2024 23:24:55;1704666295;33313;0,5476226;0,70461;Agent;Large;11370d3f-93b3-46cd-9484-b2e1be614e06
07/01/2024 23:24:55;1704666295;33313;0,5476226;0,70461;Agent;Large;11370d3f-93b3-46cd-9484-b2e1be614e06
07/01/2024 23:24:55;1704666295;33313;-0,6325544;-0,08106789;Agent;Large;c7462f3f-9095-4413-b190-2ffcb1d38b84
07/01/2024 23:24:55;1704666295;33324;0,6732885;0,6365883;Agent;Large;2b471f15-6ada-457c-bf70-fea9bcb23421
07/01/2024 23:24:56;1704666296;33334;0,4552544;0,4452601;Agent;Large;06358ce5-e2a2-4472-a390-e4d4dfed85d3
07/01/2024 23:24:56;1704666296;33334;0,4552544;0,4452601;Agent;Medium;06358ce5-e2a2-4472-a390-e4d4dfed85d3
07/01/2024 23:24:56;1704666296;33334;-0,6227865;-0,2939946;Agent;Large;d3530211-54f7-4cd8-9991-adf5d3900523
07/01/2024 23:24:56;1704666296;33334;-0,6227865;-0,2939946;Agent;Medium;d3530211-54f7-4cd8-9991-adf5d3900523
07/01/2024 23:24:56;1704666296;33356;0,4597216;0,2864613;Agent;Large;459713f8-0336-4ffd-893d-24dc854607f2
07/01/2024 23:24:56;1704666296;33356;0,4597216;0,2864613;Agent;Large;459713f8-0336-4ffd-893d-24dc854607f2
07/01/2024 23:24:56;1704666296;33356;-0,2791156;-1,170919;Agent;Large;778e1c30-e4e1-47c8-8799-d4fd8a6d1c5c
07/01/2024 23:24:56;1704666296;33356;-0,2791156;-1,170919;Agent;Large;778e1c30-e4e1-47c8-8799-d4fd8a6d1c5c
07/01/2024 23:24:56;1704666296;33357;0,4680351;-0,1898168;Agent;Medium;459713f8-0336-4ffd-893d-24dc854607f2
07/01/2024 23:24:56;1704666296;33357;0,4680351;-0,1898168;Agent;Medium;459713f8-0336-4ffd-893d-24dc854607f2
07/01/2024 23:24:56;1704666296;33357;0,4680351;-0,1898168;Agent;Medium;459713f8-0336-4ffd-893d-24dc854607f2
07/01/2024 23:24:56;1704666296;33357;-0,3840436;-0,750076;Agent;Medium;778e1c30-e4e1-47c8-8799-d4fd8a6d1c5c
07/01/2024 23:24:56;1704666296;33357;-0,3840436;-0,750076;Agent;Medium;778e1c30-e4e1-47c8-8799-d4fd8a6d1c5c
07/01/2024 23:24:56;1704666296;33368;0,4185607;0,191184;Agent;Medium;77dff939-135e-471b-bbcf-9a795de4dbce
07/01/2024 23:24:56;1704666296;33368;0,4185607;0,191184;Agent;Medium;77dff939-135e-471b-bbcf-9a795de4dbce
07/01/2024 23:24:56;1704666296;33368;0,4185607;0,191184;Agent;Medium;77dff939-135e-471b-bbcf-9a795de4dbce
07/01/2024 23:24:56;1704666296;33368;-0,3772381;-0,5267826;Agent;Medium;45d918ed-7f8f-4d53-9291-7a8742f81557
07/01/2024 23:24:56;1704666296;33368;-0,3772381;-0,5267826;Agent;Medium;45d918ed-7f8f-4d53-9291-7a8742f81557
07/01/2024 23:24:56;1704666296;33368;-0,3772381;-0,5267826;Agent;Medium;45d918ed-7f8f-4d53-9291-7a8742f81557
07/01/2024 23:24:56;1704666296;33379;0,3411804;1,068434;Agent;Medium;95f7f65e-19df-4c34-a0fe-96ea82688cba
07/01/2024 23:24:57;1704666297;33379;0,3411804;1,068434;Agent;Medium;95f7f65e-19df-4c34-a0fe-96ea82688cba
07/01/2024 23:24:57;1704666297;33379;-0,4488628;0,1254632;Agent;Medium;ff253063-65a7-44a7-b28c-7155ab06dd42
07/01/2024 23:24:57;1704666297;33379;-0,4488628;0,1254632;Agent;Medium;ff253063-65a7-44a7-b28c-7155ab06dd42
07/01/2024 23:24:57;1704666297;33379;0,3719838;0,6279243;Agent;Medium;95f7f65e-19df-4c34-a0fe-96ea82688cba
07/01/2024 23:24:57;1704666297;33379;0,3719838;0,6279243;Agent;Small;95f7f65e-19df-4c34-a0fe-96ea82688cba
07/01/2024 23:24:57;1704666297;33379;-0,5255099;0,6093951;Agent;Medium;ff253063-65a7-44a7-b28c-7155ab06dd42
07/01/2024 23:24:57;1704666297;33379;-0,5255099;0,6093951;Agent;Small;ff253063-65a7-44a7-b28c-7155ab06dd42
07/01/2024 23:24:57;1704666297;33401;0,3934308;0,5842788;Agent;Large;ef657a29-2b69-48f7-bc33-4d4d8b952a29
07/01/2024 23:24:57;1704666297;33401;0,3934308;0,5842788;Agent;Large;ef657a29-2b69-48f7-bc33-4d4d8b952a29
07/01/2024 23:24:57;1704666297;33401;-0,5492451;-0,4895212;Agent;Large;62a7f369-a95b-405d-b8b9-9f89e535be77
07/01/2024 23:24:57;1704666297;33401;-0,5492451;-0,4895212;Agent;Large;62a7f369-a95b-405d-b8b9-9f89e535be77
07/01/2024 23:24:57;1704666297;33402;-0,5891152;-0,03380284;Agent;Medium;62a7f369-a95b-405d-b8b9-9f89e535be77
07/01/2024 23:24:57;1704666297;33412;0,2839607;0,2698474;Agent;Medium;ed4ff0e5-7d42-4928-b476-d12b0fcd56d2
07/01/2024 23:24:57;1704666297;33412;0,2839607;0,2698474;Agent;Medium;ed4ff0e5-7d42-4928-b476-d12b0fcd56d2
07/01/2024 23:24:57;1704666297;33412;-0,6590567;-0,3544772;Agent;Medium;6965a0bf-689d-48f4-b4c0-68a5d11522e8
07/01/2024 23:24:57;1704666297;33412;-0,6590567;-0,3544772;Agent;Medium;6965a0bf-689d-48f4-b4c0-68a5d11522e8
07/01/2024 23:24:58;1704666298;33434;0,2776454;1,192692;Agent;Large;4472692c-8c33-4119-b22d-7f4f243863d7
07/01/2024 23:24:58;1704666298;33434;0,2776454;1,192692;Agent;Large;4472692c-8c33-4119-b22d-7f4f243863d7
07/01/2024 23:24:58;1704666298;33434;-0,4784006;-0,2561262;Agent;Large;6772cb91-f4f3-4e26-8132-3c537115b3b6
07/01/2024 23:24:58;1704666298;33434;-0,4784006;-0,2561262;Agent;Large;6772cb91-f4f3-4e26-8132-3c537115b3b6
07/01/2024 23:24:58;1704666298;33434;0,2704687;0,7815365;Agent;Medium;4472692c-8c33-4119-b22d-7f4f243863d7
07/01/2024 23:24:58;1704666298;33434;0,2704687;0,7815365;Agent;Medium;4472692c-8c33-4119-b22d-7f4f243863d7
07/01/2024 23:24:58;1704666298;33434;-0,4932453;0,168972;Agent;Medium;6772cb91-f4f3-4e26-8132-3c537115b3b6
07/01/2024 23:24:58;1704666298;33434;-0,4932453;0,168972;Agent;Medium;6772cb91-f4f3-4e26-8132-3c537115b3b6
07/01/2024 23:24:58;1704666298;33434;-0,4932453;0,168972;Agent;Medium;6772cb91-f4f3-4e26-8132-3c537115b3b6
07/01/2024 23:24:58;1704666298;33445;0,2146235;0,6685336;Agent;Large;3453aa5e-1a61-4e1c-af41-25d7a09e27b7
07/01/2024 23:24:58;1704666298;33445;0,2146235;0,6685336;Agent;Large;3453aa5e-1a61-4e1c-af41-25d7a09e27b7
07/01/2024 23:24:58;1704666298;33445;-0,7264319;-0,2279553;Agent;Large;7d133712-f6c9-4ab1-a0bc-31ca905b0646
07/01/2024 23:24:58;1704666298;33445;-0,7264319;-0,2279553;Agent;Medium;7d133712-f6c9-4ab1-a0bc-31ca905b0646
07/01/2024 23:24:58;1704666298;33446;0,2146235;0,2096872;Agent;Medium;3453aa5e-1a61-4e1c-af41-25d7a09e27b7
07/01/2024 23:24:58;1704666298;33456;-0,6111352;-0,5443211;Agent;Large;6b50c9d0-b695-463c-b741-61919ccc57cc
07/01/2024 23:24:58;1704666298;33466;-0,6657282;-0,554029;Agent;Large;74c17d8c-8bbb-4c4e-8b46-ee51547b48b3
07/01/2024 23:24:59;1704666299;33476;0,4656519;0,8454647;Agent;Large;599fc49a-1029-4de1-825e-2fec0ed95b00
07/01/2024 23:24:59;1704666299;33476;0,4656519;0,8454647;Agent;Large;599fc49a-1029-4de1-825e-2fec0ed95b00
07/01/2024 23:24:59;1704666299;33476;-0,2678918;-0,4343896;Agent;Large;f1786cd2-2c1f-4051-8618-25f65620698d
07/01/2024 23:24:59;1704666299;33476;-0,2678918;-0,4343896;Agent;Large;f1786cd2-2c1f-4051-8618-25f65620698d
07/01/2024 23:24:59;1704666299;33476;-0,2678918;-0,4343896;Agent;Large;f1786cd2-2c1f-4051-8618-25f65620698d
07/01/2024 23:24:59;1704666299;33477;0,543302;0,405088;Agent;Medium;599fc49a-1029-4de1-825e-2fec0ed95b00
07/01/2024 23:24:59;1704666299;33477;0,543302;0,405088;Agent;Medium;599fc49a-1029-4de1-825e-2fec0ed95b00
07/01/2024 23:24:59;1704666299;33477;-0,3158157;0,02157554;Agent;Medium;f1786cd2-2c1f-4051-8618-25f65620698d
07/01/2024 23:24:59;1704666299;33477;-0,3158157;0,02157554;Agent;Medium;f1786cd2-2c1f-4051-8618-25f65620698d
07/01/2024 23:24:59;1704666299;33488;0,7798019;0,1393736;Agent;Large;2c636e7f-f846-4bf8-8819-becb92dc1434
07/01/2024 23:24:59;1704666299;33488;0,7798019;0,1393736;Agent;Large;2c636e7f-f846-4bf8-8819-becb92dc1434
07/01/2024 23:24:59;1704666299;33488;-0,4131815;-0,9867706;Agent;Large;53547075-81d9-43db-915d-00c82c59929b
07/01/2024 23:25:00;1704666300;33510;0,4067184;0,5481424;Agent;Large;8128ae46-e43a-491e-b822-6eff08f27907
07/01/2024 23:25:00;1704666300;33510;0,4067184;0,5481424;Agent;Large;8128ae46-e43a-491e-b822-6eff08f27907
07/01/2024 23:25:00;1704666300;33510;-0,5504934;-0,7076429;Agent;Large;05c4355a-71d9-4c62-ac6a-15f31d7e5ab7
07/01/2024 23:25:00;1704666300;33510;0,4227938;0,08780508;Agent;Medium;8128ae46-e43a-491e-b822-6eff08f27907
07/01/2024 23:25:00;1704666300;33510;0,4227938;0,08780508;Agent;Medium;8128ae46-e43a-491e-b822-6eff08f27907
07/01/2024 23:25:00;1704666300;33510;-0,5504934;-0,2667494;Agent;Medium;05c4355a-71d9-4c62-ac6a-15f31d7e5ab7
07/01/2024 23:25:00;1704666300;33510;-0,5504934;-0,2667494;Agent;Medium;05c4355a-71d9-4c62-ac6a-15f31d7e5ab7
