07/01/2024 19:36:43;1704652603;0;First
07/01/2024 19:36:43;1704652603;0;First
07/01/2024 19:36:43;1704652603;0;Second
07/01/2024 19:36:43;1704652603;0;Second
07/01/2024 19:36:43;1704652603;13;Second
07/01/2024 19:36:43;1704652603;16;Second
07/01/2024 19:36:43;1704652603;19;First
07/01/2024 19:36:43;1704652603;24;First
07/01/2024 19:36:44;1704652604;14;Second
07/01/2024 19:36:44;1704652604;15;First
07/01/2024 19:36:44;1704652604;16;Second
07/01/2024 19:36:44;1704652604;18;First
07/01/2024 19:36:44;1704652604;14;Second
07/01/2024 19:36:44;1704652604;16;First
07/01/2024 19:36:44;1704652604;17;Second
07/01/2024 19:36:44;1704652604;20;First
07/01/2024 19:36:45;1704652605;13;Second
07/01/2024 19:36:45;1704652605;15;First
07/01/2024 19:36:45;1704652605;17;Second
07/01/2024 19:36:45;1704652605;18;First
07/01/2024 19:36:45;1704652605;14;First
07/01/2024 19:36:45;1704652605;16;Second
07/01/2024 19:36:45;1704652605;18;Second
07/01/2024 19:36:45;1704652605;21;First
07/01/2024 19:36:46;1704652606;14;Second
07/01/2024 19:36:46;1704652606;16;First
07/01/2024 19:36:46;1704652606;18;Second
07/01/2024 19:36:46;1704652606;19;First
07/01/2024 19:36:46;1704652606;14;Second
07/01/2024 19:36:46;1704652606;15;First
07/01/2024 19:36:46;1704652606;17;Second
07/01/2024 19:36:46;1704652606;19;First
07/01/2024 19:36:46;1704652606;15;Second
07/01/2024 19:36:46;1704652606;17;First
07/01/2024 19:36:46;1704652606;18;Second
07/01/2024 19:36:47;1704652607;20;First
07/01/2024 19:36:47;1704652607;13;Second
07/01/2024 19:36:47;1704652607;15;First
07/01/2024 19:36:47;1704652607;16;Second
07/01/2024 19:36:47;1704652607;21;First
07/01/2024 19:36:47;1704652607;14;Second
07/01/2024 19:36:47;1704652607;16;First
07/01/2024 19:36:47;1704652607;19;First
07/01/2024 19:36:47;1704652607;21;Second
07/01/2024 19:36:48;1704652608;14;Second
07/01/2024 19:36:48;1704652608;17;First
07/01/2024 19:36:48;1704652608;19;First
07/01/2024 19:36:48;1704652608;22;Second
07/01/2024 19:36:48;1704652608;14;Second
07/01/2024 19:36:48;1704652608;15;First
07/01/2024 19:36:49;1704652609;17;Second
07/01/2024 19:36:49;1704652609;20;First
07/01/2024 19:36:49;1704652609;14;Second
07/01/2024 19:36:49;1704652609;15;First
07/01/2024 19:36:49;1704652609;17;Second
07/01/2024 19:36:49;1704652609;19;First
07/01/2024 19:36:49;1704652609;13;First
07/01/2024 19:36:50;1704652610;18;Second
07/01/2024 19:36:50;1704652610;20;First
07/01/2024 19:36:50;1704652610;24;Second
07/01/2024 19:36:50;1704652610;14;Second
07/01/2024 19:36:50;1704652610;15;First
07/01/2024 19:36:50;1704652610;17;Second
07/01/2024 19:36:50;1704652610;19;First
07/01/2024 19:36:51;1704652611;15;Second
07/01/2024 19:36:51;1704652611;16;Second
07/01/2024 19:36:51;1704652611;18;First
07/01/2024 19:36:51;1704652611;22;First
07/01/2024 19:36:51;1704652611;13;Second
07/01/2024 19:36:51;1704652611;16;Second
07/01/2024 19:36:51;1704652611;18;First
07/01/2024 19:36:51;1704652611;19;First
07/01/2024 19:36:52;1704652612;14;Second
07/01/2024 19:36:52;1704652612;15;First
07/01/2024 19:36:52;1704652612;17;Second
07/01/2024 19:36:52;1704652612;19;First
07/01/2024 19:36:52;1704652612;14;First
07/01/2024 19:36:52;1704652612;16;Second
07/01/2024 19:36:52;1704652612;17;Second
07/01/2024 19:36:52;1704652612;19;First
07/01/2024 19:36:53;1704652613;14;First
07/01/2024 19:36:53;1704652613;17;Second
07/01/2024 19:36:53;1704652613;19;First
07/01/2024 19:36:53;1704652613;21;Second
07/01/2024 19:36:53;1704652613;16;Second
07/01/2024 19:36:53;1704652613;17;First
07/01/2024 19:36:53;1704652613;19;Second
07/01/2024 19:36:53;1704652613;22;First
07/01/2024 19:36:54;1704652614;15;Second
07/01/2024 19:36:54;1704652614;17;Second
07/01/2024 19:36:54;1704652614;19;First
07/01/2024 19:36:54;1704652614;20;First
07/01/2024 19:36:54;1704652614;14;Second
07/01/2024 19:36:54;1704652614;16;First
07/01/2024 19:36:54;1704652614;17;Second
07/01/2024 19:36:54;1704652614;20;First
07/01/2024 19:36:55;1704652615;14;Second
07/01/2024 19:36:55;1704652615;16;First
07/01/2024 19:36:55;1704652615;17;Second
07/01/2024 19:36:55;1704652615;19;First
07/01/2024 19:36:55;1704652615;13;Second
07/01/2024 19:36:55;1704652615;16;First
07/01/2024 19:36:55;1704652615;19;Second
07/01/2024 19:36:55;1704652615;21;First
07/01/2024 19:36:56;1704652616;15;Second
07/01/2024 19:36:56;1704652616;16;First
07/01/2024 19:36:56;1704652616;18;Second
07/01/2024 19:36:56;1704652616;19;First
07/01/2024 19:36:56;1704652616;15;First
07/01/2024 19:36:56;1704652616;17;Second
07/01/2024 19:36:56;1704652616;18;Second
07/01/2024 19:36:56;1704652616;21;First
07/01/2024 19:36:57;1704652617;14;Second
07/01/2024 19:36:57;1704652617;16;First
07/01/2024 19:36:57;1704652617;19;Second
07/01/2024 19:36:57;1704652617;19;First
07/01/2024 19:36:57;1704652617;14;Second
07/01/2024 19:36:57;1704652617;16;First
07/01/2024 19:36:57;1704652617;18;Second
07/01/2024 19:36:57;1704652617;20;First
07/01/2024 19:36:58;1704652618;14;Second
07/01/2024 19:36:58;1704652618;17;Second
07/01/2024 19:36:58;1704652618;18;First
07/01/2024 19:36:58;1704652618;20;First
07/01/2024 19:36:58;1704652618;14;Second
07/01/2024 19:36:58;1704652618;17;First
07/01/2024 19:36:58;1704652618;19;Second
07/01/2024 19:36:58;1704652618;20;First
07/01/2024 19:36:59;1704652619;14;Second
07/01/2024 19:36:59;1704652619;16;First
07/01/2024 19:36:59;1704652619;20;Second
07/01/2024 19:36:59;1704652619;23;First
07/01/2024 19:36:59;1704652619;15;Second
07/01/2024 19:36:59;1704652619;17;First
07/01/2024 19:36:59;1704652619;19;First
07/01/2024 19:36:59;1704652619;21;Second
07/01/2024 19:37:00;1704652620;15;Second
07/01/2024 19:37:00;1704652620;16;Second
07/01/2024 19:37:00;1704652620;18;First
07/01/2024 19:37:00;1704652620;20;First
07/01/2024 19:37:00;1704652620;13;Second
07/01/2024 19:37:01;1704652621;16;Second
07/01/2024 19:37:01;1704652621;17;First
07/01/2024 19:37:01;1704652621;18;First
07/01/2024 19:37:01;1704652621;14;Second
07/01/2024 19:37:01;1704652621;16;First
07/01/2024 19:37:01;1704652621;19;First
07/01/2024 19:37:01;1704652621;23;Second
07/01/2024 19:37:02;1704652622;14;Second
07/01/2024 19:37:02;1704652622;15;First
07/01/2024 19:37:02;1704652622;16;Second
07/01/2024 19:37:02;1704652622;18;First
07/01/2024 19:37:02;1704652622;13;Second
07/01/2024 19:37:02;1704652622;15;First
07/01/2024 19:37:02;1704652622;17;Second
07/01/2024 19:37:02;1704652622;18;First
07/01/2024 19:37:02;1704652622;14;Second
07/01/2024 19:37:02;1704652622;16;First
07/01/2024 19:37:02;1704652622;19;Second
07/01/2024 19:37:03;1704652623;22;First
07/01/2024 19:37:03;1704652623;14;Second
07/01/2024 19:37:03;1704652623;16;Second
07/01/2024 19:37:03;1704652623;18;First
07/01/2024 19:37:03;1704652623;19;First
07/01/2024 19:37:03;1704652623;13;Second
07/01/2024 19:37:03;1704652623;15;First
07/01/2024 19:37:03;1704652623;16;Second
07/01/2024 19:37:03;1704652623;19;First
07/01/2024 19:37:04;1704652624;14;First
07/01/2024 19:37:04;1704652624;14;Second
07/01/2024 19:37:04;1704652624;17;Second
07/01/2024 19:37:04;1704652624;18;First
07/01/2024 19:37:04;1704652624;15;Second
07/01/2024 19:37:04;1704652624;16;First
07/01/2024 19:37:04;1704652624;18;Second
07/01/2024 19:37:04;1704652624;20;First
07/01/2024 19:37:05;1704652625;14;Second
07/01/2024 19:37:05;1704652625;15;First
07/01/2024 19:37:05;1704652625;17;Second
07/01/2024 19:37:05;1704652625;19;First
07/01/2024 19:37:05;1704652625;15;Second
07/01/2024 19:37:05;1704652625;17;First
07/01/2024 19:37:05;1704652625;18;Second
07/01/2024 19:37:05;1704652625;19;First
07/01/2024 19:37:06;1704652626;14;Second
07/01/2024 19:37:06;1704652626;15;First
07/01/2024 19:37:06;1704652626;17;Second
07/01/2024 19:37:06;1704652626;21;First
07/01/2024 19:37:06;1704652626;15;Second
07/01/2024 19:37:06;1704652626;15;Second
07/01/2024 19:37:06;1704652626;17;First
07/01/2024 19:37:06;1704652626;23;First
07/01/2024 19:37:07;1704652627;15;Second
07/01/2024 19:37:07;1704652627;16;Second
07/01/2024 19:37:07;1704652627;18;First
07/01/2024 19:37:07;1704652627;21;First
07/01/2024 19:37:07;1704652627;15;Second
07/01/2024 19:37:07;1704652627;16;Second
07/01/2024 19:37:07;1704652627;17;First
07/01/2024 19:37:07;1704652627;23;First
07/01/2024 19:37:08;1704652628;15;First
07/01/2024 19:37:08;1704652628;15;Second
07/01/2024 19:37:08;1704652628;17;Second
07/01/2024 19:37:08;1704652628;18;First
07/01/2024 19:37:08;1704652628;14;Second
07/01/2024 19:37:08;1704652628;18;First
07/01/2024 19:37:09;1704652629;21;Second
07/01/2024 19:37:09;1704652629;23;First
07/01/2024 19:37:09;1704652629;14;Second
07/01/2024 19:37:09;1704652629;16;Second
07/01/2024 19:37:09;1704652629;19;First
07/01/2024 19:37:09;1704652629;19;First
07/01/2024 19:37:09;1704652629;15;Second
07/01/2024 19:37:09;1704652629;17;First
07/01/2024 19:37:10;1704652630;19;Second
07/01/2024 19:37:10;1704652630;20;First
07/01/2024 19:37:10;1704652630;14;Second
07/01/2024 19:37:10;1704652630;15;First
07/01/2024 19:37:10;1704652630;19;First
07/01/2024 19:37:10;1704652630;19;Second
07/01/2024 19:37:10;1704652630;14;Second
07/01/2024 19:37:10;1704652630;16;First
07/01/2024 19:37:10;1704652630;17;Second
07/01/2024 19:37:10;1704652630;19;First
07/01/2024 19:37:11;1704652631;14;Second
07/01/2024 19:37:11;1704652631;15;Second
07/01/2024 19:37:11;1704652631;18;First
07/01/2024 19:37:11;1704652631;19;First
07/01/2024 19:37:11;1704652631;14;Second
07/01/2024 19:37:11;1704652631;14;First
07/01/2024 19:37:11;1704652631;16;Second
07/01/2024 19:37:11;1704652631;19;First
07/01/2024 19:37:12;1704652632;14;Second
07/01/2024 19:37:12;1704652632;16;First
07/01/2024 19:37:12;1704652632;19;First
07/01/2024 19:37:12;1704652632;22;Second
07/01/2024 19:37:12;1704652632;15;Second
07/01/2024 19:37:13;1704652633;17;First
07/01/2024 19:37:13;1704652633;19;First
07/01/2024 19:37:13;1704652633;21;Second
07/01/2024 19:37:13;1704652633;15;First
07/01/2024 19:37:13;1704652633;16;Second
07/01/2024 19:37:13;1704652633;17;Second
07/01/2024 19:37:13;1704652633;19;First
07/01/2024 19:37:13;1704652633;16;Second
07/01/2024 19:37:14;1704652634;18;First
07/01/2024 19:37:14;1704652634;20;Second
07/01/2024 19:37:14;1704652634;23;First
07/01/2024 19:37:14;1704652634;14;Second
07/01/2024 19:37:14;1704652634;16;First
07/01/2024 19:37:14;1704652634;17;Second
07/01/2024 19:37:14;1704652634;19;First
07/01/2024 19:37:15;1704652635;14;Second
07/01/2024 19:37:15;1704652635;16;Second
07/01/2024 19:37:15;1704652635;18;First
07/01/2024 19:37:15;1704652635;20;First
07/01/2024 19:37:15;1704652635;15;Second
07/01/2024 19:37:15;1704652635;16;Second
07/01/2024 19:37:15;1704652635;19;First
07/01/2024 19:37:15;1704652635;23;First
07/01/2024 19:37:16;1704652636;14;Second
07/01/2024 19:37:16;1704652636;16;First
07/01/2024 19:37:16;1704652636;18;Second
07/01/2024 19:37:16;1704652636;19;First
07/01/2024 19:37:16;1704652636;14;Second
07/01/2024 19:37:16;1704652636;16;First
07/01/2024 19:37:16;1704652636;18;Second
07/01/2024 19:37:16;1704652636;19;First
07/01/2024 19:37:16;1704652636;15;Second
07/01/2024 19:37:16;1704652636;17;First
07/01/2024 19:37:17;1704652637;20;Second
07/01/2024 19:37:17;1704652637;26;First
07/01/2024 19:37:17;1704652637;14;Second
07/01/2024 19:37:17;1704652637;15;First
07/01/2024 19:37:17;1704652637;17;Second
07/01/2024 19:37:17;1704652637;19;First
07/01/2024 19:37:17;1704652637;14;Second
07/01/2024 19:37:17;1704652637;16;Second
07/01/2024 19:37:17;1704652637;18;First
07/01/2024 19:37:18;1704652638;23;First
07/01/2024 19:37:18;1704652638;15;Second
07/01/2024 19:37:18;1704652638;17;First
07/01/2024 19:37:18;1704652638;19;Second
07/01/2024 19:37:18;1704652638;22;First
07/01/2024 19:37:18;1704652638;13;Second
07/01/2024 19:37:18;1704652638;15;First
07/01/2024 19:37:18;1704652638;17;Second
07/01/2024 19:37:19;1704652639;21;First
07/01/2024 19:37:19;1704652639;14;Second
07/01/2024 19:37:19;1704652639;16;First
07/01/2024 19:37:19;1704652639;17;Second
07/01/2024 19:37:19;1704652639;18;First
07/01/2024 19:37:19;1704652639;14;Second
07/01/2024 19:37:19;1704652639;16;First
07/01/2024 19:37:20;1704652640;22;Second
07/01/2024 19:37:20;1704652640;26;First
07/01/2024 19:37:20;1704652640;14;Second
07/01/2024 19:37:20;1704652640;17;Second
07/01/2024 19:37:20;1704652640;18;First
07/01/2024 19:37:20;1704652640;21;First
07/01/2024 19:37:20;1704652640;13;Second
07/01/2024 19:37:20;1704652640;15;First
07/01/2024 19:37:20;1704652640;16;Second
07/01/2024 19:37:21;1704652641;18;First
07/01/2024 19:37:21;1704652641;14;Second
07/01/2024 19:37:21;1704652641;16;Second
07/01/2024 19:37:21;1704652641;17;First
07/01/2024 19:37:21;1704652641;20;First
07/01/2024 19:37:21;1704652641;14;First
07/01/2024 19:37:21;1704652641;15;Second
07/01/2024 19:37:21;1704652641;16;Second
07/01/2024 19:37:22;1704652642;19;First
07/01/2024 19:37:22;1704652642;14;Second
07/01/2024 19:37:22;1704652642;17;First
07/01/2024 19:37:22;1704652642;20;Second
07/01/2024 19:37:22;1704652642;23;First
07/01/2024 19:37:22;1704652642;13;Second
07/01/2024 19:37:22;1704652642;15;First
07/01/2024 19:37:22;1704652642;18;Second
07/01/2024 19:37:22;1704652642;18;First
07/01/2024 19:37:23;1704652643;15;Second
07/01/2024 19:37:23;1704652643;17;First
07/01/2024 19:37:23;1704652643;19;Second
07/01/2024 19:37:23;1704652643;20;First
07/01/2024 19:37:23;1704652643;14;Second
07/01/2024 19:37:23;1704652643;15;First
07/01/2024 19:37:23;1704652643;16;Second
07/01/2024 19:37:23;1704652643;19;First
07/01/2024 19:37:24;1704652644;15;Second
07/01/2024 19:37:24;1704652644;16;First
07/01/2024 19:37:24;1704652644;17;Second
07/01/2024 19:37:24;1704652644;21;First
07/01/2024 19:37:24;1704652644;13;Second
07/01/2024 19:37:24;1704652644;16;First
07/01/2024 19:37:24;1704652644;17;Second
07/01/2024 19:37:24;1704652644;20;First
07/01/2024 19:37:25;1704652645;15;Second
07/01/2024 19:37:25;1704652645;16;First
07/01/2024 19:37:25;1704652645;18;First
07/01/2024 19:37:25;1704652645;20;Second
07/01/2024 19:37:25;1704652645;16;Second
07/01/2024 19:37:25;1704652645;18;Second
07/01/2024 19:37:25;1704652645;20;First
07/01/2024 19:37:26;1704652646;23;First
07/01/2024 19:37:26;1704652646;13;Second
07/01/2024 19:37:26;1704652646;16;First
07/01/2024 19:37:26;1704652646;17;Second
07/01/2024 19:37:26;1704652646;20;First
07/01/2024 19:37:26;1704652646;14;Second
07/01/2024 19:37:26;1704652646;15;First
07/01/2024 19:37:26;1704652646;16;Second
07/01/2024 19:37:26;1704652646;19;First
07/01/2024 19:37:27;1704652647;15;First
07/01/2024 19:37:27;1704652647;17;Second
07/01/2024 19:37:27;1704652647;17;Second
07/01/2024 19:37:27;1704652647;21;First
07/01/2024 19:37:27;1704652647;14;Second
07/01/2024 19:37:27;1704652647;16;First
07/01/2024 19:37:27;1704652647;18;Second
07/01/2024 19:37:27;1704652647;19;First
07/01/2024 19:37:28;1704652648;14;Second
07/01/2024 19:37:28;1704652648;16;First
07/01/2024 19:37:28;1704652648;19;Second
07/01/2024 19:37:28;1704652648;20;First
07/01/2024 19:37:28;1704652648;14;Second
07/01/2024 19:37:28;1704652648;16;First
07/01/2024 19:37:28;1704652648;17;Second
07/01/2024 19:37:28;1704652648;20;First
07/01/2024 19:37:29;1704652649;14;Second
07/01/2024 19:37:29;1704652649;15;First
07/01/2024 19:37:29;1704652649;17;Second
07/01/2024 19:37:29;1704652649;19;First
07/01/2024 19:37:29;1704652649;14;Second
07/01/2024 19:37:29;1704652649;18;Second
07/01/2024 19:37:29;1704652649;21;First
07/01/2024 19:37:29;1704652649;24;First
07/01/2024 19:37:30;1704652650;14;Second
07/01/2024 19:37:30;1704652650;16;First
07/01/2024 19:37:30;1704652650;19;Second
07/01/2024 19:37:30;1704652650;21;First
07/01/2024 19:37:30;1704652650;13;Second
07/01/2024 19:37:30;1704652650;15;First
07/01/2024 19:37:30;1704652650;17;Second
07/01/2024 19:37:30;1704652650;18;First
07/01/2024 19:37:31;1704652651;15;Second
07/01/2024 19:37:31;1704652651;17;First
07/01/2024 19:37:31;1704652651;19;Second
07/01/2024 19:37:31;1704652651;21;First
07/01/2024 19:37:31;1704652651;13;Second
07/01/2024 19:37:31;1704652651;15;First
07/01/2024 19:37:31;1704652651;17;Second
07/01/2024 19:37:31;1704652651;22;First
07/01/2024 19:37:32;1704652652;14;Second
07/01/2024 19:37:32;1704652652;16;First
07/01/2024 19:37:32;1704652652;18;Second
07/01/2024 19:37:32;1704652652;21;First
07/01/2024 19:37:32;1704652652;14;Second
07/01/2024 19:37:32;1704652652;16;Second
07/01/2024 19:37:32;1704652652;17;First
07/01/2024 19:37:32;1704652652;21;First
07/01/2024 19:37:33;1704652653;14;Second
07/01/2024 19:37:33;1704652653;16;First
07/01/2024 19:37:33;1704652653;19;Second
07/01/2024 19:37:33;1704652653;22;First
