07/01/2024 23:12:28;1704665548;20
07/01/2024 23:12:29;1704665549;17
07/01/2024 23:12:29;1704665549;16
07/01/2024 23:12:30;1704665550;17
07/01/2024 23:12:30;1704665550;16
07/01/2024 23:12:31;1704665551;16
07/01/2024 23:12:31;1704665551;17
07/01/2024 23:12:32;1704665552;16
07/01/2024 23:12:32;1704665552;16
07/01/2024 23:12:33;1704665553;16
07/01/2024 23:12:33;1704665553;17
07/01/2024 23:12:34;1704665554;17
07/01/2024 23:12:34;1704665554;17
07/01/2024 23:12:35;1704665555;15
07/01/2024 23:12:35;1704665555;18
07/01/2024 23:12:36;1704665556;17
07/01/2024 23:12:36;1704665556;17
07/01/2024 23:12:37;1704665557;17
07/01/2024 23:12:37;1704665557;16
07/01/2024 23:12:37;1704665557;16
07/01/2024 23:12:38;1704665558;16
07/01/2024 23:12:38;1704665558;17
07/01/2024 23:12:39;1704665559;16
07/01/2024 23:12:39;1704665559;16
07/01/2024 23:12:40;1704665560;17
07/01/2024 23:12:40;1704665560;17
07/01/2024 23:12:41;1704665561;16
07/01/2024 23:12:42;1704665562;18
07/01/2024 23:12:42;1704665562;18
07/01/2024 23:12:43;1704665563;17
07/01/2024 23:12:43;1704665563;18
07/01/2024 23:12:44;1704665564;16
07/01/2024 23:12:44;1704665564;16
07/01/2024 23:12:45;1704665565;18
07/01/2024 23:12:46;1704665566;18
07/01/2024 23:12:47;1704665567;18
07/01/2024 23:12:47;1704665567;15
07/01/2024 23:12:48;1704665568;16
07/01/2024 23:12:48;1704665568;19
07/01/2024 23:12:49;1704665569;15
07/01/2024 23:12:49;1704665569;18
07/01/2024 23:12:50;1704665570;16
07/01/2024 23:12:50;1704665570;16
07/01/2024 23:12:51;1704665571;16
07/01/2024 23:12:51;1704665571;16
07/01/2024 23:12:52;1704665572;17
07/01/2024 23:12:52;1704665572;15
07/01/2024 23:12:53;1704665573;17
07/01/2024 23:12:53;1704665573;16
07/01/2024 23:12:54;1704665574;17
07/01/2024 23:12:54;1704665574;16
07/01/2024 23:12:55;1704665575;17
07/01/2024 23:12:55;1704665575;17
07/01/2024 23:12:56;1704665576;16
07/01/2024 23:12:56;1704665576;18
07/01/2024 23:12:57;1704665577;17
07/01/2024 23:12:57;1704665577;18
07/01/2024 23:12:58;1704665578;16
07/01/2024 23:12:58;1704665578;17
07/01/2024 23:12:59;1704665579;17
07/01/2024 23:12:59;1704665579;17
07/01/2024 23:13:00;1704665580;16
07/01/2024 23:13:00;1704665580;16
07/01/2024 23:13:01;1704665581;16
07/01/2024 23:13:01;1704665581;16
07/01/2024 23:13:02;1704665582;17
07/01/2024 23:13:02;1704665582;18
07/01/2024 23:13:03;1704665583;16
07/01/2024 23:13:03;1704665583;17
07/01/2024 23:13:04;1704665584;17
07/01/2024 23:13:04;1704665584;16
07/01/2024 23:13:05;1704665585;16
07/01/2024 23:13:05;1704665585;16
07/01/2024 23:13:06;1704665586;16
07/01/2024 23:13:06;1704665586;17
07/01/2024 23:13:07;1704665587;17
07/01/2024 23:13:07;1704665587;17
07/01/2024 23:13:08;1704665588;15
07/01/2024 23:13:08;1704665588;15
07/01/2024 23:13:09;1704665589;18
07/01/2024 23:13:09;1704665589;17
07/01/2024 23:13:10;1704665590;16
07/01/2024 23:13:10;1704665590;17
07/01/2024 23:13:11;1704665591;18
07/01/2024 23:13:11;1704665591;17
07/01/2024 23:13:12;1704665592;17
07/01/2024 23:13:12;1704665592;17
07/01/2024 23:13:13;1704665593;17
07/01/2024 23:13:14;1704665594;17
07/01/2024 23:13:14;1704665594;17
07/01/2024 23:13:15;1704665595;17
07/01/2024 23:13:15;1704665595;15
07/01/2024 23:13:16;1704665596;18
07/01/2024 23:13:16;1704665596;18
07/01/2024 23:13:17;1704665597;17
07/01/2024 23:13:17;1704665597;17
07/01/2024 23:13:18;1704665598;16
07/01/2024 23:13:18;1704665598;17
07/01/2024 23:13:19;1704665599;17
07/01/2024 23:13:19;1704665599;16
