Wall time,Step,Value
1702305374.566727,6000,-0.6899678707122803
1702305376.799844,7000,1.4108127355575562
1702305386.7328708,11000,-124.95098114013672
1702305388.777743,12000,-25.50966453552246
1702305392.9149792,14000,-71.66427612304688
1702305394.9317737,15000,-60.37261962890625
1702305398.428682,16000,-44.263954162597656
1702305405.617127,19000,-15.65125846862793
1702305407.7476373,20000,-39.765525817871094
1702305411.6285186,21000,-3.5084776878356934
1702305419.066945,25000,-5.4069037437438965
1702305441.3258524,34000,-21.1313419342041
1702305443.4877057,35000,2.2464075088500977
1702305450.4468584,37000,-5.50438117980957
1702305459.0598035,41000,2.7780966758728027
1702305464.6242177,43000,-2.843121290206909
1702305470.300418,46000,-29.034652709960938
1702305475.612558,48000,-17.317174911499023
1702305481.5174909,51000,-18.75363540649414
1702305488.865038,54000,-19.157278060913086
1702305494.1317852,56000,-6.780776500701904
1702305503.553202,60000,-5.697702407836914
1702305505.7403145,61000,6.4745001792907715
1702305509.5794759,62000,-1.904613971710205
1702305512.8204145,64000,2.802865743637085
1702305514.8021202,65000,4.769159317016602
1702305522.1328244,68000,2.5946996212005615
1702305524.0287406,69000,7.802699565887451
1702305527.872724,71000,-2.5353007316589355
1702305533.1048136,73000,11.069600105285645
1702305535.564457,74000,10.969650268554688
1702305538.3021493,75000,8.718949317932129
1702305539.8885424,76000,7.468759536743164
1702305547.1337273,79000,5.3851494789123535
1702305551.1119874,81000,0.9644491672515869
1702305552.9426293,82000,5.212666034698486
1702305556.45054,83000,9.465399742126465
1702305560.0721939,85000,7.7639594078063965
1702305567.9235618,88000,8.38398265838623
1702305581.3665345,94000,11.407037734985352
1702305583.615223,95000,10.47189998626709
1702305585.408084,96000,8.470974922180176
1702305587.5905578,97000,10.84427547454834
1702305589.5277414,98000,11.970000267028809
1702305592.601541,99000,11.113028526306152
1702305608.2451797,106000,-5.0260009765625
1702305628.5981662,114000,-61.40995788574219
1702305634.6834624,117000,-36.405906677246094
1702305636.8739707,118000,-9.023900985717773
1702305653.9114392,125000,-2.399601459503174
1702305660.1313722,128000,-0.40267661213874817
1702305665.6555498,130000,-1.4006011486053467
1702305667.8121593,131000,2.474799156188965
1702305669.9811108,132000,-3.32534122467041
1702305680.5829055,136000,5.3100996017456055
1702305682.6477234,137000,3.075939178466797
1702305684.5809839,138000,5.101049423217773
1702305692.1065102,141000,1.1753787994384766
1702305694.0860775,142000,4.306665897369385
1702305701.6563048,145000,6.975379467010498
1702305709.9899416,149000,5.642999172210693
1702305715.1653535,151000,5.3521246910095215
1702305720.2972157,153000,5.4762492179870605
1702305722.3084044,154000,5.190771102905273
1702305726.2586086,155000,6.7253499031066895
1702305727.7920947,156000,6.14324951171875
1702305738.1156616,160000,6.97664213180542
1702305741.528779,162000,7.39491605758667
1702305747.5643618,165000,5.974749565124512
1702305750.964753,166000,10.191128730773926
1702305752.823886,167000,10.975199699401855
1702305757.049864,169000,8.226099967956543
1702305759.1613207,170000,12.049028396606445
1702305762.326724,171000,11.227250099182129
1702305769.6524973,174000,11.809900283813477
1702305776.0835574,176000,-3.7046375274658203
1702305777.030178,177000,3.250607967376709
1702305779.7673407,179000,2.8085386753082275
1702305780.2450821,180000,-0.025900525972247124
1702305785.6414177,183000,-1.9206619262695312
1702305794.6022754,188000,1.291339635848999
1702305795.7243345,189000,2.056854248046875
1702305796.6788118,190000,-0.28170058131217957
1702305801.7456832,192000,4.424709796905518
1702305806.1689475,195000,2.789308786392212
1702305809.52397,197000,1.6366695165634155
1702305810.6186302,198000,-1.1578289270401
1702305814.007148,200000,2.757636547088623
1702305817.708738,202000,1.6087995767593384
1702305818.7625535,203000,2.3894829750061035
1702305830.5194862,210000,3.1489925384521484
1702305838.1138997,214000,2.0253684520721436
1702305845.0826373,218000,3.3565497398376465
1702305846.1223915,219000,2.5692567825317383
1702305847.1456995,220000,3.0352885723114014
1702305853.4866893,224000,4.42501974105835
1702305857.9325879,227000,3.5256330966949463
1702305863.903644,230000,4.785457611083984
1702305866.2123137,231000,3.474179744720459
1702305871.1353366,234000,2.882434844970703
1702305872.8399644,235000,4.766146659851074
1702305874.5973039,237000,4.5301899909973145
1702305878.2594018,238000,3.8829171657562256
1702305878.8885663,239000,4.631505966186523
1702305881.5717099,241000,4.428441524505615
1702305886.2773252,244000,4.433108329772949
1702305888.4421918,245000,-2.300487995147705
1702305890.715658,247000,-3.2715253829956055
1702305897.6111467,250000,-54.54660415649414
1702305903.8846166,253000,-92.15568542480469
1702305911.0904171,258000,-26.025680541992188
1702305915.3388064,260000,-13.651025772094727
1702305918.3724434,262000,-3.971891403198242
1702305920.0293198,263000,-8.321340560913086
1702305930.7299004,268000,-6.4741010665893555
1702305936.7353976,271000,-4.05869197845459
1702305937.9432113,272000,2.8070068359375
1702305939.9879782,273000,-7.650364398956299
1702305942.8660307,274000,0.2938300669193268
1702305945.6455283,276000,4.194899559020996
1702305953.4201891,280000,1.0230917930603027
1702305956.7741077,282000,-14.97416877746582
1702305962.1456797,284000,1.8932996988296509
1702305964.8744922,286000,3.2794923782348633
1702305975.2064235,291000,-1.509214997291565
1702305978.3446555,293000,4.047211170196533
1702305985.474627,297000,3.6338138580322266
1702305995.278559,302000,2.873584270477295
1702305998.5803502,304000,4.957446575164795
1702306001.595922,305000,4.738630771636963
1702306011.8370776,310000,4.050876140594482
1702306012.2130883,311000,0.23434464633464813
1702306015.175317,312000,-3.08674955368042
1702306016.2634497,314000,5.1251702308654785
1702306020.6464477,315000,4.888811111450195
1702306020.987635,316000,4.953108310699463
1702306027.7495084,320000,4.338610649108887
1702306028.0512223,321000,2.974205493927002
1702306030.9825695,323000,4.775003910064697
1702306038.1839173,326000,4.411495208740234
1702306042.6803532,330000,4.2000885009765625
1702306045.9518156,331000,3.8002736568450928
1702306047.3461285,332000,4.98417854309082
1702306048.018359,333000,4.741166591644287
1702306051.2318885,335000,4.961025714874268
1702306056.667226,338000,4.704192161560059
1702306057.504032,339000,4.337944984436035
1702306058.961777,340000,3.719010353088379
1702306064.8215566,343000,4.30247688293457
1702306067.577039,344000,5.049938678741455
1702306071.8487642,346000,5.255826950073242
1702306080.3031673,352000,4.675043106079102
1702306083.521182,354000,4.9039154052734375
1702306088.4349766,357000,5.8797783851623535
1702306091.263912,359000,4.164129257202148
1702306094.7109885,361000,3.1046645641326904
1702306097.2662506,362000,4.700271129608154
1702306107.9847727,367000,1.9231995344161987
1702306112.1701908,371000,-8.301513671875
1702306117.6678865,374000,-10.632744789123535
1702306122.4194992,377000,-22.042287826538086
1702306122.892249,378000,-72.63516235351562
1702306123.9278898,379000,-63.16628646850586
1702306131.392228,382000,-46.122352600097656
1702306133.6443973,383000,0.48239898681640625
1702306137.1802623,386000,-29.434139251708984
1702306139.1238406,387000,-9.194422721862793
1702306143.808861,389000,-66.30548095703125
1702306144.9813437,390000,-39.28000259399414
1702306147.0269873,392000,-4.392571449279785
1702306153.863775,396000,-96.71586608886719
1702306155.6494293,397000,-3.018759250640869
1702306158.8156013,398000,-33.73617935180664
1702306160.518626,400000,-8.88020133972168
1702306163.055561,401000,0.41459935903549194
1702306169.084273,404000,-33.70063781738281
1702306170.718698,405000,-3.318284273147583
1702306172.1327622,406000,-0.5247405767440796
1702306173.0727808,407000,-3.896275281906128
1702306177.9805954,409000,-3.6960999965667725
1702306178.4802916,410000,0.6377663612365723
1702306179.4532244,411000,-153.76087951660156
1702306181.397318,412000,-21.732526779174805
1702306197.3593442,421000,-188.11802673339844
1702306200.196022,422000,-21.01827621459961
1702306204.3422828,424000,-33.3177490234375
1702306208.5083182,427000,-33.03118133544922
1702306218.1783106,434000,-3.0329601764678955
1702306221.2287996,435000,0.44363510608673096
1702306226.7108278,439000,-27.94750213623047
1702306229.8881228,440000,-57.871360778808594
1702306231.702394,441000,-23.27437400817871
1702306235.3068736,443000,-3.8652923107147217
1702306238.9054186,445000,-0.7360435128211975
1702306244.275729,449000,-10.274051666259766
1702306260.4660404,458000,-1.5817004442214966
1702306262.859895,459000,-6.109918117523193
1702306266.4866,460000,0.5684186220169067
1702306266.7454336,461000,-1.3755003213882446
1702306269.3863213,463000,-1.3252525329589844
1702306270.2440572,464000,-3.0630083084106445
1702306276.5393264,467000,0.729327380657196
1702306280.773243,470000,-8.124776840209961
1702306293.5232592,477000,-4.123630523681641
1702306294.4562962,478000,-6.060873508453369
1702306296.595301,479000,1.0149996280670166
1702306299.2314825,480000,1.476051926612854
1702306302.1424031,482000,-1.1439337730407715
1702306303.2675257,483000,-3.290119171142578
1702306305.4404328,484000,-1.3271204233169556
1702306309.1676893,486000,-1.6266804933547974
1702306309.866939,487000,-4.610125541687012
1702306312.0044086,488000,-7.175563812255859
1702306313.9333808,490000,-4.396609306335449
1702306318.9763238,492000,-6.805973052978516
1702306319.764233,493000,-10.568511009216309
1702306328.2597587,497000,0.006804717238992453
1702306338.5211067,504000,-7.610365390777588
1702306344.837788,507000,0.29333624243736267
1702306345.727141,508000,-0.37623587250709534
1702306348.9626286,510000,0.5067197680473328
1702306353.0284832,512000,3.8844597339630127
1702306357.028188,515000,-1.2899280786514282
1702306375.856329,526000,-0.8073364496231079
1702306380.947386,529000,2.4008326530456543
1702306382.5852754,530000,0.4810163378715515
1702306384.1884563,531000,-40.49131774902344
1702306388.5156388,533000,-18.281063079833984
1702306392.4442358,535000,-18.49430274963379
1702306394.0074039,536000,-0.2425403892993927
1702306398.4585457,538000,0.5507513880729675
1702306406.2660506,543000,-3.0507752895355225
1702306407.6311867,544000,-3.132194995880127
1702306416.8431692,550000,2.4489455223083496
1702306419.8778398,552000,1.6016371250152588
1702306423.4526956,553000,2.35638689994812
1702306423.62212,554000,-4.745092868804932
1702306426.3915825,555000,-0.3684670925140381
1702306427.5770001,556000,3.485813856124878
1702306428.640203,557000,1.06215500831604
1702306430.3978949,558000,0.8200660347938538
1702306432.9639754,559000,-0.6147370338439941
1702306433.9885743,560000,2.5334408283233643
1702306435.2637515,561000,1.8264681100845337
1702306438.5651135,563000,-1.749875545501709
1702306443.9178567,566000,1.4443329572677612
1702306445.0280352,567000,-2.656388998031616
1702306445.8029892,568000,-4.628143310546875
1702306450.3307948,570000,0.7176876068115234
1702306458.9120667,574000,3.388819456100464
1702306461.8243775,576000,-0.30448490381240845
1702306464.620232,578000,-0.2711731195449829
1702306471.1934578,582000,-0.5939139127731323
1702306472.613733,583000,1.2057901620864868
1702306473.927263,584000,1.0867137908935547
1702306477.8418844,586000,-2.867311954498291
1702306480.54404,588000,-3.0147807598114014
1702306484.5037403,590000,-272.6829833984375
1702306488.7497518,592000,1.1477439403533936
1702306490.2848296,593000,1.6352583169937134
1702306495.311356,596000,-48.20848846435547
1702306498.2307298,598000,1.6541845798492432
1702306499.2786226,599000,0.44022268056869507
1702306502.6631489,600000,1.2426910400390625
1702306503.4401488,601000,1.554978370666504
1702306504.474496,602000,1.1086121797561646
1702306506.9469886,603000,-14.618244171142578
1702306510.7044733,605000,1.1375608444213867
1702306511.6543138,606000,-30.78127098083496
1702306520.5731153,611000,-4.615251064300537
1702306521.7167938,612000,-0.5250657796859741
1702306525.656988,614000,2.13364577293396
1702306528.4291086,615000,0.6001760959625244
1702306528.6400511,616000,-1.6665722131729126
1702306533.130185,619000,-0.6240134239196777
1702306536.9780488,621000,-0.8302004933357239
1702306539.7463572,623000,0.15762585401535034
1702306542.904625,625000,3.4603047370910645
1702306546.670525,627000,1.9836039543151855
1702306550.2101803,629000,0.35353463888168335
1702306551.7890127,630000,1.1210898160934448
1702306554.7648678,631000,3.034410238265991
1702306558.5633526,634000,-6.916225910186768
1702306565.6732202,638000,0.2091996967792511
1702306566.379119,639000,3.400899648666382
1702306570.5941186,641000,0.8788594603538513
1702306575.1532183,644000,3.0603225231170654
1702306582.4815462,648000,3.248366355895996
1702306591.041288,653000,0.8780645132064819
1702306601.672058,660000,-3.804857015609741
1702306603.4863484,661000,2.686185836791992
1702306606.789242,663000,-0.6694808006286621
1702306609.30315,664000,-1.34232759475708
1702306609.8028488,665000,-1.1211369037628174
1702306611.515884,666000,-2.260406255722046
1702306615.1026812,667000,-3.6848535537719727
1702306616.8142617,668000,-2.8789124488830566
1702306619.8892334,670000,3.2574596405029297
1702306620.8362362,671000,-5.289801120758057
1702306628.1801827,675000,0.09423846751451492
1702306629.5630383,676000,2.3215041160583496
1702306632.9698975,678000,3.3950178623199463
1702306636.377164,680000,4.6324896812438965
1702306641.4698508,683000,-0.5897125005722046
1702306643.9496033,685000,1.4802758693695068
1702306646.4965982,686000,3.185809850692749
1702306648.0023177,687000,1.0549229383468628
1702306653.2414849,690000,2.70646333694458
1702306654.4181793,691000,1.7783935070037842
1702306656.71799,692000,4.255914688110352
1702306659.1243424,693000,0.4778260588645935
1702306659.3483021,694000,-0.17960818111896515
1702306662.9719038,696000,-0.9731531739234924
1702306664.1223698,697000,4.040566444396973
1702306667.21438,698000,3.8212950229644775
1702306669.010143,700000,2.1792941093444824
1702306670.9152386,701000,2.8153412342071533
1702306672.4378507,702000,3.6694042682647705
1702306675.3711665,703000,3.227555751800537
1702306677.0223143,704000,2.531226873397827
1702306678.6621983,705000,2.95892596244812
1702306681.6999357,707000,-2.469027042388916
1702306685.5404494,708000,2.376483678817749
1702306688.5607011,711000,4.801347255706787
1702306695.5968616,715000,-0.24435025453567505
1702306699.8268735,718000,-2.4339957237243652
1702306702.6401129,719000,4.2346367835998535
1702306703.5741673,720000,2.3753154277801514
1702306706.4301338,722000,2.785364866256714
1702306711.2848344,724000,2.3506886959075928
1702306712.696101,725000,4.6562819480896
1702306716.033294,727000,2.4107747077941895
1702306717.08259,728000,3.563427448272705
1702306719.8660536,729000,2.028794765472412
1702306725.3471823,733000,4.801494598388672
1702306731.901077,737000,-59.442848205566406
1702306732.975252,738000,3.105562210083008
1702306736.986436,740000,1.4925997257232666
1702306738.531895,741000,2.6951143741607666
1702306740.5162253,742000,3.4833314418792725
1702306741.9923341,743000,3.148960590362549
1702306746.3551052,744000,4.061344623565674
1702306746.5381227,745000,2.7432680130004883
1702306750.8339715,748000,2.6391496658325195
1702306751.690237,749000,0.44734710454940796
1702306762.4924104,755000,3.5870144367218018
1702306765.0081549,757000,3.0139079093933105
1702306766.2777998,758000,1.16523277759552
1702306768.111489,759000,1.9318664073944092
1702306770.8350801,760000,-1.1656417846679688
1702306775.5512347,762000,2.7103586196899414
1702306780.5218043,765000,0.15264441072940826
1702306782.0211132,766000,2.7645301818847656
1702306786.263043,769000,2.9746768474578857
1702306789.2419603,770000,3.1688730716705322
1702306789.997998,771000,2.479166269302368
1702306793.3442335,773000,-25.249773025512695
1702306797.391538,775000,2.1613924503326416
1702306801.50105,778000,-0.5756205916404724
1702306802.8350368,779000,1.684120535850525
1702306807.9580622,781000,1.5752700567245483
1702306812.7446163,784000,1.4170130491256714
1702306814.5854254,785000,2.151733160018921
1702306816.713938,786000,-3.2261509895324707
1702306819.7863731,788000,0.43348532915115356
1702306821.9229908,789000,4.507728576660156
1702306822.8101625,790000,2.690831184387207
1702306827.1178424,792000,2.336609125137329
1702306828.268337,793000,3.475389003753662
1702306829.1959653,794000,0.3330937623977661
1702306838.7881582,799000,-18.6853084564209
1702306846.3278553,803000,1.1012852191925049
1702306848.09816,804000,0.4810294806957245
1702306852.1422374,806000,3.65865421295166
1702306854.885033,808000,0.6851465106010437
1702306857.6407669,810000,0.4802837371826172
1702306860.626112,811000,1.2104899883270264
1702306861.5566514,812000,3.199812650680542
1702306863.238219,813000,3.6011853218078613
1702306864.5522594,814000,0.8721444606781006
1702306865.8613071,815000,1.3984827995300293
1702306869.6300192,817000,-5.890654563903809
1702306874.840663,819000,3.1168816089630127
1702306877.355247,821000,-43.08419418334961
1702306882.7183146,824000,2.593235969543457
1702306885.3598409,826000,0.5216575860977173
1702306888.436193,827000,2.5930569171905518
1702306889.05905,828000,1.027418613433838
1702306896.4689734,832000,2.129786968231201
1702306898.3141553,834000,2.82378888130188
1702306900.578776,835000,2.6790223121643066
1702306904.7026753,837000,1.882742166519165
1702306909.51427,840000,0.5560043454170227
1702306914.721539,842000,2.3446428775787354
1702306915.0343964,843000,2.375525951385498
1702306917.1322124,844000,2.295935869216919
1702306923.2819574,847000,-0.11605961620807648
1702306926.2391906,850000,1.149924635887146
1702306927.7108197,851000,2.1021909713745117
1702306931.951832,853000,3.6368560791015625
1702306934.805881,855000,-1.1768320798873901
1702306939.0303533,857000,2.3163089752197266
1702306947.2009125,862000,3.9273521900177
1702306951.2837737,864000,2.518235921859741
1702306952.9179807,865000,2.533874750137329
1702306954.2402203,866000,2.42512583732605
1702306955.6330495,867000,3.366931438446045
1702306961.3310997,870000,2.933642625808716
1702306972.180065,876000,2.123680353164673
1702306976.8701463,878000,1.6275876760482788
1702306977.7638185,879000,1.194199800491333
1702306978.8998246,880000,2.0625202655792236
1702306980.3829198,881000,4.504152297973633
1702306981.810155,882000,4.310928821563721
1702306989.063311,886000,3.740452289581299
1702306992.1459613,888000,1.895166277885437
1702306994.47361,889000,4.000847339630127
1702306998.9393415,892000,-0.6890871524810791
1702307000.7356038,893000,2.7987396717071533
1702307003.7029297,894000,3.1547906398773193
1702307005.914981,895000,3.3136234283447266
1702307007.4377952,896000,2.9570395946502686
1702307009.9170718,898000,-0.7079567909240723
1702307013.3163548,899000,1.0004910230636597
1702307014.2967923,900000,2.119154214859009
1702307015.65126,901000,2.002321720123291
1702307018.7849965,903000,0.11073432117700577
1702307023.7078917,906000,-3.914989471435547
1702307026.572145,908000,2.85517954826355
1702307030.5400717,909000,-19.138357162475586
1702307032.215227,911000,3.066164493560791
1702307034.071864,912000,1.5660830736160278
1702307040.988896,915000,3.809504747390747
1702307045.1450121,918000,3.6202330589294434
1702307046.309942,919000,1.7080585956573486
1702307058.7170634,926000,2.500945568084717
1702307060.3162422,927000,3.386033058166504
1702307061.4797215,928000,3.616194486618042
1702307062.3032637,929000,2.858372211456299
1702307065.6108303,930000,-5.455172061920166
1702307068.128498,931000,2.715223550796509
1702307069.6694598,932000,1.2873272895812988
1702307072.8117845,934000,-0.4014006555080414
1702307075.5296435,935000,1.7062194347381592
1702307076.1330645,936000,0.6741719245910645
1702307080.2258663,939000,1.8380628824234009
1702307082.3430629,940000,2.537249803543091
1702307084.562737,941000,2.0008702278137207
1702307085.753106,942000,1.7047046422958374
1702307088.9307206,944000,3.3937580585479736
1702307099.4741805,950000,1.4999451637268066
1702307102.8781354,951000,2.802208423614502
1702307104.3702004,952000,2.5642828941345215
1702307107.0597482,954000,2.508866310119629
1702307119.4311628,961000,2.352869987487793
1702307122.6337454,964000,2.4534225463867188
1702307129.4407632,968000,3.581204652786255
1702307137.0395167,971000,3.2003607749938965
1702307137.39357,972000,2.1918785572052
1702307138.784003,973000,-1.6363190412521362
1702307141.225614,975000,0.10117876529693604
1702307143.1145747,976000,3.7717747688293457
1702307145.5214753,977000,2.623037099838257
1702307149.5994217,980000,2.8434205055236816
1702307150.6990888,981000,3.270408868789673
1702307154.885088,983000,4.058662414550781
1702307157.8368785,985000,3.357759714126587
1702307158.9998136,986000,2.6746604442596436
1702307164.8971782,988000,3.4586915969848633
1702307166.8705802,990000,3.67081880569458
1702307168.9994683,991000,3.824404001235962
1702307172.7979844,993000,3.0320568084716797
1702307175.0958273,995000,3.2484288215637207
1702307176.7312853,996000,-1.2055319547653198
1702307179.9593647,997000,2.9321086406707764
1702307180.3996935,998000,3.6815946102142334
1702307184.682244,1001000,3.722217082977295
1702307188.3419259,1002000,-10.56344223022461
1702307189.0598183,1003000,4.119411945343018
1702307194.7619154,1006000,3.050072431564331
1702307197.673634,1007000,3.2855329513549805
1702307208.0937762,1015000,0.8586994409561157
1702307213.9157486,1018000,3.632817029953003
1702307215.3440785,1019000,4.114491939544678
1702307218.1826212,1021000,3.3652994632720947
1702307222.371719,1023000,0.7328708171844482
1702307223.9444435,1024000,3.889904499053955
1702307229.81598,1027000,3.729691505432129
1702307232.405511,1028000,3.1860568523406982
1702307234.7737498,1030000,3.7438998222351074
1702307236.245643,1031000,4.965511322021484
1702307237.6682599,1032000,4.095390319824219
1702307240.6622136,1033000,2.033036708831787
1702307243.977828,1036000,4.497195720672607
1702307259.1920648,1044000,3.696671724319458
1702307260.590354,1045000,4.11454963684082
1702307261.894294,1046000,4.291312217712402
1702307265.0143163,1048000,4.062445640563965
1702307268.2426426,1050000,4.2185564041137695
1702307270.2175102,1051000,4.005577087402344
1702307271.6272242,1052000,4.211753845214844
1702307275.1091287,1054000,2.304769992828369
1702307276.8532505,1056000,-2.012157678604126
1702307280.3073344,1057000,-4.165761470794678
1702307281.0134895,1058000,3.1037256717681885
1702307286.986712,1061000,3.6863372325897217
1702307289.1638803,1062000,3.1026389598846436
1702307290.4470978,1063000,2.8517909049987793
1702307298.5678031,1068000,2.359971046447754
1702307302.336062,1070000,-1.0278472900390625
1702307303.497998,1071000,2.2640187740325928
1702307310.2468386,1074000,3.363499641418457
1702307310.8816643,1076000,2.8788938522338867
1702307321.338013,1082000,1.219880223274231
1702307323.5127776,1083000,2.6029298305511475
1702307327.1891427,1085000,2.9972758293151855
1702307329.6018531,1087000,-4.583336353302002
1702307335.8709176,1091000,0.2589868903160095
1702307339.3118749,1093000,3.5644357204437256
1702307343.4231658,1095000,-1.6784770488739014
1702307346.2458296,1097000,2.5974936485290527
1702307348.9666524,1099000,-2.724285125732422
1702307354.6827736,1101000,-2.0458688735961914
1702307355.5639718,1102000,0.7761796712875366
1702307357.0960562,1103000,1.5512593984603882
1702307358.642977,1104000,2.0738847255706787
1702307362.0097823,1105000,1.5780328512191772
1702307366.5061138,1109000,0.3986915051937103
1702307370.515418,1111000,1.8803184032440186
1702307371.782677,1112000,1.1567206382751465
1702307382.8800642,1118000,-5.874232292175293
1702307386.1911445,1120000,-5.3510637283325195
1702307389.9585075,1122000,0.7637350559234619
1702307391.2980306,1123000,-2.285837173461914
1702307392.9331698,1124000,1.1784350872039795
1702307407.6791794,1133000,-3.7582409381866455
1702307410.8715765,1135000,3.729421854019165
1702307418.172912,1138000,1.0452542304992676
1702307422.4603992,1141000,0.6139633059501648
1702307424.9059978,1142000,-3.994007110595703
1702307427.4388192,1144000,-2.023458242416382
1702307429.5383964,1145000,-3.8178834915161133
1702307430.944187,1146000,1.9820142984390259
1702307433.192905,1147000,-1.8749769926071167
1702307436.879892,1149000,1.9290680885314941
1702307437.8328795,1150000,1.0079351663589478
1702307441.8589733,1152000,-1.2135051488876343
1702307443.1016893,1153000,0.6883783340454102
1702307443.805836,1154000,-0.5707079768180847
1702307451.0636642,1157000,-7.687608242034912
1702307452.311901,1158000,-5.334817409515381
1702307455.417232,1160000,2.472344160079956
1702307469.3320134,1168000,-0.21780817210674286
1702307470.5622776,1169000,1.4102662801742554
1702307471.5586388,1170000,-4.331859111785889
1702307473.2819242,1171000,-10.194048881530762
1702307479.0140145,1174000,-3.3543362617492676
1702307481.126382,1175000,-2.3899290561676025
1702307482.7152865,1176000,0.11009271442890167
1702307487.8731234,1179000,1.5300049781799316
1702307489.8264415,1180000,-4.110351085662842
1702307491.2795422,1181000,-1.2289806604385376
1702307496.8328242,1184000,-1.3798003196716309
1702307517.9875314,1196000,-1.6047852039337158
1702307523.1857708,1199000,-0.349871963262558
1702307526.227947,1201000,1.382105827331543
1702307527.9604137,1202000,-6.3367815017700195
1702307532.116736,1204000,-5.494693756103516
1702307533.9215808,1205000,2.4515798091888428
1702307538.3709104,1208000,1.600140929222107
1702307544.4305441,1211000,-0.1088283434510231
1702307545.2124813,1212000,1.8054884672164917
1702307548.0346682,1213000,-4.730205535888672
1702307551.3998814,1214000,0.2612806558609009
1702307552.7722952,1215000,-0.10649511963129044
1702307554.3806264,1216000,0.767309844493866
1702307555.9589877,1217000,-1.59093177318573
1702307557.5956967,1218000,1.412306785583496
1702307561.6048124,1220000,-5.517421722412109
1702307564.6039493,1222000,1.4996578693389893
1702307566.3892443,1223000,1.3190559148788452
1702307569.8875604,1225000,0.15949909389019012
1702307573.7604809,1227000,-8.20814323425293
1702307578.014305,1229000,-3.8050928115844727
1702307578.6476264,1230000,-4.513594150543213
1702307580.2537625,1231000,-4.931950569152832
1702307582.6032264,1232000,1.0929615497589111
1702307584.4894726,1233000,1.0953994989395142
1702307587.2097824,1234000,0.18175414204597473
1702307602.6495726,1243000,2.1117682456970215
1702307603.7791028,1244000,-0.5621647238731384
1702307608.5584705,1246000,1.896271824836731
1702307609.8445807,1247000,0.1519593894481659
1702307618.133605,1251000,1.2896043062210083
1702307619.9508688,1252000,1.693141222000122
1702307622.1769876,1253000,0.6717747449874878
1702307626.8223152,1255000,-3.1441283226013184
1702307630.5359564,1258000,2.575772523880005
1702307636.382763,1261000,1.400599479675293
1702307639.6867876,1263000,0.027629483491182327
1702307642.781747,1265000,2.601949691772461
1702307645.1407385,1266000,3.440624475479126
1702307647.9529092,1268000,3.1485064029693604
1702307649.8088615,1269000,1.823268175125122
1702307656.7706451,1272000,-41.70072937011719
1702307658.1824205,1273000,-76.39443969726562
1702307659.694945,1274000,2.762199640274048
1702307664.26003,1276000,1.3037735223770142
1702307665.3037777,1277000,1.7311551570892334
1702307666.9734282,1278000,2.865999698638916
1702307670.013988,1280000,1.4555690288543701
1702307672.9629633,1281000,2.088186502456665
1702307673.9064896,1282000,1.694566249847412
1702307675.686411,1283000,2.2631821632385254
1702307676.8089657,1284000,-1.1416232585906982
1702307678.3314486,1285000,-2.467050790786743
1702307688.5886858,1290000,1.229793906211853
1702307692.607777,1291000,0.7510295510292053
1702307694.9293532,1293000,0.08743875473737717
1702307702.027179,1297000,1.1244745254516602
1702307702.5827086,1298000,-0.5583221316337585
1702307705.680032,1300000,3.454777479171753
1702307712.7315195,1304000,2.557394027709961
1702307716.3466148,1306000,-0.8045754432678223
1702307721.2015178,1308000,-0.1718946397304535
1702307725.0201058,1310000,3.5862154960632324
1702307726.8078601,1311000,1.4027258157730103
1702307729.867738,1312000,0.2926681935787201
1702307730.8425078,1313000,-2.3160064220428467
1702307734.0716555,1315000,-3.0701100826263428
1702307739.9442897,1318000,-2.371436357498169
1702307741.6572468,1319000,-3.64330792427063
1702307744.5141907,1321000,-1.2999051809310913
1702307748.3219287,1322000,1.4199496507644653
1702307748.7278552,1323000,-4.0335564613342285
1702307751.686059,1325000,-6.417211055755615
1702307760.3777463,1329000,-0.4804922938346863
1702307763.8187091,1331000,1.4050296545028687
1702307764.8729336,1332000,-0.9273605942726135
1702307769.37176,1334000,1.8536057472229004
1702307770.8738003,1335000,2.3476946353912354
1702307776.891406,1338000,0.3513287603855133
1702307777.9810286,1339000,1.29802668094635
1702307786.7337227,1344000,1.2651126384735107
1702307788.3574185,1345000,3.4797956943511963
1702307791.2901688,1346000,-43.72929382324219
1702307792.7069774,1347000,3.5011632442474365
1702307796.9806516,1349000,2.1311473846435547
1702307799.7075934,1351000,1.144039511680603
1702307800.8069453,1352000,-1.066219449043274
1702307804.7594888,1353000,-1.1145049333572388
1702307805.0663297,1354000,2.0954813957214355
1702307806.982194,1355000,1.2042697668075562
1702307807.7333212,1356000,2.3562047481536865
1702307813.6939924,1359000,2.7499725818634033
1702307817.937835,1362000,3.5595312118530273
1702307822.5137477,1364000,3.4783596992492676
1702307826.7299047,1366000,3.0766406059265137
1702307828.3291807,1367000,1.6944993734359741
1702307829.9862845,1368000,2.952864646911621
1702307833.0593276,1369000,2.3282346725463867
1702307834.489564,1370000,2.2876687049865723
1702307842.4893758,1374000,1.5756345987319946
1702307849.2433627,1378000,2.646811008453369
1702307853.5377665,1380000,2.812837600708008
1702307855.202888,1381000,4.15110969543457
1702307862.762677,1384000,3.3286211490631104
1702307864.0024273,1385000,3.576404333114624
1702307865.7303672,1386000,4.687504291534424
1702307877.4083142,1389000,-1.8546010255813599
1702307888.5756364,1392000,4.978359699249268
1702307892.6135056,1393000,2.9786489009857178
1702307897.9614363,1394000,2.728699207305908
1702307905.0310488,1396000,-0.8560007810592651
1702307908.7545602,1397000,3.8116326332092285
1702307912.3538444,1398000,-2.94038462638855
1702307924.80779,1401000,8.145066261291504
1702307933.730074,1403000,4.811366081237793
1702307937.5186803,1404000,-79.62689971923828
1702307944.2215455,1406000,3.107525587081909
1702307944.9311702,1407000,2.354299545288086
1702307946.0960991,1408000,3.4141759872436523
1702307950.421315,1410000,4.167355060577393
1702307951.872509,1411000,2.610799551010132
1702307954.8665624,1414000,4.476784706115723
1702307964.099362,1419000,2.9805994033813477
1702307984.1731725,1431000,3.169215202331543
1702307985.3994284,1432000,4.072776794433594
1702307986.8205142,1433000,2.0826785564422607
1702307988.4547696,1434000,3.3376996517181396
1702307995.6225953,1438000,3.38637113571167
1702308001.6977956,1441000,3.473278045654297
1702308003.1160476,1442000,3.2802677154541016
1702308005.6888018,1444000,2.0366663932800293
1702308007.0402699,1445000,3.820185899734497
1702308009.7787,1446000,3.194438934326172
1702308010.6374507,1447000,4.133147239685059
1702308013.4047356,1449000,2.8786346912384033
1702308017.6578007,1451000,4.069636344909668
1702308018.5746045,1452000,4.293745517730713
1702308020.533973,1453000,3.7942538261413574
1702308022.2374766,1455000,3.9841225147247314
1702308025.275754,1456000,1.9567694664001465
1702308027.364511,1457000,1.7498087882995605
1702308030.7669387,1459000,4.396271705627441
1702308033.6785011,1461000,3.0124995708465576
1702308043.71968,1467000,2.472275972366333
1702308046.3010573,1469000,3.393933057785034
1702308054.3391368,1474000,2.5571067333221436
1702308055.6038957,1475000,2.803492307662964
1702308071.3673463,1484000,3.2580692768096924
1702308072.7367382,1485000,4.937670707702637
1702308079.3047447,1489000,3.9549949169158936
1702308085.8705971,1493000,4.379171371459961
1702308091.0195255,1496000,2.171464681625366
1702308096.2932649,1499000,4.718066692352295
1702308097.493293,1500000,3.1153087615966797
1702308099.7318673,1501000,4.261463642120361
1702308104.9738443,1504000,3.7189760208129883
1702308105.9031763,1505000,3.628573417663574
1702308111.346706,1508000,4.362026691436768
1702308113.795739,1510000,3.5821139812469482
1702308115.1257179,1511000,2.7513954639434814
1702308116.623304,1512000,2.978468179702759
1702308130.5194066,1519000,4.012134552001953
1702308131.8294544,1520000,2.4072177410125732
1702308132.9844244,1521000,5.165241718292236
1702308134.0511224,1522000,3.8563954830169678
1702308138.546209,1524000,4.765647888183594
1702308139.6941814,1525000,4.854487419128418
1702308140.6977427,1526000,3.171477794647217
1702308142.1948013,1527000,3.0827152729034424
1702308145.4915483,1528000,4.7028117179870605
1702308146.1793747,1529000,3.0198450088500977
1702308147.5004435,1530000,5.395070552825928
1702308148.6536705,1531000,3.916226625442505
1702308150.0107164,1532000,3.3721814155578613
1702308156.2818048,1535000,4.2880330085754395
1702308158.8964782,1537000,4.148085594177246
1702308167.3588557,1542000,4.115213871002197
1702308168.7656994,1543000,4.160507678985596
1702308171.4253545,1544000,4.271978378295898
1702308173.5128565,1546000,3.758075714111328
1702308186.6485379,1553000,4.905890464782715
1702308190.3683553,1555000,3.47917103767395
1702308198.656297,1560000,2.8978796005249023
1702308199.7334592,1561000,3.411595106124878
1702308205.9874716,1565000,3.1906044483184814
1702308208.6135476,1567000,3.497021436691284
1702308209.876721,1568000,4.002285480499268
1702308214.9394581,1570000,3.443795919418335
1702308216.5766902,1571000,4.056434631347656
1702308219.6807585,1573000,3.546088457107544
1702308220.98642,1574000,3.51359224319458
1702308231.9730444,1580000,3.0914227962493896
1702308232.6781886,1581000,3.6788954734802246
1702308233.9533298,1582000,4.325219631195068
1702308242.390369,1587000,2.304621696472168
1702308243.2436256,1588000,2.52824330329895
1702308259.805222,1597000,3.584826946258545
1702308261.052193,1598000,4.090428352355957
1702308266.5430954,1601000,3.3669910430908203
1702308267.6626546,1602000,4.327521324157715
1702308268.6625173,1603000,5.205539703369141
1702308271.594423,1605000,4.035207271575928
1702308277.0484726,1607000,1.1870766878128052
1702308279.8857572,1609000,3.985414981842041
1702308285.7684042,1612000,3.9565553665161133
1702308286.808158,1613000,3.6925442218780518
1702308289.7085145,1615000,3.8794353008270264
1702308292.4278598,1616000,3.647575855255127
1702308294.6757026,1618000,4.38245964050293
1702308297.6478934,1620000,3.2593955993652344
1702308300.613291,1621000,2.963679552078247
1702308302.5692763,1623000,4.895909786224365
1702308304.0125184,1624000,3.745020627975464
1702308311.8506904,1628000,4.265963077545166
1702308312.8294094,1629000,2.3003156185150146
1702308318.614488,1631000,4.1417999267578125
1702308318.921175,1632000,4.8417463302612305
1702308320.1205177,1633000,2.406454086303711
1702308321.1872032,1634000,3.121203899383545
1702308324.4979725,1636000,3.880066394805908
1702308326.6313434,1637000,3.9068198204040527
1702308327.8263068,1638000,2.8361949920654297
1702308329.2741444,1639000,-0.6338226795196533
1702308335.6973276,1643000,3.945124626159668
1702308338.9803789,1645000,-1.6881195306777954
1702308341.9704914,1646000,3.341840982437134
1702308344.9302194,1647000,4.313377380371094
1702308347.047142,1649000,4.075599670410156
1702308349.5287745,1651000,3.4130141735076904
1702308353.260753,1653000,1.6006805896759033
1702308356.1581278,1655000,3.3537769317626953
1702308357.7424707,1656000,2.66428279876709
1702308360.7231982,1657000,2.667680501937866
1702308362.2686298,1659000,2.3023593425750732
1702308363.3422942,1660000,1.623516321182251
1702308365.3076193,1661000,2.9570624828338623
1702308368.7204323,1662000,2.39933705329895
1702308370.3249192,1663000,0.7543001174926758
1702308372.2998812,1664000,2.3931691646575928
1702308374.385223,1666000,2.3038744926452637
1702308378.7648003,1667000,4.045971870422363
1702308381.1445239,1670000,0.4048261344432831
1702308382.4386501,1671000,2.37606143951416
1702308386.702482,1673000,3.8970396518707275
1702308388.0155368,1674000,2.090916156768799
1702308392.5190847,1677000,3.3884294033050537
1702308395.3853505,1678000,1.4157732725143433
1702308396.0730321,1679000,3.7379257678985596
1702308397.1302476,1680000,2.1258084774017334
1702308398.3206136,1681000,0.3249346613883972
1702308405.2875588,1683000,2.975022554397583
1702308409.3892882,1687000,4.54646635055542
1702308413.6949499,1689000,3.665107250213623
1702308414.8185015,1690000,1.6869407892227173
1702308416.1734412,1691000,2.2856662273406982
1702308421.909075,1694000,3.594022512435913
1702308422.8191783,1695000,3.6689720153808594
1702308426.103527,1697000,3.361530303955078
1702308434.2374704,1701000,4.557794570922852
1702308435.5391867,1702000,3.117011785507202
1702308436.6437354,1703000,3.1477854251861572
1702308439.0790374,1704000,4.229599475860596
1702308442.0023546,1706000,3.5792229175567627
1702308448.3995535,1710000,-8.765542984008789
1702308449.522593,1711000,-11.418389320373535
1702308452.3652394,1713000,4.120784759521484
1702308455.5187469,1714000,4.290862083435059
1702308455.721206,1715000,3.235837936401367
1702308457.5312757,1716000,-2.632004976272583
1702308459.5793812,1718000,-16.298669815063477
1702308466.677617,1721000,4.293636322021484
1702308468.1257887,1722000,4.7216315269470215
1702308469.2782466,1723000,3.4731147289276123
1702308470.7534127,1724000,2.4993953704833984
1702308473.259516,1725000,3.7415637969970703
1702308477.633401,1728000,4.1590681076049805
1702308478.8212662,1729000,2.7597758769989014
1702308485.6063502,1733000,4.16449499130249
1702308486.739369,1734000,3.8581438064575195
1702308490.8721175,1736000,4.643690586090088
1702308492.0786865,1737000,4.056555271148682
1702308493.2706394,1738000,4.112491607666016
1702308501.9306908,1742000,5.023686408996582
1702308507.3826258,1745000,5.008241653442383
1702308509.1689484,1747000,1.975731372833252
1702308515.5576026,1750000,2.3189594745635986
1702308516.0993042,1751000,3.3857345581054688
1702308517.4945178,1752000,5.167252540588379
1702308518.70952,1753000,2.746872901916504
1702308519.8281512,1754000,2.888603925704956
1702308524.3896601,1756000,5.0335516929626465
1702308525.4498544,1757000,2.894859790802002
1702308527.7437341,1758000,3.8134360313415527
1702308533.5478985,1761000,4.38287878036499
1702308534.267496,1762000,3.706439971923828
1702308537.1087666,1764000,4.917619705200195
1702308538.6043773,1765000,3.5443317890167236
1702308541.298867,1766000,2.222761392593384
1702308544.8855708,1769000,4.59505558013916
1702308549.489372,1771000,4.841663360595703
1702308550.31619,1772000,3.912508487701416
1702308551.8461587,1773000,4.571334362030029
1702308553.437959,1774000,3.9748268127441406
1702308566.8980527,1781000,4.073042392730713
1702308567.2979982,1782000,4.539912223815918
1702308572.0125031,1785000,4.838947296142578
1702308579.6541147,1790000,4.410013198852539
1702308586.3849785,1794000,4.95634126663208
1702308590.5087423,1796000,4.43860387802124
1702308594.13616,1798000,0.350055992603302
1702308597.0437024,1800000,3.586225748062134
1702308598.1981506,1801000,4.181906223297119
1702308602.1540384,1803000,3.962899684906006
1702308609.4570901,1807000,0.13535553216934204
1702308610.5611799,1808000,3.7529587745666504
1702308611.4962747,1809000,4.484194755554199
1702308614.4714706,1811000,3.5176894664764404
1702308618.2506058,1812000,4.003799915313721
1702308619.0819674,1813000,3.851393461227417
1702308627.2795045,1817000,3.15647554397583
1702308629.0633845,1819000,-1.7331055402755737
1702308632.4277601,1821000,5.0441412925720215
1702308635.7903993,1823000,2.4994938373565674
1702308637.1353974,1824000,0.5412313342094421
1702308639.7335641,1826000,3.9277474880218506
1702308646.4502704,1830000,4.664061546325684
1702308649.9552414,1832000,4.6711039543151855
1702308652.634066,1833000,3.480713367462158
1702308657.281562,1836000,-22.80594825744629
1702308662.1156578,1839000,-9.698616981506348
1702308669.4424543,1843000,2.5263946056365967
1702308671.4940548,1845000,1.000427007675171
1702308672.4912307,1846000,4.217646598815918
1702308678.2880738,1849000,4.056890487670898
1702308685.8099246,1853000,2.172227144241333
1702308688.264123,1854000,4.640416622161865
1702308689.471963,1855000,3.1285393238067627
1702308691.0279336,1856000,5.073126316070557
1702308696.5146642,1859000,3.429272174835205
1702308698.3292358,1860000,3.1802866458892822
1702308699.192989,1861000,2.0298550128936768
1702308702.4704807,1863000,-1.3824362754821777
1702308705.035037,1864000,-3.5016427040100098
1702308706.0937374,1865000,-0.4641420245170593
1702308709.2365136,1867000,3.7969586849212646
1702308710.5635452,1868000,-1.311657428741455
1702308717.294432,1871000,2.032982110977173
1702308719.3463926,1872000,2.287168264389038
1702308724.2323568,1874000,2.8689329624176025
1702308726.8121212,1876000,2.4742496013641357
1702308727.5790975,1877000,5.235358715057373
1702308729.7354,1878000,1.8584879636764526
1702308742.0480618,1885000,3.746176242828369
1702308744.2524297,1886000,2.8042244911193848
1702308744.97103,1887000,2.246668815612793
1702308747.1839104,1888000,1.8151259422302246
1702308758.1484907,1894000,1.287168025970459
1702308760.9164252,1895000,2.9546496868133545
1702308762.557563,1896000,4.512893199920654
1702308763.6073086,1897000,2.7952797412872314
1702308765.4150412,1898000,5.611163139343262
1702308769.718377,1900000,3.814227342605591
1702308774.2942643,1903000,1.6817259788513184
1702308779.8679037,1906000,5.4768452644348145
1702308789.6347833,1910000,4.0560712814331055
1702308790.7295842,1911000,5.3755998611450195
1702308792.0941012,1912000,2.6936569213867188
1702308793.9363914,1913000,2.2708728313446045
1702308794.9696574,1914000,4.918224811553955
1702308799.2874157,1916000,-38.198970794677734
1702308801.1480162,1917000,-2.5664262771606445
1702308808.534009,1921000,3.289018154144287
1702308812.38755,1924000,1.7961064577102661
1702308814.858144,1925000,1.8877756595611572
1702308820.2653527,1928000,4.550238132476807
1702308823.7831004,1929000,1.126317024230957
1702308824.6555214,1930000,2.511899709701538
1702308827.742144,1931000,4.578520774841309
1702308829.254688,1932000,3.26395583152771
1702308832.346553,1934000,4.6824469566345215
1702308833.2970545,1935000,4.999120712280273
1702308836.8614075,1936000,1.528691291809082
1702308837.4209285,1937000,3.7634496688842773
1702308839.121988,1938000,1.8991637229919434
1702308846.6762216,1942000,3.79856276512146
1702308848.1627245,1943000,3.578974485397339
1702308849.5147657,1944000,4.749382019042969
1702308856.3290627,1947000,3.210864305496216
1702308860.011355,1949000,3.597882032394409
1702308861.7452826,1950000,0.9800495505332947
1702308863.1811707,1951000,1.2620388269424438
1702308867.7693107,1953000,3.1798698902130127
1702308868.8888931,1954000,3.53808856010437
1702308870.5859492,1955000,2.6165542602539062
1702308875.5971882,1957000,0.6672561764717102
1702308876.351937,1958000,1.4403263330459595
1702308886.5134578,1963000,2.4574642181396484
1702308890.3919353,1965000,2.2744407653808594
1702308891.8461087,1966000,1.1177661418914795
1702308897.439589,1968000,3.95212459564209
1702308902.2417622,1971000,1.909212589263916
1702308906.7302866,1973000,0.6502195000648499
1702308908.512276,1974000,1.136362910270691
1702308910.534053,1975000,4.436456680297852
1702308913.658422,1977000,1.6086442470550537
1702308917.8394735,1979000,3.4056146144866943
1702308919.8388538,1980000,4.632444858551025
1702308921.4883323,1981000,0.7785660028457642
1702308929.9642534,1985000,3.8267996311187744
1702308932.284249,1986000,2.6280722618103027
1702308937.0354588,1988000,3.8711724281311035
1702308942.306784,1990000,3.9793593883514404
1702308962.0417235,1995000,7.311899185180664
1702308978.654659,1999000,5.311732769012451
1702308982.599553,2000000,6.56198263168335
1702308986.508595,2001000,8.678659439086914
1702308990.1699903,2002000,5.730199813842773
1702309039.5992508,2014000,7.9798994064331055
1702309047.5778792,2016000,-120.87370300292969
1702309054.866536,2018000,-111.37360382080078
1702309063.7367065,2020000,-13.027653694152832
1702309067.6370997,2021000,-63.197669982910156
1702309071.4195685,2022000,-28.90435218811035
1702309076.2781992,2023000,9.978899002075195
1702309081.5380518,2024000,-60.032623291015625
1702309085.4768615,2025000,10.179439544677734
1702309089.2885427,2026000,11.47973918914795
1702309092.6151683,2027000,9.378979682922363
1702309096.3747082,2028000,8.353324890136719
1702309101.6320434,2029000,10.979559898376465
1702309104.982015,2030000,9.579039573669434
1702309112.537358,2032000,7.77795934677124
1702309116.2132905,2033000,7.478199005126953
1702309121.423903,2034000,9.478899955749512
1702309129.061076,2036000,11.578999519348145
1702309136.2253108,2038000,9.979000091552734
1702309149.4182086,2041000,11.579460144042969
