07/01/2024 22:32:32;1704663152;21
07/01/2024 22:32:33;1704663153;19
07/01/2024 22:32:33;1704663153;18
07/01/2024 22:32:34;1704663154;17
07/01/2024 22:32:34;1704663154;17
07/01/2024 22:32:35;1704663155;16
07/01/2024 22:32:35;1704663155;19
07/01/2024 22:32:36;1704663156;17
07/01/2024 22:32:36;1704663156;17
07/01/2024 22:32:36;1704663156;17
07/01/2024 22:32:37;1704663157;18
07/01/2024 22:32:37;1704663157;17
07/01/2024 22:32:38;1704663158;17
07/01/2024 22:32:38;1704663158;17
07/01/2024 22:32:39;1704663159;17
07/01/2024 22:32:40;1704663160;18
07/01/2024 22:32:40;1704663160;19
07/01/2024 22:32:41;1704663161;16
07/01/2024 22:32:41;1704663161;17
07/01/2024 22:32:42;1704663162;18
07/01/2024 22:32:42;1704663162;17
07/01/2024 22:32:43;1704663163;17
07/01/2024 22:32:43;1704663163;17
07/01/2024 22:32:44;1704663164;16
07/01/2024 22:32:44;1704663164;17
07/01/2024 22:32:45;1704663165;18
07/01/2024 22:32:45;1704663165;17
07/01/2024 22:32:46;1704663166;18
07/01/2024 22:32:47;1704663167;18
07/01/2024 22:32:47;1704663167;16
07/01/2024 22:32:48;1704663168;16
07/01/2024 22:32:48;1704663168;16
07/01/2024 22:32:49;1704663169;18
07/01/2024 22:32:49;1704663169;17
07/01/2024 22:32:50;1704663170;17
07/01/2024 22:32:50;1704663170;17
07/01/2024 22:32:51;1704663171;17
07/01/2024 22:32:51;1704663171;17
07/01/2024 22:32:52;1704663172;18
07/01/2024 22:32:52;1704663172;17
07/01/2024 22:32:53;1704663173;16
07/01/2024 22:32:53;1704663173;17
07/01/2024 22:32:54;1704663174;18
07/01/2024 22:32:54;1704663174;17
07/01/2024 22:32:55;1704663175;18
07/01/2024 22:32:55;1704663175;17
07/01/2024 22:32:56;1704663176;17
07/01/2024 22:32:56;1704663176;18
07/01/2024 22:32:57;1704663177;15
07/01/2024 22:32:57;1704663177;18
07/01/2024 22:32:58;1704663178;19
07/01/2024 22:32:58;1704663178;17
07/01/2024 22:32:58;1704663178;19
07/01/2024 22:32:59;1704663179;16
07/01/2024 22:32:59;1704663179;16
07/01/2024 22:33:00;1704663180;19
07/01/2024 22:33:00;1704663180;17
07/01/2024 22:33:01;1704663181;17
07/01/2024 22:33:01;1704663181;17
07/01/2024 22:33:02;1704663182;15
07/01/2024 22:33:02;1704663182;19
07/01/2024 22:33:03;1704663183;17
07/01/2024 22:33:03;1704663183;18
07/01/2024 22:33:04;1704663184;17
07/01/2024 22:33:04;1704663184;16
07/01/2024 22:33:04;1704663184;17
07/01/2024 22:33:05;1704663185;15
07/01/2024 22:33:05;1704663185;19
07/01/2024 22:33:06;1704663186;17
07/01/2024 22:33:06;1704663186;18
07/01/2024 22:33:07;1704663187;17
07/01/2024 22:33:07;1704663187;19
07/01/2024 22:33:08;1704663188;18
07/01/2024 22:33:08;1704663188;18
07/01/2024 22:33:09;1704663189;17
07/01/2024 22:33:09;1704663189;18
07/01/2024 22:33:10;1704663190;18
07/01/2024 22:33:10;1704663190;17
07/01/2024 22:33:10;1704663190;17
07/01/2024 22:33:11;1704663191;19
07/01/2024 22:33:11;1704663191;16
07/01/2024 22:33:12;1704663192;17
07/01/2024 22:33:12;1704663192;17
07/01/2024 22:33:13;1704663193;17
07/01/2024 22:33:13;1704663193;17
07/01/2024 22:33:14;1704663194;18
07/01/2024 22:33:14;1704663194;17
07/01/2024 22:33:15;1704663195;17
07/01/2024 22:33:15;1704663195;18
07/01/2024 22:33:17;1704663197;94
07/01/2024 22:33:17;1704663197;16
07/01/2024 22:33:18;1704663198;20
07/01/2024 22:33:19;1704663199;15
07/01/2024 22:33:19;1704663199;18
07/01/2024 22:33:20;1704663200;18
07/01/2024 22:33:21;1704663201;17
07/01/2024 22:33:21;1704663201;17
07/01/2024 22:33:22;1704663202;18
07/01/2024 22:33:22;1704663202;17
07/01/2024 22:33:23;1704663203;17
