07/01/2024 23:24:37;1704666277;32415;1;6,9948
07/01/2024 23:24:37;1704666277;32427;2;6,49615
07/01/2024 23:24:37;1704666277;32438;2;6,4903
07/01/2024 23:24:38;1704666278;32449;2;5,495299
07/01/2024 23:24:38;1704666278;32460;2;6,49135
07/01/2024 23:24:38;1704666278;32471;2;5,99135
07/01/2024 23:24:38;1704666278;32482;2;6,4954
07/01/2024 23:24:39;1704666279;32493;2;6,4903
07/01/2024 23:24:39;1704666279;32504;2;6,49545
07/01/2024 23:24:39;1704666279;32515;2;6,4954
07/01/2024 23:24:39;1704666279;32526;2;6,49285
07/01/2024 23:24:39;1704666279;32537;2;6,4931
07/01/2024 23:24:40;1704666280;32548;2;6,49635
07/01/2024 23:24:40;1704666280;32558;2;6,4916
07/01/2024 23:24:40;1704666280;32569;2;6,4904
07/01/2024 23:24:40;1704666280;32580;2;6,49645
07/01/2024 23:24:40;1704666280;32591;2;6,2402
07/01/2024 23:24:41;1704666281;32602;2;6,4914
07/01/2024 23:24:41;1704666281;32613;2;6,49535
07/01/2024 23:24:41;1704666281;32624;2;6,4955
07/01/2024 23:24:41;1704666281;32634;2;6,493
07/01/2024 23:24:41;1704666281;32645;2;6,4903
07/01/2024 23:24:42;1704666282;32656;2;6,4959
07/01/2024 23:24:42;1704666282;32668;2;6,49535
07/01/2024 23:24:42;1704666282;32678;2;6,49045
07/01/2024 23:24:42;1704666282;32689;2;6,4904
07/01/2024 23:24:43;1704666283;32700;2;6,493
07/01/2024 23:24:43;1704666283;32711;2;6,49145
07/01/2024 23:24:43;1704666283;32722;2;6,4955
07/01/2024 23:24:43;1704666283;32733;2;6,49045
07/01/2024 23:24:43;1704666283;32745;2;6,4886
07/01/2024 23:24:44;1704666284;32756;2;6,49025
07/01/2024 23:24:44;1704666284;32767;2;6,4928
07/01/2024 23:24:44;1704666284;32778;2;6,49145
07/01/2024 23:24:44;1704666284;32790;2;6,4952
07/01/2024 23:24:44;1704666284;32801;2;6,49275
07/01/2024 23:24:45;1704666285;32812;2;6,489
07/01/2024 23:24:45;1704666285;32823;2;6,488851
07/01/2024 23:24:45;1704666285;32834;2;6,49535
07/01/2024 23:24:45;1704666285;32844;2;5,99165
07/01/2024 23:24:45;1704666285;32856;2;6,49285
07/01/2024 23:24:46;1704666286;32867;2;6,495501
07/01/2024 23:24:46;1704666286;32878;2;6,49485
07/01/2024 23:24:46;1704666286;32889;2;5,99135
07/01/2024 23:24:46;1704666286;32900;2;6,49285
07/01/2024 23:24:47;1704666287;32911;2;6,49045
07/01/2024 23:24:47;1704666287;32921;2;6,4955
07/01/2024 23:24:47;1704666287;32932;2;6,49545
07/01/2024 23:24:47;1704666287;32943;2;5,99545
07/01/2024 23:24:47;1704666287;32954;2;6,49335
07/01/2024 23:24:48;1704666288;32965;2;6,4959
07/01/2024 23:24:48;1704666288;32977;2;6,4903
07/01/2024 23:24:48;1704666288;32988;2;6,49525
07/01/2024 23:24:48;1704666288;32999;2;6,4965
07/01/2024 23:24:49;1704666289;33010;2;6,4964
07/01/2024 23:24:49;1704666289;33021;2;5,99555
07/01/2024 23:24:49;1704666289;33032;2;5,9914
07/01/2024 23:24:49;1704666289;33043;2;6,495501
07/01/2024 23:24:50;1704666290;33053;2;6,4906
07/01/2024 23:24:50;1704666290;33064;2;6,49045
07/01/2024 23:24:50;1704666290;33074;2;6,493401
07/01/2024 23:24:50;1704666290;33085;2;6,4954
07/01/2024 23:24:50;1704666290;33097;2;6,489
07/01/2024 23:24:51;1704666291;33108;2;6,4928
07/01/2024 23:24:51;1704666291;33119;2;6,493
07/01/2024 23:24:51;1704666291;33129;2;5,9954
07/01/2024 23:24:51;1704666291;33141;2;6,49545
07/01/2024 23:24:52;1704666292;33151;2;6,4959
07/01/2024 23:24:52;1704666292;33163;2;6,4863
07/01/2024 23:24:52;1704666292;33173;2;5,9955
07/01/2024 23:24:52;1704666292;33185;2;6,4953
07/01/2024 23:24:53;1704666293;33197;2;5,99125
07/01/2024 23:24:53;1704666293;33207;2;6,495501
07/01/2024 23:24:53;1704666293;33218;2;5,9953
07/01/2024 23:24:53;1704666293;33229;2;6,49155
07/01/2024 23:24:54;1704666294;33240;2;5,7403
07/01/2024 23:24:54;1704666294;33251;2;5,9913
07/01/2024 23:24:54;1704666294;33262;2;6,4904
07/01/2024 23:24:54;1704666294;33272;2;6,4905
07/01/2024 23:24:54;1704666294;33284;2;5,99125
07/01/2024 23:24:55;1704666295;33295;2;6,4902
07/01/2024 23:24:55;1704666295;33308;2;6,49105
07/01/2024 23:24:55;1704666295;33319;2;6,4954
07/01/2024 23:24:55;1704666295;33329;2;6,49605
07/01/2024 23:24:56;1704666296;33340;2;6,4915
07/01/2024 23:24:56;1704666296;33351;2;6,496201
07/01/2024 23:24:56;1704666296;33363;2;6,49045
07/01/2024 23:24:56;1704666296;33374;2;6,49125
07/01/2024 23:24:57;1704666297;33385;2;5,9915
07/01/2024 23:24:57;1704666297;33397;2;6,49635
07/01/2024 23:24:57;1704666297;33407;2;6,493051
07/01/2024 23:24:57;1704666297;33417;2;6,49155
07/01/2024 23:24:58;1704666298;33429;2;6,49625
07/01/2024 23:24:58;1704666298;33440;2;6,49015
07/01/2024 23:24:58;1704666298;33451;2;6,490951
07/01/2024 23:24:58;1704666298;33461;2;6,49605
07/01/2024 23:24:58;1704666298;33472;2;6,49605
07/01/2024 23:24:59;1704666299;33482;2;6,49045
07/01/2024 23:24:59;1704666299;33494;2;6,495151
07/01/2024 23:24:59;1704666299;33505;2;6,49635
