07/01/2024 22:20:35;1704662435;0;First
07/01/2024 22:20:36;1704662436;14;First
07/01/2024 22:20:36;1704662436;16;First
07/01/2024 22:20:36;1704662436;17;First
07/01/2024 22:20:36;1704662436;14;First
07/01/2024 22:20:36;1704662436;15;First
07/01/2024 22:20:37;1704662437;14;First
07/01/2024 22:20:37;1704662437;14;First
07/01/2024 22:20:37;1704662437;18;First
07/01/2024 22:20:37;1704662437;15;First
07/01/2024 22:20:37;1704662437;14;First
07/01/2024 22:20:38;1704662438;14;First
07/01/2024 22:20:38;1704662438;14;First
07/01/2024 22:20:38;1704662438;16;First
07/01/2024 22:20:38;1704662438;17;First
07/01/2024 22:20:39;1704662439;14;First
07/01/2024 22:20:39;1704662439;18;First
07/01/2024 22:20:39;1704662439;15;First
07/01/2024 22:20:39;1704662439;18;First
07/01/2024 22:20:39;1704662439;17;First
07/01/2024 22:20:40;1704662440;18;First
07/01/2024 22:20:40;1704662440;14;First
07/01/2024 22:20:40;1704662440;15;First
07/01/2024 22:20:40;1704662440;15;First
07/01/2024 22:20:41;1704662441;15;First
07/01/2024 22:20:41;1704662441;14;First
07/01/2024 22:20:41;1704662441;15;First
07/01/2024 22:20:41;1704662441;16;First
07/01/2024 22:20:41;1704662441;13;First
07/01/2024 22:20:42;1704662442;15;First
07/01/2024 22:20:42;1704662442;14;First
07/01/2024 22:20:42;1704662442;18;First
07/01/2024 22:20:42;1704662442;15;First
07/01/2024 22:20:42;1704662442;15;First
07/01/2024 22:20:43;1704662443;15;First
07/01/2024 22:20:43;1704662443;16;First
07/01/2024 22:20:43;1704662443;14;First
07/01/2024 22:20:43;1704662443;18;First
07/01/2024 22:20:43;1704662443;15;First
07/01/2024 22:20:44;1704662444;16;First
07/01/2024 22:20:44;1704662444;15;First
07/01/2024 22:20:44;1704662444;15;First
07/01/2024 22:20:44;1704662444;15;First
07/01/2024 22:20:45;1704662445;15;First
07/01/2024 22:20:45;1704662445;15;First
07/01/2024 22:20:45;1704662445;15;First
07/01/2024 22:20:45;1704662445;15;First
07/01/2024 22:20:45;1704662445;15;First
07/01/2024 22:20:46;1704662446;14;First
07/01/2024 22:20:46;1704662446;16;First
07/01/2024 22:20:46;1704662446;14;First
07/01/2024 22:20:46;1704662446;15;First
07/01/2024 22:20:46;1704662446;16;First
07/01/2024 22:20:47;1704662447;16;First
07/01/2024 22:20:47;1704662447;19;First
07/01/2024 22:20:47;1704662447;14;First
07/01/2024 22:20:47;1704662447;15;First
07/01/2024 22:20:47;1704662447;15;First
07/01/2024 22:20:48;1704662448;16;First
07/01/2024 22:20:48;1704662448;14;First
07/01/2024 22:20:48;1704662448;16;First
07/01/2024 22:20:48;1704662448;15;First
07/01/2024 22:20:49;1704662449;14;First
07/01/2024 22:20:49;1704662449;14;First
07/01/2024 22:20:49;1704662449;15;First
07/01/2024 22:20:49;1704662449;16;First
07/01/2024 22:20:49;1704662449;16;First
07/01/2024 22:20:50;1704662450;15;First
07/01/2024 22:20:50;1704662450;16;First
07/01/2024 22:20:50;1704662450;14;First
07/01/2024 22:20:50;1704662450;15;First
07/01/2024 22:20:50;1704662450;15;First
07/01/2024 22:20:51;1704662451;18;First
07/01/2024 22:20:51;1704662451;15;First
07/01/2024 22:20:51;1704662451;17;First
07/01/2024 22:20:51;1704662451;16;First
07/01/2024 22:20:52;1704662452;15;First
07/01/2024 22:20:52;1704662452;17;First
07/01/2024 22:20:52;1704662452;15;First
07/01/2024 22:20:52;1704662452;16;First
07/01/2024 22:20:52;1704662452;15;First
07/01/2024 22:20:53;1704662453;14;First
07/01/2024 22:20:53;1704662453;14;First
07/01/2024 22:20:53;1704662453;20;First
07/01/2024 22:20:53;1704662453;17;First
07/01/2024 22:20:53;1704662453;14;First
07/01/2024 22:20:54;1704662454;15;First
07/01/2024 22:20:54;1704662454;15;First
07/01/2024 22:20:54;1704662454;16;First
07/01/2024 22:20:54;1704662454;15;First
07/01/2024 22:20:54;1704662454;15;First
07/01/2024 22:20:55;1704662455;14;First
07/01/2024 22:20:55;1704662455;18;First
07/01/2024 22:20:55;1704662455;17;First
07/01/2024 22:20:55;1704662455;17;First
07/01/2024 22:20:56;1704662456;14;First
07/01/2024 22:20:56;1704662456;15;First
07/01/2024 22:20:56;1704662456;21;First
07/01/2024 22:20:56;1704662456;16;First
07/01/2024 22:20:57;1704662457;15;First
07/01/2024 22:20:57;1704662457;16;First
