07/01/2024 23:18:49;1704665929;16709;13;4,974047
07/01/2024 23:18:50;1704665930;16753;1;11,4855
07/01/2024 23:18:51;1704665931;16797;1;10,4855
07/01/2024 23:18:51;1704665931;16843;1;9,484505
07/01/2024 23:18:52;1704665932;16886;1;10,48561
07/01/2024 23:18:53;1704665933;16932;1;10,9849
07/01/2024 23:18:53;1704665933;16980;1;10,4838
07/01/2024 23:18:54;1704665934;17025;1;9,484902
07/01/2024 23:18:55;1704665935;17073;1;10,4843
07/01/2024 23:18:55;1704665935;17119;1;9,484606
07/01/2024 23:18:56;1704665936;17163;1;10,9854
07/01/2024 23:18:57;1704665937;17209;1;8,9847
07/01/2024 23:18:58;1704665938;17251;1;11,4857
07/01/2024 23:18:58;1704665938;17297;1;9,984809
07/01/2024 23:18:59;1704665939;17341;1;10,9852
07/01/2024 23:19:00;1704665940;17383;1;10,48631
07/01/2024 23:19:00;1704665940;17427;1;11,9851
07/01/2024 23:19:01;1704665941;17476;1;9,483709
07/01/2024 23:19:02;1704665942;17519;1;10,9856
07/01/2024 23:19:03;1704665943;17564;1;9,985005
07/01/2024 23:19:03;1704665943;17609;1;10,98501
07/01/2024 23:19:04;1704665944;17657;1;9,984106
07/01/2024 23:19:05;1704665945;17700;1;11,9855
07/01/2024 23:19:05;1704665945;17747;1;7,484499
07/01/2024 23:19:06;1704665946;17793;1;10,4847
07/01/2024 23:19:07;1704665947;17836;1;9,985806
07/01/2024 23:19:07;1704665947;17881;1;10,48501
07/01/2024 23:19:08;1704665948;17925;1;11,485
07/01/2024 23:19:09;1704665949;17969;1;10,9854
07/01/2024 23:19:10;1704665950;18013;1;10,48541
07/01/2024 23:19:10;1704665950;18060;1;7,484499
07/01/2024 23:19:11;1704665951;18104;1;10,4854
07/01/2024 23:19:12;1704665952;18152;1;10,9838
07/01/2024 23:19:12;1704665952;18199;1;11,9843
07/01/2024 23:19:13;1704665953;18247;1;10,9839
07/01/2024 23:19:14;1704665954;18293;1;8,4849
07/01/2024 23:19:14;1704665954;18341;1;10,4838
07/01/2024 23:19:15;1704665955;18386;1;9,485304
07/01/2024 23:19:16;1704665956;18432;1;9,984406
07/01/2024 23:19:17;1704665957;18479;1;8,984303
07/01/2024 23:19:17;1704665957;18528;1;9,983808
07/01/2024 23:19:18;1704665958;18574;1;8,4846
07/01/2024 23:19:19;1704665959;18618;1;9,985306
07/01/2024 23:19:19;1704665959;18663;1;11,4852
07/01/2024 23:19:20;1704665960;18708;1;11,985
07/01/2024 23:19:21;1704665961;18752;1;11,4851
07/01/2024 23:19:21;1704665961;18796;1;11,4853
07/01/2024 23:19:22;1704665962;18841;1;10,485
07/01/2024 23:19:23;1704665963;18888;1;10,9846
07/01/2024 23:19:24;1704665964;18931;1;10,48561
07/01/2024 23:19:24;1704665964;18980;1;11,4837
07/01/2024 23:19:25;1704665965;19025;1;11,985
07/01/2024 23:19:26;1704665966;19067;1;10,9858
07/01/2024 23:19:26;1704665966;19116;1;10,48381
07/01/2024 23:19:27;1704665967;19162;1;11,9847
07/01/2024 23:19:28;1704665968;19209;1;10,48431
07/01/2024 23:19:28;1704665968;19254;1;10,9848
07/01/2024 23:19:29;1704665969;19300;1;10,48481
07/01/2024 23:19:30;1704665970;19343;1;11,4857
07/01/2024 23:19:30;1704665970;19391;1;9,984007
07/01/2024 23:19:31;1704665971;19437;1;10,4846
07/01/2024 23:19:32;1704665972;19484;1;9,484304
07/01/2024 23:19:33;1704665973;19528;1;8,985504
07/01/2024 23:19:33;1704665973;19571;1;11,9856
07/01/2024 23:19:34;1704665974;19616;1;11,4849
07/01/2024 23:19:35;1704665975;19663;1;11,9844
07/01/2024 23:19:35;1704665975;19706;1;10,9859
07/01/2024 23:19:36;1704665976;19750;1;11,9852
07/01/2024 23:19:37;1704665977;19792;1;10,486
07/01/2024 23:19:37;1704665977;19836;1;11,4853
07/01/2024 23:19:38;1704665978;19882;1;11,4848
07/01/2024 23:19:39;1704665979;19924;1;11,9858
07/01/2024 23:19:39;1704665979;19971;1;10,9845
07/01/2024 23:19:40;1704665980;20018;1;10,4843
07/01/2024 23:19:41;1704665981;20063;1;10,985
07/01/2024 23:19:41;1704665981;20111;1;8,984102
07/01/2024 23:19:42;1704665982;20158;1;7,983999
07/01/2024 23:19:43;1704665983;20206;1;11,4843
07/01/2024 23:19:43;1704665983;20248;1;11,986
07/01/2024 23:19:44;1704665984;20292;1;8,985209
07/01/2024 23:19:45;1704665985;20334;1;10,4861
07/01/2024 23:19:46;1704665986;20377;1;10,9855
07/01/2024 23:19:46;1704665986;20425;1;7,984099
07/01/2024 23:19:47;1704665987;20476;1;8,983104
07/01/2024 23:19:48;1704665988;20522;1;10,4844
07/01/2024 23:19:48;1704665988;20565;1;10,9859
07/01/2024 23:19:49;1704665989;20609;1;10,9853
07/01/2024 23:19:50;1704665990;20651;1;10,9858
07/01/2024 23:19:51;1704665991;20697;1;10,98481
07/01/2024 23:19:52;1704665992;20744;1;8,984301
07/01/2024 23:19:52;1704665992;20790;1;10,9847
07/01/2024 23:19:53;1704665993;20835;1;9,484904
07/01/2024 23:19:54;1704665994;20880;1;9,984908
07/01/2024 23:19:54;1704665994;20925;1;10,9851
07/01/2024 23:19:55;1704665995;20972;1;10,9844
07/01/2024 23:19:56;1704665996;21018;1;10,9845
07/01/2024 23:19:56;1704665996;21065;1;10,9845
07/01/2024 23:19:57;1704665997;21109;1;10,4854
07/01/2024 23:19:58;1704665998;21156;1;8,984304
07/01/2024 23:19:58;1704665998;21201;1;10,985
