05/01/2024 22:16:07;1704489367;15
05/01/2024 22:16:08;1704489368;12
05/01/2024 22:16:08;1704489368;14
05/01/2024 22:16:08;1704489368;11
05/01/2024 22:16:08;1704489368;14
05/01/2024 22:16:09;1704489369;11
05/01/2024 22:16:09;1704489369;12
05/01/2024 22:16:09;1704489369;11
05/01/2024 22:16:09;1704489369;12
05/01/2024 22:16:09;1704489369;11
05/01/2024 22:16:10;1704489370;17
05/01/2024 22:16:10;1704489370;13
05/01/2024 22:16:10;1704489370;11
05/01/2024 22:16:10;1704489370;13
05/01/2024 22:16:11;1704489371;16
05/01/2024 22:16:11;1704489371;11
05/01/2024 22:16:11;1704489371;12
05/01/2024 22:16:11;1704489371;12
05/01/2024 22:16:11;1704489371;10
05/01/2024 22:16:12;1704489372;11
05/01/2024 22:16:12;1704489372;11
05/01/2024 22:16:12;1704489372;11
05/01/2024 22:16:12;1704489372;12
05/01/2024 22:16:12;1704489372;11
05/01/2024 22:16:13;1704489373;11
05/01/2024 22:16:13;1704489373;12
05/01/2024 22:16:13;1704489373;12
05/01/2024 22:16:13;1704489373;11
05/01/2024 22:16:14;1704489374;11
05/01/2024 22:16:14;1704489374;12
