07/01/2024 19:12:54;1704651174;0;First
07/01/2024 19:12:55;1704651175;49;First
07/01/2024 19:12:55;1704651175;43;First
07/01/2024 19:12:56;1704651176;44;First
07/01/2024 19:12:56;1704651176;45;First
07/01/2024 19:12:57;1704651177;49;First
07/01/2024 19:12:58;1704651178;49;First
07/01/2024 19:12:58;1704651178;43;First
07/01/2024 19:12:59;1704651179;45;First
07/01/2024 19:13:00;1704651180;44;First
07/01/2024 19:13:00;1704651180;44;First
07/01/2024 19:13:01;1704651181;48;First
07/01/2024 19:13:02;1704651182;45;First
07/01/2024 19:13:02;1704651182;44;First
07/01/2024 19:13:03;1704651183;50;First
07/01/2024 19:13:03;1704651183;44;First
07/01/2024 19:13:04;1704651184;49;First
07/01/2024 19:13:05;1704651185;47;First
07/01/2024 19:13:05;1704651185;45;First
07/01/2024 19:13:06;1704651186;43;First
07/01/2024 19:13:07;1704651187;44;First
07/01/2024 19:13:07;1704651187;46;First
07/01/2024 19:13:08;1704651188;43;First
07/01/2024 19:13:09;1704651189;46;First
07/01/2024 19:13:09;1704651189;47;First
07/01/2024 19:13:10;1704651190;41;First
07/01/2024 19:13:10;1704651190;45;First
07/01/2024 19:13:11;1704651191;47;First
07/01/2024 19:13:12;1704651192;46;First
07/01/2024 19:13:12;1704651192;45;First
07/01/2024 19:13:13;1704651193;44;First
07/01/2024 19:13:14;1704651194;44;First
07/01/2024 19:13:14;1704651194;46;First
07/01/2024 19:13:15;1704651195;45;First
07/01/2024 19:13:15;1704651195;44;First
07/01/2024 19:13:16;1704651196;42;First
07/01/2024 19:13:17;1704651197;46;First
07/01/2024 19:13:17;1704651197;46;First
07/01/2024 19:13:18;1704651198;47;First
07/01/2024 19:13:19;1704651199;44;First
07/01/2024 19:13:19;1704651199;47;First
07/01/2024 19:13:20;1704651200;46;First
07/01/2024 19:13:20;1704651200;46;First
07/01/2024 19:13:21;1704651201;45;First
07/01/2024 19:13:22;1704651202;45;First
07/01/2024 19:13:22;1704651202;44;First
07/01/2024 19:13:23;1704651203;43;First
07/01/2024 19:13:24;1704651204;47;First
07/01/2024 19:13:24;1704651204;46;First
07/01/2024 19:13:25;1704651205;46;First
07/01/2024 19:13:25;1704651205;45;First
07/01/2024 19:13:26;1704651206;43;First
07/01/2024 19:13:27;1704651207;44;First
07/01/2024 19:13:27;1704651207;44;First
07/01/2024 19:13:28;1704651208;44;First
07/01/2024 19:13:28;1704651208;44;First
07/01/2024 19:13:29;1704651209;47;First
07/01/2024 19:13:30;1704651210;45;First
07/01/2024 19:13:30;1704651210;42;First
07/01/2024 19:13:31;1704651211;43;First
07/01/2024 19:13:32;1704651212;46;First
07/01/2024 19:13:32;1704651212;47;First
07/01/2024 19:13:33;1704651213;43;First
07/01/2024 19:13:34;1704651214;44;First
07/01/2024 19:13:34;1704651214;46;First
07/01/2024 19:13:35;1704651215;45;First
07/01/2024 19:13:35;1704651215;45;First
07/01/2024 19:13:36;1704651216;45;First
07/01/2024 19:13:37;1704651217;47;First
07/01/2024 19:13:37;1704651217;44;First
07/01/2024 19:13:38;1704651218;49;First
07/01/2024 19:13:39;1704651219;44;First
07/01/2024 19:13:39;1704651219;45;First
07/01/2024 19:13:40;1704651220;49;First
07/01/2024 19:13:41;1704651221;48;First
07/01/2024 19:13:41;1704651221;43;First
07/01/2024 19:13:42;1704651222;44;First
07/01/2024 19:13:42;1704651222;49;First
07/01/2024 19:13:43;1704651223;44;First
07/01/2024 19:13:44;1704651224;46;First
07/01/2024 19:13:44;1704651224;47;First
07/01/2024 19:13:45;1704651225;47;First
07/01/2024 19:13:46;1704651226;43;First
07/01/2024 19:13:46;1704651226;44;First
07/01/2024 19:13:47;1704651227;43;First
07/01/2024 19:13:48;1704651228;44;First
07/01/2024 19:13:48;1704651228;42;First
07/01/2024 19:13:49;1704651229;46;First
07/01/2024 19:13:49;1704651229;45;First
07/01/2024 19:13:50;1704651230;44;First
07/01/2024 19:13:51;1704651231;46;First
07/01/2024 19:13:51;1704651231;45;First
07/01/2024 19:13:52;1704651232;44;First
07/01/2024 19:13:53;1704651233;47;First
07/01/2024 19:13:53;1704651233;46;First
07/01/2024 19:13:54;1704651234;46;First
07/01/2024 19:13:54;1704651234;45;First
07/01/2024 19:13:55;1704651235;46;First
07/01/2024 19:13:56;1704651236;48;First
07/01/2024 19:13:56;1704651236;43;First
07/01/2024 19:13:57;1704651237;45;First
