07/01/2024 22:20:37;1704662437;41210;-3,300078;-3,971432;Wall;Small;c5cdfe70-c98c-4079-88d2-77a30f4b4c65
07/01/2024 22:20:39;1704662439;41335;-3,401195;-2,274254;Wall;Small;6f62a8f3-3929-4ef7-b5b8-2d258ceb518d
07/01/2024 22:20:39;1704662439;41350;-3,520971;-2,219056;Wall;Small;617d916e-6de5-4b14-bd51-6764eeb90915
07/01/2024 22:20:39;1704662439;41367;-3,600221;-3,319832;Wall;Small;3ea55254-e39d-4d6f-973e-4bcfe831c106
07/01/2024 22:20:39;1704662439;41367;-3,600221;-3,319832;Wall;Small;3ea55254-e39d-4d6f-973e-4bcfe831c106
07/01/2024 22:20:39;1704662439;41367;-3,539617;-2,976127;Wall;Small;3ea55254-e39d-4d6f-973e-4bcfe831c106
07/01/2024 22:20:39;1704662439;41367;-3,539617;-2,976127;Wall;Small;3ea55254-e39d-4d6f-973e-4bcfe831c106
07/01/2024 22:20:39;1704662439;41367;-3,539617;-2,976127;Wall;Small;3ea55254-e39d-4d6f-973e-4bcfe831c106
07/01/2024 22:20:39;1704662439;41367;-3,539617;-2,976127;Wall;Small;3ea55254-e39d-4d6f-973e-4bcfe831c106
07/01/2024 22:20:39;1704662439;41368;-3,391134;-2,589309;Wall;Small;3ea55254-e39d-4d6f-973e-4bcfe831c106
07/01/2024 22:20:39;1704662439;41368;-3,391134;-2,589309;Wall;Small;3ea55254-e39d-4d6f-973e-4bcfe831c106
07/01/2024 22:20:39;1704662439;41368;-3,391134;-2,589309;Wall;Small;3ea55254-e39d-4d6f-973e-4bcfe831c106
07/01/2024 22:20:39;1704662439;41368;-3,203028;-2,220134;Wall;Small;3ea55254-e39d-4d6f-973e-4bcfe831c106
07/01/2024 22:20:40;1704662440;41402;3,627012;-2,576469;Wall;Small;e771bb9d-9565-47a6-83a4-227c5db82391
07/01/2024 22:20:40;1704662440;41447;-3,613982;-2,884091;Wall;Small;0e3cb6e1-4ab6-4b3b-859a-f63d269e159b
07/01/2024 22:20:40;1704662440;41447;-3,613982;-2,884091;Wall;Small;0e3cb6e1-4ab6-4b3b-859a-f63d269e159b
07/01/2024 22:20:40;1704662440;41447;-3,613982;-2,884091;Wall;Small;0e3cb6e1-4ab6-4b3b-859a-f63d269e159b
07/01/2024 22:20:40;1704662440;41448;-3,508275;-2,46012;Wall;Small;0e3cb6e1-4ab6-4b3b-859a-f63d269e159b
07/01/2024 22:20:44;1704662444;41691;3,427492;-2,115269;Wall;Small;17c6dc6d-d0a0-42bb-8ba4-68e37a3ca77d
07/01/2024 22:20:47;1704662447;41920;-3,313639;-2,064276;Wall;Small;74db6a69-4ba5-4531-92f9-311fbc812e7f
07/01/2024 22:20:47;1704662447;41920;-3,313639;-2,064276;Wall;Small;74db6a69-4ba5-4531-92f9-311fbc812e7f
07/01/2024 22:20:47;1704662447;41964;-3,449425;-3,854108;Wall;Small;e08f14d8-9e42-49a7-a116-ad5aaa0bcd80
07/01/2024 22:20:48;1704662448;42011;-3,466506;-2,254384;Wall;Small;f8d6d4e5-39d0-4d5a-9411-f18ec27f84dc
07/01/2024 22:20:48;1704662448;42011;-3,466506;-2,254384;Wall;Small;f8d6d4e5-39d0-4d5a-9411-f18ec27f84dc
07/01/2024 22:20:51;1704662451;42191;-2,792677;-4,030027;Wall;Small;a3a4a3e6-bbe8-4c6b-8e94-97e2d85567af
07/01/2024 22:20:51;1704662451;42191;-2,792677;-4,030027;Wall;Small;a3a4a3e6-bbe8-4c6b-8e94-97e2d85567af
07/01/2024 22:20:51;1704662451;42191;-2,792677;-4,030027;Wall;Small;a3a4a3e6-bbe8-4c6b-8e94-97e2d85567af
07/01/2024 22:20:51;1704662451;42191;-2,792677;-4,030027;Wall;Small;a3a4a3e6-bbe8-4c6b-8e94-97e2d85567af
07/01/2024 22:20:51;1704662451;42191;-2,792677;-4,030027;Wall;Small;a3a4a3e6-bbe8-4c6b-8e94-97e2d85567af
07/01/2024 22:20:51;1704662451;42191;-3,111892;-3,920114;Wall;Small;a3a4a3e6-bbe8-4c6b-8e94-97e2d85567af
07/01/2024 22:20:55;1704662455;42488;-3,291319;-3,877072;Wall;Small;9b6e39ad-66d1-46bc-9256-1a45f3f176c6
