{
    "name": "root",
    "gauges": {
        "Pedone.Policy.Entropy.mean": {
            "value": 2.576711893081665,
            "min": 1.09158194065094,
            "max": 2.6438395977020264,
            "count": 5252
        },
        "Pedone.Policy.Entropy.sum": {
            "value": 2798.30908203125,
            "min": 49.121192932128906,
            "max": 7881.86181640625,
            "count": 5252
        },
        "Pedone.Environment.EpisodeLength.mean": {
            "value": 214.0,
            "min": 5.634615384615385,
            "max": 756.1111111111111,
            "count": 5237
        },
        "Pedone.Environment.EpisodeLength.sum": {
            "value": 1284.0,
            "min": 42.0,
            "max": 13610.0,
            "count": 5237
        },
        "Pedone.Policy.ExtrinsicValueEstimate.mean": {
            "value": 1.2801052331924438,
            "min": -35.724246978759766,
            "max": 5.0714802742004395,
            "count": 5254
        },
        "Pedone.Policy.ExtrinsicValueEstimate.sum": {
            "value": 25.60210418701172,
            "min": -607.3121948242188,
            "max": 449.70916748046875,
            "count": 5254
        },
        "Pedone.Environment.CumulativeReward.mean": {
            "value": 6.6451661090056104,
            "min": -408.81613906224567,
            "max": 13.721700251102448,
            "count": 5243
        },
        "Pedone.Environment.CumulativeReward.sum": {
            "value": 39.87099665403366,
            "min": -6390.025470533408,
            "max": 171.78589487075806,
            "count": 5243
        },
        "Pedone.Policy.ExtrinsicReward.mean": {
            "value": 6.6451661090056104,
            "min": -408.81613906224567,
            "max": 13.721700251102448,
            "count": 5243
        },
        "Pedone.Policy.ExtrinsicReward.sum": {
            "value": 39.87099665403366,
            "min": -6390.025470533408,
            "max": 171.78589487075806,
            "count": 5243
        },
        "Pedone.IsTraining.mean": {
            "value": 1.0,
            "min": 1.0,
            "max": 1.0,
            "count": 5254
        },
        "Pedone.IsTraining.sum": {
            "value": 1.0,
            "min": 1.0,
            "max": 1.0,
            "count": 5254
        },
        "Pedone.Losses.PolicyLoss.mean": {
            "value": 0.030177012202329934,
            "min": 0.020753998681902884,
            "max": 0.3439471973959977,
            "count": 1018
        },
        "Pedone.Losses.PolicyLoss.sum": {
            "value": 0.030177012202329934,
            "min": 0.020753998681902884,
            "max": 0.3439471973959977,
            "count": 1018
        },
        "Pedone.Losses.ValueLoss.mean": {
            "value": 1.2946763892968496,
            "min": 0.09947152261932692,
            "max": 47.62751267751058,
            "count": 1018
        },
        "Pedone.Losses.ValueLoss.sum": {
            "value": 1.2946763892968496,
            "min": 0.09947152261932692,
            "max": 47.62751267751058,
            "count": 1018
        },
        "Pedone.Policy.LearningRate.mean": {
            "value": 0.003000000000000001,
            "min": 0.003,
            "max": 0.003000000000000001,
            "count": 1018
        },
        "Pedone.Policy.LearningRate.sum": {
            "value": 0.003000000000000001,
            "min": 0.003,
            "max": 0.003000000000000001,
            "count": 1018
        },
        "Pedone.Policy.Epsilon.mean": {
            "value": 0.20000000000000007,
            "min": 0.2,
            "max": 0.20000000000000007,
            "count": 1018
        },
        "Pedone.Policy.Epsilon.sum": {
            "value": 0.20000000000000007,
            "min": 0.2,
            "max": 0.20000000000000007,
            "count": 1018
        },
        "Pedone.Policy.Beta.mean": {
            "value": 0.005000000000000001,
            "min": 0.005,
            "max": 0.005000000000000001,
            "count": 1018
        },
        "Pedone.Policy.Beta.sum": {
            "value": 0.005000000000000001,
            "min": 0.005,
            "max": 0.005000000000000001,
            "count": 1018
        }
    },
    "metadata": {
        "timer_format_version": "0.1.0",
        "start_time_seconds": "1704581528",
        "python_version": "3.8.2rc2 (tags/v3.8.2rc2:777ba07, Feb 18 2020, 09:11:15) [MSC v.1916 64 bit (AMD64)]",
        "command_line_arguments": "C:\\Users\\chicc\\Documents\\Python env\\mlagents-25\\Scripts\\mlagents-learn TrainerConfig/trainer_config.yaml --run-id=CV_Spawner",
        "mlagents_version": "0.25.0",
        "mlagents_envs_version": "0.25.0",
        "communication_protocol_version": "1.5.0",
        "pytorch_version": "1.7.1+cpu",
        "numpy_version": "1.19.5",
        "end_time_seconds": "1704591820"
    },
    "total": 10292.9171703,
    "count": 1,
    "self": 0.006015299999489798,
    "children": {
        "run_training.setup": {
            "total": 0.08387370000000005,
            "count": 1,
            "self": 0.08387370000000005
        },
        "TrainerController.start_learning": {
            "total": 10292.8272813,
            "count": 1,
            "self": 9.32806659992093,
            "children": {
                "TrainerController._reset_env": {
                    "total": 7.9377241,
                    "count": 1,
                    "self": 7.9377241
                },
                "TrainerController.advance": {
                    "total": 10275.468199600078,
                    "count": 259694,
                    "self": 4.702447500074413,
                    "children": {
                        "env_step": {
                            "total": 10270.765752100004,
                            "count": 259694,
                            "self": 9274.088292999673,
                            "children": {
                                "SubprocessEnvManager._take_step": {
                                    "total": 991.4537200004527,
                                    "count": 259694,
                                    "self": 20.109686300531735,
                                    "children": {
                                        "TorchPolicy.evaluate": {
                                            "total": 971.3440336999209,
                                            "count": 180071,
                                            "self": 110.91062939971971,
                                            "children": {
                                                "TorchPolicy.sample_actions": {
                                                    "total": 860.4334043002012,
                                                    "count": 180071,
                                                    "self": 860.4334043002012
                                                }
                                            }
                                        }
                                    }
                                },
                                "workers": {
                                    "total": 5.223739099877802,
                                    "count": 259693,
                                    "self": 0.0,
                                    "children": {
                                        "worker_root": {
                                            "total": 10274.4321840003,
                                            "count": 259693,
                                            "is_parallel": true,
                                            "self": 2583.17165090042,
                                            "children": {
                                                "steps_from_proto": {
                                                    "total": 0.0010409000000004553,
                                                    "count": 1,
                                                    "is_parallel": true,
                                                    "self": 9.269999999972356e-05,
                                                    "children": {
                                                        "_process_rank_one_or_two_observation": {
                                                            "total": 0.0009482000000007318,
                                                            "count": 2,
                                                            "is_parallel": true,
                                                            "self": 0.0009482000000007318
                                                        }
                                                    }
                                                },
                                                "UnityEnvironment.step": {
                                                    "total": 7691.25949219988,
                                                    "count": 259693,
                                                    "is_parallel": true,
                                                    "self": 188.79665509964707,
                                                    "children": {
                                                        "UnityEnvironment._generate_step_input": {
                                                            "total": 131.88679379975244,
                                                            "count": 259693,
                                                            "is_parallel": true,
                                                            "self": 131.88679379975244
                                                        },
                                                        "communicator.exchange": {
                                                            "total": 6112.380330700496,
                                                            "count": 259693,
                                                            "is_parallel": true,
                                                            "self": 6112.380330700496
                                                        },
                                                        "steps_from_proto": {
                                                            "total": 1258.1957125999847,
                                                            "count": 259693,
                                                            "is_parallel": true,
                                                            "self": 51.669328399638744,
                                                            "children": {
                                                                "_process_rank_one_or_two_observation": {
                                                                    "total": 1206.526384200346,
                                                                    "count": 519386,
                                                                    "is_parallel": true,
                                                                    "self": 1206.526384200346
                                                                }
                                                            }
                                                        }
                                                    }
                                                }
                                            }
                                        }
                                    }
                                }
                            }
                        }
                    }
                },
                "trainer_threads": {
                    "total": 4.2800000301213004e-05,
                    "count": 1,
                    "self": 4.2800000301213004e-05,
                    "children": {
                        "thread_root": {
                            "total": 0.0,
                            "count": 0,
                            "is_parallel": true,
                            "self": 0.0,
                            "children": {
                                "trainer_advance": {
                                    "total": 10275.091839700153,
                                    "count": 500371,
                                    "is_parallel": true,
                                    "self": 27.964893900369134,
                                    "children": {
                                        "process_trajectory": {
                                            "total": 7203.8936227997965,
                                            "count": 500371,
                                            "is_parallel": true,
                                            "self": 7198.602578499798,
                                            "children": {
                                                "RLTrainer._checkpoint": {
                                                    "total": 5.2910442999978216,
                                                    "count": 52,
                                                    "is_parallel": true,
                                                    "self": 5.2910442999978216
                                                }
                                            }
                                        },
                                        "_update_policy": {
                                            "total": 3043.233322999988,
                                            "count": 1018,
                                            "is_parallel": true,
                                            "self": 1326.8968129001191,
                                            "children": {
                                                "TorchPPOOptimizer.update": {
                                                    "total": 1716.336510099869,
                                                    "count": 30543,
                                                    "is_parallel": true,
                                                    "self": 1716.336510099869
                                                }
                                            }
                                        }
                                    }
                                }
                            }
                        }
                    }
                },
                "TrainerController._save_models": {
                    "total": 0.09324820000074396,
                    "count": 1,
                    "self": 0.026457899999513756,
                    "children": {
                        "RLTrainer._checkpoint": {
                            "total": 0.06679030000123021,
                            "count": 1,
                            "self": 0.06679030000123021
                        }
                    }
                }
            }
        }
    }
}