07/01/2024 19:38:14;1704652694;3537;6;6,239784
07/01/2024 19:38:15;1704652695;3565;1;7,990699
07/01/2024 19:38:15;1704652695;3594;1;7,990199
07/01/2024 19:38:15;1704652695;3624;1;7,989999
07/01/2024 19:38:16;1704652696;3653;1;7,990399
07/01/2024 19:38:16;1704652696;3685;1;7,4892
07/01/2024 19:38:17;1704652697;3717;1;7,4896
07/01/2024 19:38:17;1704652697;3746;1;7,990399
07/01/2024 19:38:18;1704652698;3774;1;7,990499
07/01/2024 19:38:18;1704652698;3805;1;6,989599
07/01/2024 19:38:18;1704652698;3835;1;7,989899
07/01/2024 19:38:19;1704652699;3864;1;7,990499
07/01/2024 19:38:19;1704652699;3895;1;7,4896
07/01/2024 19:38:20;1704652700;3928;1;7,989099
07/01/2024 19:38:20;1704652700;3957;1;7,990199
07/01/2024 19:38:21;1704652701;3990;1;7,989099
07/01/2024 19:38:21;1704652701;4020;1;7,990099
07/01/2024 19:38:21;1704652701;4050;1;7,989899
07/01/2024 19:38:22;1704652702;4080;1;7,989899
07/01/2024 19:38:22;1704652702;4111;1;7,489899
07/01/2024 19:38:23;1704652703;4141;1;7,989799
07/01/2024 19:38:23;1704652703;4171;1;7,990099
07/01/2024 19:38:23;1704652703;4202;1;7,989599
07/01/2024 19:38:24;1704652704;4231;1;6,4903
07/01/2024 19:38:24;1704652704;4261;1;7,989999
07/01/2024 19:38:25;1704652705;4291;1;7,989999
07/01/2024 19:38:25;1704652705;4321;1;7,990099
07/01/2024 19:38:26;1704652706;4352;1;7,989699
07/01/2024 19:38:26;1704652706;4382;1;7,989799
07/01/2024 19:38:26;1704652706;4416;1;7,988899
07/01/2024 19:38:27;1704652707;4445;1;7,990299
07/01/2024 19:38:27;1704652707;4476;1;7,989499
07/01/2024 19:38:28;1704652708;4508;1;7,989399
07/01/2024 19:38:28;1704652708;4540;1;7,989199
07/01/2024 19:38:28;1704652708;4573;1;7,989299
07/01/2024 19:38:29;1704652709;4604;1;7,989599
07/01/2024 19:38:29;1704652709;4635;1;7,989699
07/01/2024 19:38:30;1704652710;4665;1;7,989899
07/01/2024 19:38:30;1704652710;4695;1;7,990099
07/01/2024 19:38:30;1704652710;4725;1;7,989999
07/01/2024 19:38:31;1704652711;4759;1;7,988699
07/01/2024 19:38:31;1704652711;4789;1;7,4898
07/01/2024 19:38:32;1704652712;4820;1;7,4898
07/01/2024 19:38:32;1704652712;4850;1;7,989899
07/01/2024 19:38:32;1704652712;4881;1;6,989699
07/01/2024 19:38:33;1704652713;4913;1;7,489199
07/01/2024 19:38:33;1704652713;4946;1;6,9891
07/01/2024 19:38:34;1704652714;4976;1;7,49
07/01/2024 19:38:34;1704652714;5007;1;7,4898
07/01/2024 19:38:34;1704652714;5037;1;7,989699
07/01/2024 19:38:35;1704652715;5067;1;7,990299
07/01/2024 19:38:35;1704652715;5097;1;7,4899
07/01/2024 19:38:36;1704652716;5126;1;7,990199
07/01/2024 19:38:36;1704652716;5157;1;7,4899
07/01/2024 19:38:37;1704652717;5188;1;7,989499
07/01/2024 19:38:37;1704652717;5221;1;7,4891
07/01/2024 19:38:37;1704652717;5251;1;7,989799
07/01/2024 19:38:38;1704652718;5282;1;7,989799
07/01/2024 19:38:38;1704652718;5310;1;7,990599
07/01/2024 19:38:39;1704652719;5339;1;7,990499
07/01/2024 19:38:39;1704652719;5369;1;7,989999
07/01/2024 19:38:39;1704652719;5398;1;7,990099
07/01/2024 19:38:40;1704652720;5427;1;7,990499
07/01/2024 19:38:40;1704652720;5456;1;7,990199
07/01/2024 19:38:41;1704652721;5486;1;7,990299
07/01/2024 19:38:41;1704652721;5515;1;7,4902
07/01/2024 19:38:41;1704652721;5546;1;7,989499
07/01/2024 19:38:42;1704652722;5576;1;7,990099
07/01/2024 19:38:42;1704652722;5607;1;7,4897
07/01/2024 19:38:43;1704652723;5639;1;7,4892
07/01/2024 19:38:43;1704652723;5670;1;7,989899
07/01/2024 19:38:44;1704652724;5700;1;7,989999
07/01/2024 19:38:44;1704652724;5730;1;7,989799
07/01/2024 19:38:44;1704652724;5763;1;7,989099
07/01/2024 19:38:45;1704652725;5793;1;7,989999
07/01/2024 19:38:45;1704652725;5821;1;7,990799
07/01/2024 19:38:46;1704652726;5851;1;7,4898
07/01/2024 19:38:46;1704652726;5881;1;7,989999
07/01/2024 19:38:46;1704652726;5912;1;7,989799
07/01/2024 19:38:47;1704652727;5942;1;7,989899
07/01/2024 19:38:47;1704652727;5975;1;7,4889
07/01/2024 19:38:48;1704652728;6005;1;7,989999
07/01/2024 19:38:48;1704652728;6035;1;7,490099
07/01/2024 19:38:48;1704652728;6066;1;7,989599
07/01/2024 19:38:49;1704652729;6095;1;7,990299
07/01/2024 19:38:49;1704652729;6126;1;7,989699
07/01/2024 19:38:50;1704652730;6159;1;7,989199
07/01/2024 19:38:50;1704652730;6191;1;6,9893
07/01/2024 19:38:50;1704652730;6224;1;7,4889
07/01/2024 19:38:51;1704652731;6252;1;7,990799
07/01/2024 19:38:51;1704652731;6283;1;7,989699
07/01/2024 19:38:52;1704652732;6315;1;7,989199
07/01/2024 19:38:52;1704652732;6345;1;7,4899
07/01/2024 19:38:52;1704652732;6377;1;7,989499
07/01/2024 19:38:53;1704652733;6409;1;7,989299
07/01/2024 19:38:53;1704652733;6438;1;7,4901
07/01/2024 19:38:54;1704652734;6468;1;7,990199
07/01/2024 19:38:54;1704652734;6499;1;7,989699
07/01/2024 19:38:54;1704652734;6531;1;6,9893
07/01/2024 19:38:55;1704652735;6563;1;7,989499
