07/01/2024 19:11:24;1704651084;16210;3;2,779104
07/01/2024 19:11:25;1704651085;16226;13;4,35526
07/01/2024 19:11:26;1704651086;16242;13;4,197423
07/01/2024 19:11:27;1704651087;16259;13;3,664461
07/01/2024 19:11:27;1704651087;16274;13;4,822707
07/01/2024 19:11:28;1704651088;16290;13;4,051816
07/01/2024 19:11:29;1704651089;16307;13;5,43293
07/01/2024 19:11:30;1704651090;16324;13;4,159646
07/01/2024 19:11:31;1704651091;16339;13;5,157647
07/01/2024 19:11:32;1704651092;16354;13;4,123585
07/01/2024 19:11:33;1704651093;16370;13;4,234153
07/01/2024 19:11:33;1704651093;16385;13;3,541276
07/01/2024 19:11:34;1704651094;16402;13;4,543815
07/01/2024 19:11:35;1704651095;16420;13;5,058415
07/01/2024 19:11:36;1704651096;16435;13;5,233716
07/01/2024 19:11:37;1704651097;16450;13;4,739715
07/01/2024 19:11:38;1704651098;16470;13;2,703822
07/01/2024 19:11:39;1704651099;16489;13;4,878623
07/01/2024 19:11:40;1704651100;16505;13;4,808408
07/01/2024 19:11:41;1704651101;16524;13;4,389976
07/01/2024 19:11:42;1704651102;16541;13;4,077838
07/01/2024 19:11:43;1704651103;16558;13;4,245023
07/01/2024 19:11:44;1704651104;16574;13;3,893123
07/01/2024 19:11:45;1704651105;16591;13;4,465462
07/01/2024 19:11:46;1704651106;16608;13;4,885254
07/01/2024 19:11:47;1704651107;16629;13;3,041699
07/01/2024 19:11:48;1704651108;16645;13;5,082923
07/01/2024 19:11:49;1704651109;16663;13;3,392044
07/01/2024 19:11:49;1704651109;16681;13;4,622285
07/01/2024 19:11:50;1704651110;16696;13;4,474108
07/01/2024 19:11:51;1704651111;16713;13;4,086792
07/01/2024 19:11:52;1704651112;16728;13;4,436546
07/01/2024 19:11:53;1704651113;16744;13;4,393923
07/01/2024 19:11:54;1704651114;16761;13;3,618491
07/01/2024 19:11:55;1704651115;16778;13;5,155877
07/01/2024 19:11:56;1704651116;16793;13;3,930322
07/01/2024 19:11:56;1704651116;16809;13;4,511169
07/01/2024 19:11:57;1704651117;16825;13;3,935831
07/01/2024 19:11:58;1704651118;16839;13;4,895047
07/01/2024 19:11:59;1704651119;16873;13;1,111942
07/01/2024 19:12:00;1704651120;16890;13;4,442153
07/01/2024 19:12:01;1704651121;16907;13;5,208138
07/01/2024 19:12:02;1704651122;16923;13;3,277923
07/01/2024 19:12:03;1704651123;16939;13;5,201985
07/01/2024 19:12:04;1704651124;16955;13;4,739638
07/01/2024 19:12:04;1704651124;16971;13;5,4704
07/01/2024 19:12:05;1704651125;16988;13;4,542839
07/01/2024 19:12:06;1704651126;17004;13;4,430953
07/01/2024 19:12:07;1704651127;17022;13;3,396023
07/01/2024 19:12:08;1704651128;17039;13;3,390353
07/01/2024 19:12:09;1704651129;17054;13;3,855931
07/01/2024 19:12:10;1704651130;17069;13;5,362323
07/01/2024 19:12:11;1704651131;17086;13;5,086746
07/01/2024 19:12:11;1704651131;17104;13;5,356154
07/01/2024 19:12:12;1704651132;17121;13;3,626922
07/01/2024 19:12:13;1704651133;17137;13;4,887077
07/01/2024 19:12:14;1704651134;17154;13;4,467024
07/01/2024 19:12:15;1704651135;17170;13;4,119915
07/01/2024 19:12:16;1704651136;17187;13;2,925169
07/01/2024 19:12:17;1704651137;17202;13;4,240453
07/01/2024 19:12:18;1704651138;17218;13;4,811747
07/01/2024 19:12:19;1704651139;17234;13;4,937077
07/01/2024 19:12:20;1704651140;17250;13;4,467723
07/01/2024 19:12:21;1704651141;17267;13;5,048622
07/01/2024 19:12:22;1704651142;17283;13;4,315361
07/01/2024 19:12:23;1704651143;17300;13;4,279861
07/01/2024 19:12:23;1704651143;17317;13;4,505838
07/01/2024 19:12:24;1704651144;17333;13;3,190654
07/01/2024 19:12:25;1704651145;17349;13;4,203116
07/01/2024 19:12:26;1704651146;17367;13;4,042861
07/01/2024 19:12:27;1704651147;17386;13;3,9778
07/01/2024 19:12:28;1704651148;17402;13;4,389976
07/01/2024 19:12:29;1704651149;17420;13;3,703014
07/01/2024 19:12:30;1704651150;17435;13;4,776623
07/01/2024 19:12:31;1704651151;17454;13;4,010508
07/01/2024 19:12:31;1704651151;17470;13;4,159199
07/01/2024 19:12:32;1704651152;17485;13;5,429084
07/01/2024 19:12:33;1704651153;17501;13;4,474677
07/01/2024 19:12:34;1704651154;17517;13;3,812931
07/01/2024 19:12:35;1704651155;17533;13;4,120215
07/01/2024 19:12:36;1704651156;17549;13;5,035254
07/01/2024 19:12:37;1704651157;17567;13;5,281461
07/01/2024 19:12:38;1704651158;17583;13;4,809947
07/01/2024 19:12:38;1704651158;17600;13;3,503615
07/01/2024 19:12:40;1704651160;17620;13;2,775569
07/01/2024 19:12:41;1704651161;17662;13;0,7373971
07/01/2024 19:12:42;1704651162;17679;13;4,939615
07/01/2024 19:12:43;1704651163;17698;13;3,465214
07/01/2024 19:12:44;1704651164;17717;13;4,506138
07/01/2024 19:12:45;1704651165;17734;13;3,617076
07/01/2024 19:12:46;1704651166;17752;13;3,977369
07/01/2024 19:12:46;1704651166;17768;13;4,891007
07/01/2024 19:12:47;1704651167;17784;13;4,201177
07/01/2024 19:12:48;1704651168;17801;13;4,667808
07/01/2024 19:12:49;1704651169;17819;13;4,498431
07/01/2024 19:12:50;1704651170;17836;13;3,932538
07/01/2024 19:12:51;1704651171;17851;13;5,401515
07/01/2024 19:12:51;1704651171;17868;13;4,652623
07/01/2024 19:12:52;1704651172;17884;13;5,203269
07/01/2024 19:12:53;1704651173;17899;13;4,969699
