05/01/2024 22:22:37;1704489757;4835;13;5,321307
05/01/2024 22:22:38;1704489758;4880;1;11,9853
05/01/2024 22:22:39;1704489759;4921;1;10,9862
05/01/2024 22:22:39;1704489759;4965;1;11,4854
05/01/2024 22:22:40;1704489760;5006;1;11,9865
05/01/2024 22:22:40;1704489760;5051;1;11,985
05/01/2024 22:22:41;1704489761;5092;1;11,486
05/01/2024 22:22:42;1704489762;5137;1;11,9852
05/01/2024 22:22:42;1704489762;5179;1;11,9858
05/01/2024 22:22:43;1704489763;5223;1;10,9856
05/01/2024 22:22:44;1704489764;5266;1;10,9855
05/01/2024 22:22:44;1704489764;5312;1;11,4846
05/01/2024 22:22:45;1704489765;5354;1;8,986204
05/01/2024 22:22:46;1704489766;5399;1;10,9849
05/01/2024 22:22:46;1704489766;5445;1;10,9848
05/01/2024 22:22:47;1704489767;5489;1;10,4853
05/01/2024 22:22:48;1704489768;5533;1;9,485105
05/01/2024 22:22:48;1704489768;5577;1;10,9853
05/01/2024 22:22:49;1704489769;5624;1;9,984409
05/01/2024 22:22:49;1704489769;5668;1;11,4853
05/01/2024 22:22:50;1704489770;5710;1;11,9861
05/01/2024 22:22:51;1704489771;5758;1;8,4842
05/01/2024 22:22:51;1704489771;5802;1;11,4853
05/01/2024 22:22:52;1704489772;5849;1;11,9844
05/01/2024 22:22:53;1704489773;5893;1;10,4851
05/01/2024 22:22:53;1704489773;5940;1;10,9845
05/01/2024 22:22:54;1704489774;5983;1;6,985404
05/01/2024 22:22:55;1704489775;6030;1;9,484505
05/01/2024 22:22:55;1704489775;6073;1;11,9856
05/01/2024 22:22:56;1704489776;6117;1;11,4854
