06/01/2024 01:56:29;1704502589;32496;1;6,9952
06/01/2024 01:56:29;1704502589;32506;2;5,99165
06/01/2024 01:56:30;1704502590;32517;2;6,49555
06/01/2024 01:56:30;1704502590;32528;2;6,4915
06/01/2024 01:56:30;1704502590;32538;2;5,49165
06/01/2024 01:56:30;1704502590;32549;2;6,49145
06/01/2024 01:56:30;1704502590;32559;2;6,24155
06/01/2024 01:56:30;1704502590;32570;2;6,4954
06/01/2024 01:56:31;1704502591;32581;2;6,4905
06/01/2024 01:56:31;1704502591;32591;2;6,49595
06/01/2024 01:56:31;1704502591;32603;2;6,49045
06/01/2024 01:56:31;1704502591;32614;2;6,49135
06/01/2024 01:56:32;1704502592;32625;2;5,99545
06/01/2024 01:56:32;1704502592;32635;2;6,49045
06/01/2024 01:56:32;1704502592;32646;2;6,49155
06/01/2024 01:56:32;1704502592;32658;2;5,9913
06/01/2024 01:56:32;1704502592;32668;2;6,4905
06/01/2024 01:56:32;1704502592;32678;2;6,49065
06/01/2024 01:56:33;1704502593;32689;2;5,99145
06/01/2024 01:56:33;1704502593;32699;2;6,48655
06/01/2024 01:56:33;1704502593;32710;2;6,4915
06/01/2024 01:56:33;1704502593;32721;2;5,9954
06/01/2024 01:56:33;1704502593;32731;2;5,99165
06/01/2024 01:56:34;1704502594;32741;2;6,4956
06/01/2024 01:56:34;1704502594;32752;2;5,9916
06/01/2024 01:56:34;1704502594;32763;2;6,49045
06/01/2024 01:56:34;1704502594;32774;2;6,49025
06/01/2024 01:56:34;1704502594;32785;2;6,4902
06/01/2024 01:56:35;1704502595;32796;2;5,99155
06/01/2024 01:56:35;1704502595;32806;2;6,49555
06/01/2024 01:56:35;1704502595;32818;2;6,49135
06/01/2024 01:56:35;1704502595;32828;2;6,4889
06/01/2024 01:56:35;1704502595;32839;2;5,9955
06/01/2024 01:56:35;1704502595;32849;2;6,49045
06/01/2024 01:56:36;1704502596;32861;2;5,9953
06/01/2024 01:56:36;1704502596;32872;2;6,491301
06/01/2024 01:56:36;1704502596;32883;2;6,49135
06/01/2024 01:56:36;1704502596;32894;2;5,99165
06/01/2024 01:56:36;1704502596;32903;2;6,49175
06/01/2024 01:56:37;1704502597;32914;2;6,4904
06/01/2024 01:56:37;1704502597;32925;2;6,49055
06/01/2024 01:56:37;1704502597;32936;2;6,49155
06/01/2024 01:56:37;1704502597;32946;2;6,4955
06/01/2024 01:56:37;1704502597;32957;2;5,99545
06/01/2024 01:56:38;1704502598;32967;2;5,99155
06/01/2024 01:56:38;1704502598;32978;2;6,49035
06/01/2024 01:56:38;1704502598;32989;2;6,49545
06/01/2024 01:56:38;1704502598;33000;2;6,49155
06/01/2024 01:56:38;1704502598;33011;2;6,488851
06/01/2024 01:56:38;1704502598;33022;2;6,4916
06/01/2024 01:56:39;1704502599;33032;2;6,49065
06/01/2024 01:56:39;1704502599;33043;2;6,4904
06/01/2024 01:56:39;1704502599;33053;2;6,4891
06/01/2024 01:56:39;1704502599;33063;2;6,243
06/01/2024 01:56:39;1704502599;33075;2;6,4912
06/01/2024 01:56:40;1704502600;33085;2;6,49065
06/01/2024 01:56:40;1704502600;33096;2;5,9954
06/01/2024 01:56:40;1704502600;33107;2;5,99545
06/01/2024 01:56:40;1704502600;33118;2;6,49035
06/01/2024 01:56:40;1704502600;33130;2;6,4904
06/01/2024 01:56:41;1704502601;33141;2;6,49025
06/01/2024 01:56:41;1704502601;33153;2;6,4902
06/01/2024 01:56:41;1704502601;33164;2;6,49535
06/01/2024 01:56:41;1704502601;33175;2;5,99155
06/01/2024 01:56:41;1704502601;33185;2;6,49045
06/01/2024 01:56:42;1704502602;33197;2;6,491301
06/01/2024 01:56:42;1704502602;33207;2;5,9955
06/01/2024 01:56:42;1704502602;33218;2;6,4905
06/01/2024 01:56:42;1704502602;33229;2;6,4914
06/01/2024 01:56:42;1704502602;33239;2;5,9955
06/01/2024 01:56:43;1704502603;33251;2;6,4956
06/01/2024 01:56:43;1704502603;33262;2;6,496
06/01/2024 01:56:43;1704502603;33272;2;6,49045
06/01/2024 01:56:43;1704502603;33283;2;5,9914
06/01/2024 01:56:43;1704502603;33293;2;6,49165
06/01/2024 01:56:44;1704502604;33304;2;5,9913
06/01/2024 01:56:44;1704502604;33314;2;6,49165
06/01/2024 01:56:44;1704502604;33325;2;6,49605
06/01/2024 01:56:44;1704502604;33335;2;6,4916
06/01/2024 01:56:44;1704502604;33345;2;5,9957
06/01/2024 01:56:45;1704502605;33356;2;6,4904
06/01/2024 01:56:45;1704502605;33367;2;5,99535
06/01/2024 01:56:45;1704502605;33378;2;6,4905
06/01/2024 01:56:45;1704502605;33389;2;6,4905
06/01/2024 01:56:45;1704502605;33399;2;6,4905
06/01/2024 01:56:46;1704502606;33410;2;6,4905
06/01/2024 01:56:46;1704502606;33421;2;6,49345
06/01/2024 01:56:46;1704502606;33431;2;5,99555
06/01/2024 01:56:46;1704502606;33442;2;5,9953
06/01/2024 01:56:46;1704502606;33453;2;5,9916
06/01/2024 01:56:46;1704502606;33463;2;6,4907
06/01/2024 01:56:47;1704502607;33473;2;6,4916
06/01/2024 01:56:47;1704502607;33484;2;5,9955
06/01/2024 01:56:47;1704502607;33494;2;5,99555
06/01/2024 01:56:47;1704502607;33505;2;6,49055
06/01/2024 01:56:47;1704502607;33516;2;5,9952
06/01/2024 01:56:48;1704502608;33528;2;6,49135
06/01/2024 01:56:48;1704502608;33539;2;6,4904
06/01/2024 01:56:48;1704502608;33550;2;5,99155
06/01/2024 01:56:48;1704502608;33561;2;6,490951
