Wall time,Step,Value
1702305374.5657291,6000,-0.14736630022525787
1702305376.7988474,7000,-0.0022089455742388964
1702305386.7278838,11000,-10.225601196289062
1702305388.7767456,12000,-6.744642734527588
1702305392.9139822,14000,-10.904374122619629
1702305394.9297783,15000,-8.692219734191895
1702305398.4276857,16000,-10.387713432312012
1702305405.6161294,19000,-8.25918960571289
1702305407.745643,20000,-7.74062967300415
1702305411.6275208,21000,-4.568177700042725
1702305419.066945,25000,-6.354572296142578
1702305441.3248553,34000,-4.061661720275879
1702305443.4867082,35000,-0.372821182012558
1702305450.4448643,37000,0.15506240725517273
1702305459.058805,41000,1.9065054655075073
1702305464.62322,43000,0.006518542766571045
1702305468.1411045,45000,3.7679948806762695
1702305470.2994215,46000,3.59175968170166
1702305475.61156,48000,2.46897554397583
1702305479.3711383,50000,2.463756799697876
1702305481.5164928,51000,2.451981782913208
1702305488.8640404,54000,1.478201985359192
1702305491.6547651,55000,1.359994888305664
1702305494.130788,56000,1.4523662328720093
1702305498.114026,57000,1.307752251625061
1702305499.5820785,58000,0.6331654191017151
1702305505.7393174,61000,0.7005618810653687
1702305509.5779693,62000,0.6777542233467102
1702305512.8194168,64000,0.5670197606086731
1702305516.859572,66000,0.5334731340408325
1702305518.8997424,67000,0.5132184624671936
1702305522.1283247,68000,0.13300125300884247
1702305524.027742,69000,0.5832666754722595
1702305529.682539,72000,0.6031042337417603
1702305533.098829,73000,0.8440971970558167
1702305535.564457,74000,0.8624798059463501
1702305538.2991562,75000,0.8908421397209167
1702305541.9435973,77000,0.8558918237686157
1702305549.056878,80000,0.9981851577758789
1702305560.0701988,85000,1.149099349975586
1702305562.3394632,86000,1.1249735355377197
1702305564.2430375,87000,1.1155059337615967
1702305567.9225643,88000,1.1991273164749146
1702305569.402509,89000,1.21172297000885
1702305571.413852,90000,1.2200696468353271
1702305583.6132283,95000,1.4036455154418945
1702305600.2896972,103000,1.6282215118408203
1702305608.2431848,106000,1.1322927474975586
1702305609.814695,107000,0.7826984524726868
1702305628.5961707,114000,-0.23244574666023254
1702305634.682466,117000,-1.101775884628296
1702305640.58725,119000,-0.28244900703430176
1702305642.2100933,120000,0.0659254938364029
1702305644.3614216,121000,0.17872652411460876
1702305653.9104416,125000,-0.09367489069700241
1702305656.2200506,126000,-0.024546457454562187
1702305658.0790527,127000,0.06319320946931839
1702305665.654552,130000,0.22870677709579468
1702305667.8111618,131000,0.20321303606033325
1702305675.35346,134000,0.16231143474578857
1702305684.5799854,138000,-0.11955027282238007
1702305690.0091653,140000,0.010217494331300259
1702305694.0850787,142000,0.14540588855743408
1702305696.2512097,143000,0.07209642976522446
1702305698.2104228,144000,0.1462182253599167
1702305701.6553073,145000,0.2934286892414093
1702305709.9889433,149000,0.3099801540374756
1702305715.1643567,151000,0.6789283752441406
1702305722.3074074,154000,0.6141270399093628
1702305726.2576115,155000,0.6923893094062805
1702305727.7910972,156000,0.967072606086731
1702305731.9141612,158000,1.0044586658477783
1702305734.0792813,159000,0.8821766376495361
1702305738.1136665,160000,1.016241192817688
1702305743.57109,163000,1.0762200355529785
1702305747.5633643,165000,1.0875693559646606
1702305750.9607632,166000,1.5295031070709229
1702305755.1898904,168000,1.4787676334381104
1702305757.0488667,169000,1.277757167816162
1702305765.3128867,172000,2.345555305480957
1702305777.0291815,177000,2.3028314113616943
1702305777.347673,178000,2.4022932052612305
1702305779.7663429,179000,2.1732497215270996
1702305783.6869996,181000,2.3617801666259766
1702305787.792427,184000,2.5252387523651123
1702305791.4472868,186000,2.715895414352417
1702305792.0324695,187000,2.506165027618408
1702305795.7233377,189000,1.243737816810608
1702305801.31482,191000,2.5624237060546875
1702305801.7446868,192000,2.031654119491577
1702305812.0174105,199000,2.592235565185547
1702305818.7625535,203000,2.560731887817383
1702305825.2877796,207000,1.9296318292617798
1702305827.963531,208000,3.5212254524230957
1702305828.9641967,209000,0.757940948009491
1702305836.2964633,213000,2.9937140941619873
1702305840.3506217,216000,0.1800246238708496
1702305846.1213937,219000,2.714346408843994
1702305847.1437044,220000,2.3578224182128906
1702305852.7595897,223000,2.99808406829834
1702305853.4846938,224000,1.8298097848892212
1702305856.738245,226000,2.1394758224487305
1702305857.9315917,227000,3.795433759689331
1702305861.5017521,228000,3.7721707820892334
1702305863.9016497,230000,4.028890609741211
1702305869.5363955,233000,3.540937900543213
1702305871.1343396,234000,3.9574217796325684
1702305872.8389678,235000,3.439807415008545
1702305878.2584035,238000,4.070225715637207
1702305881.5697157,241000,4.380351543426514
1702305888.583385,246000,3.1086318492889404
1702305894.806555,248000,2.5048668384552
1702305897.6091528,250000,0.5254782438278198
1702305898.9649847,251000,0.7169697880744934
1702305907.744918,256000,0.9675294756889343
1702305914.2633727,259000,-0.03325991332530975
1702305915.337809,260000,-1.3955483436584473
1702305916.7228026,261000,-1.233635663986206
1702305918.370449,262000,1.0984487533569336
1702305923.0071087,264000,0.5016760230064392
1702305930.7269092,268000,0.4110482633113861
1702305934.8996053,270000,0.5891358852386475
1702305937.9422152,272000,1.0574045181274414
1702305942.863039,274000,0.13327576220035553
1702305952.5964766,279000,2.20253849029541
1702305955.0128598,281000,2.7917940616607666
1702305962.7146778,285000,3.086599349975586
1702305973.7577455,290000,4.087027072906494
1702305976.7762847,292000,4.393692493438721
1702305978.3446555,293000,3.7028636932373047
1702305987.2743826,298000,3.4077632427215576
1702305989.0235698,299000,3.8068175315856934
1702305991.968075,300000,3.0003857612609863
1702305995.2775614,302000,3.3484466075897217
1702305996.6744041,303000,3.9071779251098633
1702305998.5793526,304000,3.404245138168335
1702306007.1864183,308000,4.071552276611328
1702306008.5489175,309000,2.8216655254364014
1702306012.2130883,311000,3.244495391845703
1702306016.2624521,314000,3.438290596008301
1702306023.9280865,318000,3.643043279647827
1702306024.9941378,319000,3.5316574573516846
1702306027.747513,320000,3.459597110748291
1702306028.0502248,321000,3.7175071239471436
1702306030.9815733,323000,3.8035762310028076
1702306038.1829207,326000,3.8564298152923584
1702306038.7805278,327000,3.6389636993408203
1702306041.2331336,328000,4.323967456817627
1702306045.950818,331000,4.067546367645264
1702306047.345131,332000,4.149990081787109
1702306049.6934423,334000,4.004356861114502
1702306058.9607794,340000,4.17051362991333
1702306062.9099603,342000,4.114380359649658
1702306068.9096007,345000,4.27229118347168
1702306071.8487642,346000,4.171295642852783
1702306073.9841762,348000,4.421268939971924
1702306074.9746008,349000,4.1587677001953125
1702306083.520185,354000,4.634893894195557
1702306084.4647024,355000,4.189355850219727
1702306088.4349766,357000,4.203242301940918
1702306091.262915,359000,4.517494201660156
1702306091.6544054,360000,4.230093955993652
1702306094.709991,361000,4.3155012130737305
1702306100.8907592,364000,4.360280513763428
1702306101.391748,365000,4.110799789428711
1702306108.0919936,368000,-0.22008085250854492
1702306108.179269,369000,-0.48620304465293884
1702306112.1701908,371000,3.3673882484436035
1702306114.487686,372000,-0.9525887370109558
1702306117.6648936,374000,-0.3022451102733612
1702306122.8912518,378000,-3.4209558963775635
1702306123.926378,379000,-6.123388767242432
1702306125.8018072,380000,-5.25855016708374
1702306131.3892365,382000,-1.0198017358779907
1702306133.6404088,383000,-8.48606014251709
1702306139.121846,387000,-3.805182933807373
1702306141.595876,388000,-9.306299209594727
1702306143.806866,389000,-8.360249519348145
1702306145.7608,391000,-8.565791130065918
1702306147.0249915,392000,-7.321308135986328
1702306150.1280434,393000,-3.0159008502960205
1702306150.2866192,394000,-14.933218955993652
1702306168.933654,403000,-7.908425331115723
1702306169.0832758,404000,-25.13372039794922
1702306172.130768,406000,-6.349802017211914
1702306177.979599,409000,-20.014495849609375
1702306188.727662,416000,-13.079570770263672
1702306189.9966202,417000,-2.3977181911468506
1702306197.3583472,421000,-9.332524299621582
1702306200.1930299,422000,-12.237327575683594
1702306201.3550837,423000,-15.19063663482666
1702306204.9303617,425000,-8.863868713378906
1702306208.5083182,427000,-7.933352470397949
1702306214.0820725,431000,-19.040695190429688
1702306229.8871255,440000,-14.224347114562988
1702306231.7013965,441000,-11.448077201843262
1702306232.8827314,442000,-11.81680965423584
1702306235.3058765,443000,-8.698423385620117
1702306238.904422,445000,-9.592816352844238
1702306240.3843908,446000,-9.135847091674805
1702306244.2737334,449000,-14.512798309326172
1702306250.292861,452000,-11.324897766113281
1702306262.859895,459000,-2.0646069049835205
1702306266.485602,460000,-0.14120341837406158
1702306266.7454336,461000,-2.3285648822784424
1702306267.7582567,462000,-3.977940320968628
1702306270.24306,464000,-1.5860931873321533
1702306272.099166,465000,-1.1606459617614746
1702306277.8773804,468000,-0.6082651615142822
1702306279.2452703,469000,0.7057597637176514
1702306280.7712479,470000,1.294354796409607
1702306284.0173655,472000,-0.20201341807842255
1702306287.112448,474000,-0.22782310843467712
1702306288.3840888,475000,2.421967029571533
1702306296.5943024,479000,1.9458431005477905
1702306309.1666913,486000,1.3292908668518066
1702306313.2895834,489000,1.1596684455871582
1702306313.9323838,490000,-0.9131951928138733
1702306318.9753268,492000,1.989993929862976
1702306320.4454386,494000,0.08743459731340408
1702306328.2587607,497000,2.4427220821380615
1702306345.7261436,508000,1.1149964332580566
1702306350.4414897,511000,0.1755312979221344
1702306353.0284832,512000,-2.384553909301758
1702306353.3826547,513000,0.4525097906589508
1702306357.027192,515000,-3.4608817100524902
1702306360.60926,517000,-2.7442386150360107
1702306363.8693764,518000,1.7757993936538696
1702306366.1393914,520000,0.4963234066963196
1702306375.0896137,525000,0.9909000992774963
1702306375.8553317,526000,-1.466636061668396
1702306385.3573737,532000,-4.549438953399658
1702306389.878089,534000,-3.049424409866333
1702306392.4422226,535000,1.2811604738235474
1702306394.0054097,536000,2.316227674484253
1702306394.9731107,537000,-6.752840995788574
1702306398.4585457,538000,2.765136480331421
1702306399.1202374,539000,-2.6402764320373535
1702306400.4815238,540000,1.9834966659545898
1702306402.7605355,541000,2.3692526817321777
1702306403.3834043,542000,-4.701988220214844
1702306406.2650537,543000,2.3790855407714844
1702306409.0053983,545000,-4.206725120544434
1702306414.6746297,548000,-1.891667127609253
1702306415.8751967,549000,4.161210536956787
1702306416.840178,550000,0.9652718901634216
1702306419.8753293,552000,2.8308136463165283
1702306427.5760033,556000,-5.39375638961792
1702306430.3978949,558000,3.2153968811035156
1702306433.9875762,560000,2.461019277572632
1702306441.5893419,564000,3.080427646636963
1702306442.7213612,565000,-6.830665111541748
1702306443.9168694,566000,-2.0174899101257324
1702306445.801992,568000,-5.513458728790283
1702306450.3297977,570000,1.7138310670852661
1702306454.7762995,572000,1.8542659282684326
1702306458.9120667,574000,-11.26674747467041
1702306460.1473007,575000,3.252830743789673
1702306464.619234,578000,2.165769100189209
1702306468.3743904,580000,-7.5033769607543945
1702306469.823065,581000,1.2627551555633545
1702306471.1924603,582000,-2.6557483673095703
1702306472.6117387,583000,-3.1227664947509766
1702306473.9262667,584000,0.39114606380462646
1702306476.4334059,585000,-3.841590404510498
1702306479.8044782,587000,-0.9378169775009155
1702306480.5430427,588000,-8.530817985534668
1702306490.2838323,593000,-2.3023226261138916
1702306491.7592978,594000,1.6004620790481567
1702306495.311356,596000,-2.2136402130126953
1702306497.0414555,597000,3.0464937686920166
1702306498.2297332,598000,1.296040415763855
1702306503.4401488,601000,1.002082347869873
1702306506.9459908,603000,2.374361276626587
1702306510.701973,605000,2.4080491065979004
1702306513.1653724,607000,1.9020521640777588
1702306515.5132012,609000,2.0406570434570312
1702306520.572085,611000,0.8273611664772034
1702306521.7147992,612000,2.7390024662017822
1702306523.4024274,613000,2.7485499382019043
1702306528.6390545,616000,2.4914979934692383
1702306534.4242878,620000,2.9720051288604736
1702306536.9770517,621000,2.874974489212036
1702306539.7453601,623000,3.464395046234131
1702306545.33284,626000,2.8343453407287598
1702306551.7880151,630000,3.706731081008911
1702306559.7526278,635000,2.6360132694244385
1702306572.076198,642000,2.890939950942993
1702306573.4232297,643000,2.751650810241699
1702306575.883295,645000,1.9004297256469727
1702306579.0492787,646000,2.941988229751587
1702306580.6073663,647000,3.4852004051208496
1702306582.4805481,648000,3.641136407852173
1702306584.075094,649000,3.1247942447662354
1702306585.5681584,650000,2.6068146228790283
1702306589.3437433,652000,2.7255024909973145
1702306591.0402906,653000,2.660733222961426
1702306597.589217,657000,1.0381847620010376
1702306598.9392698,658000,2.482184410095215
1702306601.6710606,660000,1.6171199083328247
1702306606.143449,662000,2.831453800201416
1702306609.8018515,665000,0.808361291885376
1702306615.1006866,667000,1.5802161693572998
1702306616.8132641,668000,-0.3605250120162964
1702306618.6340265,669000,1.2128734588623047
1702306625.0472932,672000,2.961019992828369
1702306625.3001416,673000,2.386065721511841
1702306625.9773571,674000,0.7700491547584534
1702306628.179186,675000,3.1574931144714355
1702306629.5620415,676000,2.5439226627349854
1702306632.9688997,678000,3.1861441135406494
1702306634.8050945,679000,2.930053949356079
1702306636.3761666,680000,0.5915600061416626
1702306639.0379374,682000,1.9403427839279175
1702306641.4688532,683000,1.278568983078003
1702306642.8335707,684000,3.5440073013305664
1702306643.948606,685000,2.555992364883423
1702306646.4956012,686000,1.1722609996795654
1702306648.0008068,687000,3.0758185386657715
1702306652.285475,689000,2.5741283893585205
1702306653.2404883,690000,3.1702706813812256
1702306659.1233451,693000,2.1865427494049072
1702306664.1218596,697000,0.12185680121183395
1702306669.0091455,700000,0.4251045286655426
1702306670.9142413,701000,3.8509039878845215
1702306672.4378507,702000,3.4942290782928467
1702306677.021317,704000,3.8424434661865234
1702306680.520971,706000,0.7979728579521179
1702306681.6989388,707000,1.1831438541412354
1702306685.709996,709000,-0.551850438117981
1702306687.3398116,710000,0.6252486705780029
1702306688.5597036,711000,0.15904222428798676
1702306695.5958645,715000,3.551328659057617
1702306702.639115,719000,0.12818431854248047
1702306703.5731702,720000,2.7934765815734863
1702306706.429136,722000,3.4333982467651367
1702306707.9029114,723000,-0.2363365739583969
1702306711.283836,724000,2.8536288738250732
1702306712.6951036,725000,1.182207465171814
1702306713.8989298,726000,2.2158966064453125
1702306716.0322962,727000,3.6383912563323975
1702306720.957195,730000,2.8516438007354736
1702306722.091211,731000,0.3164173364639282
1702306731.9000804,737000,3.016732931137085
1702306736.5036232,739000,3.6909372806549072
1702306736.985438,740000,3.345379590988159
1702306738.5308979,741000,3.1789145469665527
1702306740.5152285,742000,3.8126816749572754
1702306746.3521125,744000,3.5718555450439453
1702306749.851499,747000,3.3075897693634033
1702306750.8329747,748000,3.179334878921509
1702306755.9249246,751000,4.10316276550293
1702306757.496473,752000,3.780931234359741
1702306758.9277804,753000,2.8921761512756348
1702306762.4914124,755000,3.6761720180511475
1702306765.0081549,757000,2.2276217937469482
1702306770.8340828,760000,2.7382922172546387
1702306772.9625385,761000,3.4553568363189697
1702306776.4639506,763000,1.8678257465362549
1702306782.0201154,766000,3.7120048999786377
1702306783.1880684,767000,1.9700573682785034
1702306784.6422844,768000,3.2651336193084717
1702306789.2409632,770000,2.7297861576080322
1702306789.997998,771000,2.5600078105926514
1702306791.2910903,772000,3.015467643737793
1702306794.6270585,774000,1.4568815231323242
1702306797.3905408,775000,1.4567344188690186
1702306798.4373837,776000,2.7862472534179688
1702306807.9570642,781000,0.9811928272247314
1702306814.584428,785000,2.614168167114258
1702306816.7129407,786000,-0.26866552233695984
1702306819.7853765,788000,2.905479669570923
1702306822.8091655,790000,2.437659978866577
1702306827.1168454,792000,1.4582725763320923
1702306828.2673392,793000,2.1583197116851807
1702306829.1949673,794000,0.7929461598396301
1702306831.0261724,795000,1.9124679565429688
1702306833.7934196,796000,1.6586562395095825
1702306835.218147,797000,1.7426154613494873
1702306838.7861638,799000,2.0326852798461914
1702306844.0918376,801000,2.291769027709961
1702306846.3268576,803000,1.5790257453918457
1702306852.1412404,806000,3.1773641109466553
1702306854.8840356,808000,0.7016369700431824
1702306856.0270236,809000,3.0900726318359375
1702306857.6397688,810000,2.580394744873047
1702306864.5512621,814000,1.6627511978149414
1702306869.4689412,816000,3.285160541534424
1702306869.6290216,817000,0.26165565848350525
1702306874.839665,819000,2.253938674926758
1702306880.1161125,822000,3.2017056941986084
1702306882.7173166,824000,3.3521828651428223
1702306885.3588433,826000,2.592867851257324
1702306891.0014386,829000,3.324554443359375
1702306896.4679747,832000,3.715463399887085
1702306897.4903293,833000,3.4173030853271484
1702306900.577798,835000,3.3326587677001953
1702306904.701678,837000,3.2018020153045654
1702306908.5760548,839000,3.666546106338501
1702306917.1312158,844000,3.907266855239868
1702306919.0188024,846000,3.3061776161193848
1702306923.2809591,847000,3.6292412281036377
1702306923.452088,848000,3.2970130443573
1702306924.5619755,849000,3.2691075801849365
1702306929.6118472,852000,3.8454363346099854
1702306942.1239173,858000,3.3035337924957275
1702306944.7041626,860000,3.9277563095092773
1702306946.0494435,861000,3.444838047027588
1702306947.199915,862000,2.628471612930298
1702306950.207588,863000,3.493471384048462
1702306951.282777,864000,2.721916913986206
1702306958.5139742,868000,3.0481767654418945
1702306961.3301022,870000,2.54573917388916
1702306962.3419325,871000,2.860215187072754
1702306967.9520023,874000,0.7046693563461304
1702306969.6625133,875000,1.001454472541809
1702306972.1790683,876000,1.8400520086288452
1702306973.5672228,877000,3.0205979347229004
1702306976.8691487,878000,1.1036709547042847
1702306978.8998246,880000,2.8852803707122803
1702306980.3819218,881000,2.8115479946136475
1702306981.809158,882000,3.6415610313415527
1702306983.5780072,883000,2.799731492996216
1702306987.8248024,885000,2.8558812141418457
1702306992.1449637,888000,1.7735702991485596
1702306995.7068403,890000,3.5671579837799072
1702306997.234829,891000,2.3621718883514404
1702307000.7346065,893000,2.649566888809204
1702307003.7019315,894000,3.6317555904388428
1702307008.4601185,897000,2.445465326309204
1702307014.2957947,900000,2.3408985137939453
1702307015.65126,901000,1.5879930257797241
1702307026.571148,908000,2.542811155319214
1702307030.5380774,909000,2.2015535831451416
1702307031.066189,910000,0.9225983023643494
1702307032.2142305,911000,1.8341084718704224
1702307034.0688715,912000,2.0246822834014893
1702307036.6019006,913000,1.4166960716247559
1702307038.512746,914000,2.4557576179504395
1702307042.0461817,916000,1.1037520170211792
1702307043.7561743,917000,1.4048874378204346
1702307045.144015,918000,2.182743787765503
1702307050.5912251,921000,3.1064951419830322
1702307051.8050702,922000,3.42225980758667
1702307052.8872356,923000,2.8910038471221924
1702307054.6042247,924000,3.290372848510742
1702307058.7160661,926000,3.465714454650879
1702307069.6694598,932000,2.752068281173706
1702307071.7316196,933000,3.100691795349121
1702307076.132067,936000,2.736161947250366
1702307087.5289204,943000,3.8800859451293945
1702307092.4779048,946000,3.384941816329956
1702307099.4731827,950000,3.5190179347991943
1702307105.3281713,953000,3.211216449737549
1702307107.057753,954000,3.141572952270508
1702307108.1658478,955000,2.9095163345336914
1702307111.9550421,957000,3.3481130599975586
1702307113.5839047,958000,3.1074271202087402
1702307114.746921,959000,3.4546260833740234
1702307119.8051903,962000,3.604142665863037
1702307121.1197214,963000,2.968071937561035
1702307124.1203358,965000,3.5057878494262695
1702307128.3361824,967000,3.718932867050171
1702307129.439765,968000,3.2771992683410645
1702307133.985966,970000,3.74194598197937
1702307137.392572,972000,3.54734468460083
1702307138.783006,973000,3.94461989402771
1702307141.2246172,975000,4.018598556518555
1702307145.5204773,977000,3.5552666187286377
1702307146.2350733,978000,2.8352653980255127
1702307148.6575005,979000,3.88619065284729
1702307149.5984237,980000,3.386754035949707
1702307154.8840904,983000,3.7205939292907715
1702307155.8839986,984000,3.527425765991211
1702307157.8358822,985000,3.4607253074645996
1702307164.8961802,988000,3.6687238216400146
1702307165.9848201,989000,3.771599769592285
1702307179.9583676,997000,3.408111810684204
1702307183.3379638,1000000,2.0280890464782715
1702307184.6817293,1001000,3.747607469558716
1702307189.0588214,1003000,3.6944212913513184
1702307191.9756677,1005000,3.6651089191436768
1702307194.7609177,1006000,3.832202434539795
1702307199.79802,1009000,3.2014379501342773
1702307201.121163,1010000,3.9367356300354004
1702307203.699616,1012000,3.79417085647583
1702307206.3774507,1013000,4.061500549316406
1702307207.1376395,1014000,3.895353317260742
1702307208.0927799,1015000,3.605836868286133
1702307213.9147508,1018000,3.9318628311157227
1702307227.9395063,1026000,3.790666103363037
1702307229.81598,1027000,4.196676254272461
1702307232.4045136,1028000,3.760972023010254
1702307234.7727525,1030000,3.8326539993286133
1702307237.667263,1032000,3.8763396739959717
1702307240.6612167,1033000,3.43829345703125
1702307241.4616783,1034000,3.858778715133667
1702307243.976831,1036000,3.926142692565918
1702307249.0427673,1038000,3.917999029159546
1702307249.3818905,1039000,4.086069107055664
1702307250.5997248,1040000,3.9331650733947754
1702307257.2556396,1043000,3.8853259086608887
1702307259.1910675,1044000,4.326543807983398
1702307260.5893562,1045000,3.9907386302948
1702307268.241622,1050000,4.271533489227295
1702307271.6272242,1052000,4.332632541656494
1702307272.5154018,1053000,4.108826160430908
1702307276.8522525,1056000,3.091954231262207
1702307281.0125005,1058000,3.397615432739258
1702307293.793386,1064000,2.3509702682495117
1702307294.394807,1065000,3.297356605529785
1702307297.6038475,1067000,2.9667325019836426
1702307302.0862222,1069000,2.806520938873291
1702307305.9929602,1073000,2.5735442638397217
1702307310.4173834,1075000,2.9975061416625977
1702307312.213683,1077000,2.181774377822876
1702307316.098645,1079000,2.9602200984954834
1702307320.041297,1081000,2.4186620712280273
1702307323.511779,1083000,3.357088088989258
1702307324.7929056,1084000,2.733278274536133
1702307327.188146,1085000,2.8180534839630127
1702307327.9591126,1086000,1.7774239778518677
1702307329.6008582,1087000,3.0747945308685303
1702307335.8699205,1091000,2.432354211807251
1702307339.3118749,1093000,3.0460193157196045
1702307340.548623,1094000,1.2019298076629639
1702307352.6017315,1100000,3.0324535369873047
1702307355.5629747,1102000,1.7096278667449951
1702307358.642977,1104000,1.1389857530593872
1702307362.008785,1105000,0.41080373525619507
1702307362.25264,1106000,1.144850730895996
1702307376.7204156,1115000,1.0555349588394165
1702307380.0460162,1117000,1.201197862625122
1702307386.1891494,1120000,2.156522512435913
1702307391.297033,1123000,1.5734139680862427
1702307392.9321737,1124000,2.401500701904297
1702307396.8599873,1126000,1.613779902458191
1702307398.6761777,1127000,2.968658208847046
1702307400.0615454,1128000,1.8947727680206299
1702307400.7162063,1129000,-0.316913366317749
1702307405.5995407,1131000,2.3595659732818604
1702307406.4490721,1132000,1.0198994874954224
1702307409.4318898,1134000,1.9578046798706055
1702307410.8715765,1135000,2.3082597255706787
1702307414.1023443,1136000,0.9147228002548218
1702307419.1052692,1139000,1.2294565439224243
1702307421.0820284,1140000,0.6507229208946228
1702307424.9010115,1142000,0.928820788860321
1702307437.8318825,1150000,1.1049715280532837
1702307438.659695,1151000,1.041804313659668
1702307441.857976,1152000,1.739472508430481
1702307443.1016893,1153000,0.6136214137077332
1702307447.919542,1156000,1.348567008972168
1702307451.0606482,1157000,0.3292389512062073
1702307452.3109038,1158000,1.7442690134048462
1702307456.759681,1161000,1.572716236114502
1702307460.5331109,1162000,2.172653913497925
1702307460.7669919,1163000,2.2062995433807373
1702307465.2596407,1166000,1.7563799619674683
1702307486.8344162,1178000,1.607822299003601
1702307491.2785454,1181000,1.616791844367981
1702307495.3158922,1183000,0.6878471970558167
1702307496.8318274,1184000,1.677114486694336
1702307499.9516444,1186000,0.7174146771430969
1702307500.9669833,1187000,1.4314601421356201
1702307506.6234844,1190000,0.5464807748794556
1702307512.7849646,1193000,0.534114420413971
1702307514.1930225,1194000,0.4666071832180023
1702307516.840913,1195000,0.9531462788581848
1702307517.9865339,1196000,0.5003035664558411
1702307519.4068115,1197000,0.33025819063186646
1702307520.771221,1198000,0.9407600164413452
1702307523.1847737,1199000,-1.219494342803955
1702307525.185649,1200000,3.0057642459869385
1702307527.9594164,1202000,1.2470004558563232
1702307532.1157384,1204000,-1.631050705909729
1702307533.9205832,1205000,2.311149835586548
1702307537.0164735,1207000,1.6802711486816406
1702307541.0977428,1209000,1.0748904943466187
1702307544.429547,1211000,-0.5574390292167664
1702307545.2104874,1212000,-1.290688395500183
1702307548.0336711,1213000,1.1186403036117554
1702307551.3988843,1214000,-0.08105246722698212
1702307552.771298,1215000,0.5884906649589539
1702307554.3796294,1216000,-0.10409896075725555
1702307569.886563,1225000,0.9648964405059814
1702307571.5980954,1226000,2.5611255168914795
1702307575.1293318,1228000,0.9437956213951111
1702307578.0133078,1229000,0.05878409743309021
1702307584.488475,1233000,1.0491337776184082
1702307587.2087846,1234000,2.452333688735962
1702307589.726647,1235000,2.5647404193878174
1702307592.7589524,1237000,2.1632630825042725
1702307598.2875178,1240000,2.908853054046631
1702307602.6485748,1243000,2.2930877208709717
1702307606.8932767,1245000,2.59700345993042
1702307609.8435838,1247000,1.9186724424362183
1702307611.2626722,1248000,1.0602333545684814
1702307615.4588816,1250000,0.8262561559677124
1702307618.1326087,1251000,2.364746332168579
1702307622.8706555,1254000,-2.1181716918945312
1702307626.8213186,1255000,1.4873441457748413
1702307627.4358156,1256000,-4.059701442718506
1702307630.5339613,1258000,-4.119598388671875
1702307632.3068771,1259000,1.2116886377334595
1702307635.396687,1260000,-2.7306787967681885
1702307637.5981655,1262000,-3.9420089721679688
1702307639.6857905,1263000,2.2936856746673584
1702307640.5366118,1264000,-4.420341491699219
1702307642.7807484,1265000,2.316661834716797
1702307645.1397407,1266000,-5.948179244995117
1702307646.7734978,1267000,2.3819005489349365
1702307656.7696483,1272000,1.0140186548233032
1702307658.181424,1273000,-0.1598052978515625
1702307661.548603,1275000,2.7040212154388428
1702307668.346852,1279000,2.2681307792663574
1702307670.012991,1280000,3.515759229660034
1702307673.9054925,1282000,3.069955348968506
1702307681.6067493,1286000,3.1027233600616455
1702307684.6953924,1288000,2.1025121212005615
1702307688.587689,1290000,1.9084868431091309
1702307693.3913062,1292000,2.349088430404663
1702307694.9283562,1293000,2.3990793228149414
1702307696.0088623,1294000,2.2429208755493164
1702307697.4938009,1295000,1.854630708694458
1702307702.0211954,1297000,1.9494003057479858
1702307705.679035,1300000,2.5314114093780518
1702307707.7540767,1301000,2.543748140335083
1702307711.9306338,1303000,2.7974534034729004
1702307712.7305217,1304000,2.256185531616211
1702307714.6397133,1305000,2.602646827697754
1702307719.1745052,1307000,2.984600782394409
1702307726.8078601,1311000,2.4936318397521973
1702307730.84148,1313000,1.6207033395767212
1702307732.4489105,1314000,2.0536019802093506
1702307736.1915174,1316000,2.5809075832366943
1702307738.9760647,1317000,0.5075393915176392
1702307742.9175298,1320000,1.9240607023239136
1702307744.5131958,1321000,1.7230602502822876
1702307753.8251705,1326000,2.384735584259033
1702307758.1940095,1327000,1.2904658317565918
1702307758.9799492,1328000,2.6137332916259766
1702307760.3777463,1329000,0.4217003881931305
1702307763.8177118,1331000,3.233896017074585
1702307767.741544,1333000,2.730194568634033
1702307769.3707626,1334000,0.961595356464386
1702307770.8728027,1335000,2.680523157119751
1702307772.3382144,1336000,1.485334038734436
1702307773.8065827,1337000,1.7043975591659546
1702307776.890409,1338000,1.8548775911331177
1702307780.8852084,1341000,2.990737199783325
1702307786.7327259,1344000,2.7782952785491943
1702307791.2891717,1346000,1.410506010055542
1702307796.979654,1349000,3.616774320602417
1702307798.2069259,1350000,2.8478622436523438
1702307799.7055993,1351000,1.347705364227295
1702307800.8059485,1352000,2.633315086364746
1702307807.7323241,1356000,2.85512638092041
1702307815.3999593,1360000,2.874438524246216
1702307817.9368386,1362000,2.7520031929016113
1702307821.9992425,1363000,2.8665053844451904
1702307828.3281925,1367000,3.127664566040039
1702307829.9852872,1368000,3.1178393363952637
1702307836.4409394,1371000,3.4686381816864014
1702307842.488378,1374000,3.218292236328125
1702307844.029841,1375000,3.253277540206909
1702307845.404761,1376000,2.806440591812134
1702307849.2423646,1378000,3.175307512283325
1702307852.1324043,1379000,2.577085018157959
1702307853.5367696,1380000,3.0462634563446045
1702307859.0213869,1383000,2.7988901138305664
1702307864.00143,1385000,3.389674663543701
1702307865.7293696,1386000,3.4251489639282227
1702307872.2850478,1388000,1.1863490343093872
1702307877.4073164,1389000,0.9005162119865417
1702307881.0011532,1390000,0.3465670347213745
1702307888.574639,1392000,0.7416574954986572
1702307892.6125078,1393000,0.5928077101707458
1702307905.0300515,1396000,0.5997751951217651
1702307924.8067927,1401000,0.6274882555007935
1702307954.1674047,1413000,2.376431465148926
1702307954.8665624,1414000,2.1785976886749268
1702307957.999317,1415000,2.833484411239624
1702307959.7945886,1416000,3.4269704818725586
1702307967.4234664,1420000,3.5155155658721924
1702307971.466273,1423000,3.3773558139801025
1702307972.3733637,1424000,3.4904727935791016
1702307976.2721205,1426000,3.838067054748535
1702307977.6116269,1427000,3.759150505065918
1702307978.810495,1428000,3.67987060546875
1702307980.9234529,1429000,3.8703503608703613
1702307986.8195167,1433000,3.5044727325439453
1702307988.4537718,1434000,3.68056058883667
1702307989.904082,1435000,3.492664098739624
1702307993.7076185,1437000,2.5460257530212402
1702307995.6225953,1438000,3.5633909702301025
1702307997.4326808,1439000,3.754132032394409
1702308001.6967988,1441000,3.5989174842834473
1702308004.4455762,1443000,3.4474217891693115
1702308013.4037383,1449000,3.717360734939575
1702308017.6568036,1451000,3.75528621673584
1702308025.2737591,1456000,3.3622493743896484
1702308027.3635142,1457000,3.2381513118743896
1702308041.2359867,1466000,3.051119327545166
1702308043.7186823,1467000,3.750239610671997
1702308049.459575,1471000,2.7801942825317383
1702308055.6028988,1475000,3.243253231048584
1702308062.4941745,1478000,3.572694778442383
1702308066.0638123,1481000,3.9596800804138184
1702308069.4768367,1482000,4.007505416870117
1702308070.4687204,1483000,3.0487873554229736
1702308074.5714664,1486000,3.8769664764404297
1702308077.6397245,1487000,3.1299960613250732
1702308080.739459,1490000,3.848673105239868
1702308085.7075071,1492000,3.456949472427368
1702308085.8695998,1493000,2.8499221801757812
1702308087.1080327,1494000,4.015888214111328
1702308099.73087,1501000,3.0094399452209473
1702308100.6449454,1502000,3.899904727935791
1702308102.6980565,1503000,4.087218284606934
1702308104.972847,1504000,2.7385342121124268
1702308107.3070388,1506000,3.856797456741333
1702308108.7266605,1507000,3.710599184036255
1702308111.3457084,1508000,2.4348740577697754
1702308112.422366,1509000,2.2265355587005615
1702308113.795739,1510000,3.1103200912475586
1702308115.1247199,1511000,3.2221102714538574
1702308116.6213098,1512000,2.9170212745666504
1702308120.409583,1513000,2.597548246383667
1702308121.7596633,1514000,4.142344951629639
1702308126.3606462,1517000,3.1341090202331543
1702308130.5184093,1519000,4.1102681159973145
1702308138.546209,1524000,3.3081958293914795
1702308139.693184,1525000,3.798407793045044
1702308140.6967552,1526000,2.5601372718811035
1702308145.4905498,1528000,3.7305972576141357
1702308156.280808,1535000,3.7961618900299072
1702308158.8954809,1537000,2.298626661300659
1702308167.3588557,1542000,2.5144453048706055
1702308168.7647023,1543000,3.928483247756958
1702308175.7764165,1547000,2.909776449203491
1702308179.490657,1549000,4.285889625549316
1702308180.6137464,1550000,2.765753984451294
1702308185.487616,1552000,3.9910130500793457
1702308186.6475406,1553000,3.806218147277832
1702308190.367358,1555000,2.515436887741089
1702308192.1715965,1556000,3.885819435119629
1702308201.009602,1562000,3.363262176513672
1702308202.3784876,1563000,3.330888032913208
1702308205.6493614,1564000,3.029010534286499
1702308211.936348,1569000,3.907949924468994
1702308214.9384615,1570000,3.7040023803710938
1702308228.937434,1579000,3.690286874771118
1702308231.9730444,1580000,3.4464316368103027
1702308235.3441613,1583000,2.4507856369018555
1702308237.4037375,1584000,4.162881851196289
1702308240.6040409,1585000,3.7137935161590576
1702308242.3893716,1587000,3.3352365493774414
1702308245.636382,1589000,3.801037073135376
1702308250.5482564,1591000,2.738476276397705
1702308254.640474,1594000,3.8509106636047363
1702308257.7566018,1595000,2.8243274688720703
1702308259.804225,1597000,3.6859655380249023
1702308261.0511956,1598000,3.6198761463165283
1702308265.984575,1600000,3.726001262664795
1702308267.6616564,1602000,3.9518892765045166
1702308268.6615195,1603000,3.7655770778656006
1702308271.5934262,1605000,4.057398319244385
1702308274.0506403,1606000,3.738569974899292
1702308281.205404,1610000,3.380220413208008
1702308284.412481,1611000,3.7816264629364014
1702308286.808158,1613000,3.685506820678711
1702308287.870358,1614000,3.166346788406372
1702308289.7085145,1615000,4.061205863952637
1702308292.4278598,1616000,3.308778762817383
1702308294.6747057,1618000,3.681990623474121
1702308295.7140076,1619000,3.8324825763702393
1702308297.6478934,1620000,3.705507516860962
1702308300.613291,1621000,3.3075661659240723
1702308305.193814,1625000,3.7177202701568604
1702308311.1256099,1627000,3.284693956375122
1702308311.8506904,1628000,3.60853910446167
1702308312.8284125,1629000,3.174434185028076
1702308318.614488,1631000,3.8257675170898438
1702308320.1205177,1633000,3.554940700531006
1702308322.0554204,1635000,3.9624624252319336
1702308326.630346,1637000,3.146101951599121
1702308327.825309,1638000,3.5926005840301514
1702308329.2741444,1639000,3.190201759338379
1702308332.3311176,1641000,3.367100954055786
1702308334.7902164,1642000,2.8545541763305664
1702308335.69633,1643000,2.1286487579345703
1702308336.9869242,1644000,3.473606586456299
1702308338.9793816,1645000,3.702164888381958
1702308341.969494,1646000,3.6708130836486816
1702308345.7839649,1648000,3.3282241821289062
1702308347.0461445,1649000,3.696457624435425
1702308352.458207,1652000,3.577936887741089
1702308353.2597556,1653000,3.4717681407928467
1702308356.157131,1655000,3.5891425609588623
1702308357.7394786,1656000,3.3699333667755127
1702308362.266635,1659000,2.7549996376037598
1702308363.3412974,1660000,3.7235186100006104
1702308365.3066225,1661000,3.699345827102661
1702308368.7204323,1662000,3.4735443592071533
1702308373.0669558,1665000,3.5700862407684326
1702308380.2334256,1669000,3.5817887783050537
1702308382.4376516,1671000,4.119923114776611
1702308384.422442,1672000,3.59775972366333
1702308386.7014854,1673000,3.3279645442962646
1702308390.7692904,1676000,3.6446592807769775
1702308392.518087,1677000,3.964289665222168
1702308396.0720353,1679000,3.324601411819458
1702308405.2865617,1683000,3.0253963470458984
1702308405.727397,1684000,0.18111813068389893
1702308407.1661472,1685000,3.6401290893554688
1702308407.922659,1686000,2.4699137210845947
1702308413.4451091,1688000,3.8959691524505615
1702308417.7632449,1692000,3.5825600624084473
1702308421.748505,1693000,3.446282386779785
1702308422.8181806,1695000,3.0064773559570312
1702308424.4503832,1696000,3.5492255687713623
1702308426.1025295,1697000,3.012702703475952
1702308427.2943842,1698000,2.7825374603271484
1702308431.4576583,1700000,3.361424684524536
1702308436.642738,1703000,2.4390833377838135
1702308439.0780401,1704000,-7.6452178955078125
1702308440.236984,1705000,3.7409632205963135
1702308442.0013566,1706000,3.455016613006592
1702308442.964319,1707000,3.6387646198272705
1702308448.3985562,1710000,2.802798271179199
1702308449.522593,1711000,1.9200321435928345
1702308455.721206,1715000,2.3868565559387207
1702308457.5312757,1716000,3.6609814167022705
1702308459.578384,1718000,3.642340898513794
1702308462.158101,1719000,3.3560194969177246
1702308464.8458037,1720000,3.820650815963745
1702308470.7524145,1724000,3.860858678817749
1702308476.4151073,1727000,4.201031684875488
1702308478.8202684,1729000,3.912569522857666
1702308483.6559904,1732000,4.399669647216797
1702308485.6053526,1733000,4.27004861831665
1702308486.7383714,1734000,4.290244102478027
1702308489.423327,1735000,4.055116176605225
1702308490.87112,1736000,4.172331809997559
1702308493.2696416,1738000,4.0275654792785645
1702308495.4650793,1739000,4.184382915496826
1702308499.4274218,1740000,4.069320201873779
1702308503.2586887,1743000,3.8067569732666016
1702308504.1693003,1744000,3.7452032566070557
1702308508.25438,1746000,4.040157794952393
1702308509.167952,1747000,4.023489475250244
1702308510.3672931,1748000,4.363404273986816
1702308516.0983076,1751000,4.35532808303833
1702308518.7085223,1753000,4.407606601715088
1702308519.827155,1754000,4.223152160644531
1702308521.9530299,1755000,3.4788451194763184
1702308524.3886628,1756000,4.179370880126953
1702308535.5643148,1763000,3.131840467453003
1702308537.1077702,1764000,2.8434085845947266
1702308542.5088434,1767000,3.665106773376465
1702308550.3151925,1772000,2.6817715167999268
1702308558.6439216,1776000,1.3112311363220215
1702308560.3684921,1778000,3.2098548412323
1702308564.2116444,1780000,4.17812967300415
1702308567.2970011,1782000,3.8881618976593018
1702308568.743521,1783000,3.3328540325164795
1702308572.0125031,1785000,3.944950819015503
1702308578.160596,1789000,3.502819538116455
1702308579.653117,1790000,4.000330924987793
1702308581.070432,1791000,3.7739646434783936
1702308584.4547403,1793000,1.0367772579193115
1702308586.3839805,1794000,3.879852533340454
1702308588.9641922,1795000,3.6137797832489014
1702308596.0463254,1799000,3.4846954345703125
1702308598.1981506,1801000,-1.7960147857666016
1702308602.1530404,1803000,3.5232369899749756
1702308604.8835278,1805000,-2.5746498107910156
1702308606.0544415,1806000,3.6288375854492188
1702308610.5601828,1808000,2.41106915473938
1702308618.2506058,1812000,3.6267213821411133
1702308620.5964816,1814000,2.7486770153045654
1702308622.0662465,1815000,2.1551432609558105
1702308627.4545765,1818000,-4.131469249725342
1702308632.4277601,1821000,4.511769771575928
1702308638.379115,1825000,4.506449222564697
1702308641.127078,1827000,1.6227666139602661
1702308643.91841,1828000,3.998494863510132
1702308647.8412526,1831000,-4.437919616699219
1702308656.2782001,1835000,-1.4575237035751343
1702308657.2805645,1836000,3.1650137901306152
1702308658.770318,1837000,1.6940280199050903
1702308661.167589,1838000,-0.11262214183807373
1702308664.9475389,1841000,2.6514203548431396
1702308666.303522,1842000,2.285465955734253
1702308669.4424543,1843000,3.9424750804901123
1702308671.4930575,1845000,3.2209177017211914
1702308672.4902332,1846000,3.1581802368164062
1702308674.3802872,1847000,3.6392276287078857
1702308678.2870767,1849000,3.035849094390869
1702308680.335001,1850000,3.6857657432556152
1702308685.8089268,1853000,3.4922735691070557
1702308688.264123,1854000,3.283564567565918
1702308691.026937,1856000,3.8208096027374268
1702308693.8610687,1858000,3.306175947189331
1702308696.5136676,1859000,2.2491047382354736
1702308698.3282378,1860000,3.5735363960266113
1702308709.2355163,1867000,3.1541948318481445
1702308710.5625482,1868000,2.6877660751342773
1702308713.7735078,1869000,3.4972174167633057
1702308715.1414456,1870000,2.644989252090454
1702308726.811124,1876000,3.1587648391723633
1702308727.5781004,1877000,3.9464261531829834
1702308729.7334056,1878000,3.1899828910827637
1702308732.9479117,1879000,3.5119552612304688
1702308733.970363,1880000,2.4158055782318115
1702308736.8445985,1882000,3.4698691368103027
1702308742.047065,1885000,3.1167242527008057
1702308747.1819158,1888000,3.90185809135437
1702308755.3196595,1892000,3.2891221046447754
1702308756.8673503,1893000,3.301055908203125
1702308758.145498,1894000,3.4130828380584717
1702308760.9144304,1895000,2.892204523086548
1702308765.4140458,1898000,4.092066764831543
1702308766.693695,1899000,3.5238096714019775
1702308774.2932675,1903000,4.012411594390869
1702308779.8669064,1906000,0.329622358083725
1702308780.9565666,1907000,3.026395320892334
1702308789.6317935,1910000,0.6782671213150024
1702308790.7295842,1911000,3.0670583248138428
1702308792.0911093,1912000,-3.845507860183716
1702308793.9353943,1913000,2.634913206100464
1702308794.9686592,1914000,-4.2012619972229
1702308801.1460223,1917000,-1.3387682437896729
1702308802.4331298,1918000,-1.1804111003875732
1702308804.0833206,1919000,-0.7891187071800232
1702308805.6207595,1920000,2.66078782081604
1702308812.38755,1924000,3.1749422550201416
1702308814.8561494,1925000,2.0995960235595703
1702308817.1551406,1926000,1.7143118381500244
1702308823.7801085,1929000,3.546415328979492
1702308827.7411473,1931000,3.5284810066223145
1702308829.254688,1932000,2.9645755290985107
1702308830.5073247,1933000,3.4178216457366943
1702308833.2960563,1935000,3.3155455589294434
1702308836.8604107,1936000,1.963239312171936
1702308837.419931,1937000,2.81528902053833
1702308841.0260234,1939000,2.5842299461364746
1702308842.2802198,1940000,3.232797861099243
1702308851.1574852,1945000,3.396416187286377
1702308856.3280654,1947000,3.714183807373047
1702308858.7202668,1948000,3.9122447967529297
1702308861.7432878,1950000,3.7446939945220947
1702308867.7683134,1953000,3.459315061569214
1702308870.584952,1955000,3.517200231552124
1702308872.3351047,1956000,3.6527886390686035
1702308875.5961912,1957000,3.0884644985198975
1702308878.4683876,1959000,3.4635229110717773
1702308882.0695612,1961000,3.4822590351104736
1702308884.9809663,1962000,3.1801092624664307
1702308886.5124598,1963000,2.887709617614746
1702308896.483614,1967000,3.2074544429779053
1702308897.4390795,1968000,3.3684470653533936
1702308900.366177,1970000,2.628265857696533
1702308905.9722064,1972000,2.703927516937256
1702308913.6574244,1977000,3.5142762660980225
1702308921.4873354,1981000,2.724811553955078
1702308923.3491867,1982000,3.056279420852661
1702308926.022325,1983000,2.705176830291748
1702308928.3837974,1984000,3.076171636581421
1702308966.2120059,1996000,-3.228116035461426
1702308975.3760421,1998000,1.6781185865402222
1702308982.5975583,2000000,1.5173084735870361
1702308990.1689916,2002000,1.6495281457901
1702308995.437425,2003000,1.677069067955017
1702308999.8959498,2004000,1.5925709009170532
1702309004.2555177,2005000,1.7794950008392334
1702309007.9449441,2006000,1.815094232559204
1702309011.1415114,2007000,1.5430634021759033
1702309017.207893,2008000,1.9150100946426392
1702309020.1988375,2009000,1.4604815244674683
1702309023.8594437,2010000,1.8637056350708008
1702309027.608171,2011000,1.9564069509506226
1702309031.3713286,2012000,1.790365219116211
1702309039.5932646,2014000,1.0324878692626953
1702309043.7820706,2015000,0.27680841088294983
1702309047.5758848,2016000,0.2523272633552551
1702309054.865537,2018000,-1.600469708442688
1702309063.7347121,2020000,-0.11578256636857986
1702309076.277202,2023000,-2.457852363586426
1702309089.2865481,2026000,1.7104321718215942
1702309092.6141706,2027000,1.829185128211975
1702309096.3727129,2028000,1.7114940881729126
1702309101.6300483,2029000,1.896051287651062
1702309108.7659154,2031000,2.068366527557373
1702309121.4229057,2034000,2.2138731479644775
1702309129.0590813,2036000,2.289663791656494
1702309132.3544998,2037000,2.3138012886047363
1702309141.8950026,2039000,2.264303207397461
1702309149.4162138,2041000,2.3723583221435547
