07/01/2024 23:25:53;1704666353;14
07/01/2024 23:25:53;1704666353;21
07/01/2024 23:25:54;1704666354;18
07/01/2024 23:25:54;1704666354;17
07/01/2024 23:25:55;1704666355;19
07/01/2024 23:25:55;1704666355;16
07/01/2024 23:25:56;1704666356;19
07/01/2024 23:25:56;1704666356;18
07/01/2024 23:25:57;1704666357;20
07/01/2024 23:25:57;1704666357;18
07/01/2024 23:25:58;1704666358;18
07/01/2024 23:25:58;1704666358;17
07/01/2024 23:25:59;1704666359;17
07/01/2024 23:25:59;1704666359;19
07/01/2024 23:26:00;1704666360;20
07/01/2024 23:26:00;1704666360;17
07/01/2024 23:26:01;1704666361;17
07/01/2024 23:26:02;1704666362;17
07/01/2024 23:26:02;1704666362;18
07/01/2024 23:26:03;1704666363;18
07/01/2024 23:26:03;1704666363;18
07/01/2024 23:26:04;1704666364;20
07/01/2024 23:26:05;1704666365;17
07/01/2024 23:26:05;1704666365;19
07/01/2024 23:26:06;1704666366;17
07/01/2024 23:26:06;1704666366;16
07/01/2024 23:26:07;1704666367;18
07/01/2024 23:26:07;1704666367;18
07/01/2024 23:26:08;1704666368;18
07/01/2024 23:26:08;1704666368;17
07/01/2024 23:26:09;1704666369;19
07/01/2024 23:26:09;1704666369;17
07/01/2024 23:26:10;1704666370;17
07/01/2024 23:26:10;1704666370;20
07/01/2024 23:26:11;1704666371;17
07/01/2024 23:26:11;1704666371;18
07/01/2024 23:26:12;1704666372;17
07/01/2024 23:26:12;1704666372;17
07/01/2024 23:26:13;1704666373;18
07/01/2024 23:26:13;1704666373;18
07/01/2024 23:26:14;1704666374;19
07/01/2024 23:26:14;1704666374;18
07/01/2024 23:26:15;1704666375;18
07/01/2024 23:26:15;1704666375;19
07/01/2024 23:26:16;1704666376;17
07/01/2024 23:26:16;1704666376;18
07/01/2024 23:26:16;1704666376;18
07/01/2024 23:26:17;1704666377;17
07/01/2024 23:26:18;1704666378;17
07/01/2024 23:26:18;1704666378;18
07/01/2024 23:26:19;1704666379;18
07/01/2024 23:26:19;1704666379;20
07/01/2024 23:26:20;1704666380;17
07/01/2024 23:26:20;1704666380;18
07/01/2024 23:26:21;1704666381;18
07/01/2024 23:26:21;1704666381;17
07/01/2024 23:26:22;1704666382;18
07/01/2024 23:26:22;1704666382;17
07/01/2024 23:26:23;1704666383;18
07/01/2024 23:26:23;1704666383;17
07/01/2024 23:26:24;1704666384;19
07/01/2024 23:26:24;1704666384;16
07/01/2024 23:26:24;1704666384;17
07/01/2024 23:26:25;1704666385;18
07/01/2024 23:26:25;1704666385;18
07/01/2024 23:26:26;1704666386;17
07/01/2024 23:26:26;1704666386;18
07/01/2024 23:26:27;1704666387;19
07/01/2024 23:26:27;1704666387;18
07/01/2024 23:26:28;1704666388;18
07/01/2024 23:26:28;1704666388;17
07/01/2024 23:26:29;1704666389;19
07/01/2024 23:26:29;1704666389;19
07/01/2024 23:26:30;1704666390;17
07/01/2024 23:26:31;1704666391;18
07/01/2024 23:26:31;1704666391;17
07/01/2024 23:26:31;1704666391;19
07/01/2024 23:26:32;1704666392;17
07/01/2024 23:26:32;1704666392;19
07/01/2024 23:26:33;1704666393;16
07/01/2024 23:26:33;1704666393;18
07/01/2024 23:26:34;1704666394;18
07/01/2024 23:26:34;1704666394;18
07/01/2024 23:26:35;1704666395;18
07/01/2024 23:26:35;1704666395;17
07/01/2024 23:26:36;1704666396;19
07/01/2024 23:26:36;1704666396;18
07/01/2024 23:26:37;1704666397;19
07/01/2024 23:26:37;1704666397;15
07/01/2024 23:26:38;1704666398;21
07/01/2024 23:26:38;1704666398;18
07/01/2024 23:26:39;1704666399;18
07/01/2024 23:26:39;1704666399;17
07/01/2024 23:26:40;1704666400;17
07/01/2024 23:26:41;1704666401;19
07/01/2024 23:26:41;1704666401;17
07/01/2024 23:26:42;1704666402;19
07/01/2024 23:26:42;1704666402;18
07/01/2024 23:26:43;1704666403;18
07/01/2024 23:26:44;1704666404;17
07/01/2024 23:26:44;1704666404;17
