07/01/2024 21:14:53;1704658493;27
07/01/2024 21:14:54;1704658494;44
07/01/2024 21:14:55;1704658495;48
07/01/2024 21:14:56;1704658496;43
07/01/2024 21:14:57;1704658497;43
07/01/2024 21:14:58;1704658498;45
07/01/2024 21:14:58;1704658498;46
07/01/2024 21:14:59;1704658499;46
07/01/2024 21:15:00;1704658500;42
07/01/2024 21:15:01;1704658501;41
07/01/2024 21:15:01;1704658501;45
07/01/2024 21:15:02;1704658502;45
07/01/2024 21:15:03;1704658503;46
07/01/2024 21:15:04;1704658504;45
07/01/2024 21:15:04;1704658504;41
07/01/2024 21:15:05;1704658505;42
07/01/2024 21:15:06;1704658506;43
07/01/2024 21:15:07;1704658507;42
07/01/2024 21:15:07;1704658507;44
07/01/2024 21:15:08;1704658508;46
07/01/2024 21:15:09;1704658509;44
07/01/2024 21:15:09;1704658509;42
07/01/2024 21:15:10;1704658510;45
07/01/2024 21:15:11;1704658511;42
07/01/2024 21:15:12;1704658512;45
07/01/2024 21:15:12;1704658512;44
07/01/2024 21:15:13;1704658513;48
07/01/2024 21:15:14;1704658514;44
07/01/2024 21:15:14;1704658514;47
07/01/2024 21:15:15;1704658515;46
07/01/2024 21:15:16;1704658516;45
07/01/2024 21:15:17;1704658517;46
07/01/2024 21:15:18;1704658518;45
07/01/2024 21:15:18;1704658518;46
07/01/2024 21:15:19;1704658519;45
07/01/2024 21:15:20;1704658520;45
07/01/2024 21:15:21;1704658521;43
07/01/2024 21:15:21;1704658521;49
07/01/2024 21:15:23;1704658523;45
07/01/2024 21:15:23;1704658523;40
07/01/2024 21:15:24;1704658524;42
07/01/2024 21:15:25;1704658525;46
07/01/2024 21:15:26;1704658526;46
07/01/2024 21:15:26;1704658526;44
07/01/2024 21:15:27;1704658527;43
07/01/2024 21:15:28;1704658528;44
07/01/2024 21:15:29;1704658529;41
07/01/2024 21:15:29;1704658529;43
07/01/2024 21:15:30;1704658530;48
07/01/2024 21:15:31;1704658531;46
07/01/2024 21:15:32;1704658532;44
07/01/2024 21:15:32;1704658532;45
07/01/2024 21:15:33;1704658533;42
07/01/2024 21:15:34;1704658534;43
07/01/2024 21:15:34;1704658534;44
07/01/2024 21:15:35;1704658535;44
07/01/2024 21:15:36;1704658536;46
07/01/2024 21:15:37;1704658537;45
07/01/2024 21:15:37;1704658537;47
07/01/2024 21:15:38;1704658538;45
07/01/2024 21:15:39;1704658539;47
07/01/2024 21:15:39;1704658539;46
07/01/2024 21:15:40;1704658540;42
07/01/2024 21:15:41;1704658541;41
07/01/2024 21:15:42;1704658542;44
07/01/2024 21:15:42;1704658542;45
07/01/2024 21:15:43;1704658543;44
07/01/2024 21:15:44;1704658544;42
07/01/2024 21:15:45;1704658545;44
07/01/2024 21:15:45;1704658545;40
07/01/2024 21:15:46;1704658546;48
07/01/2024 21:15:47;1704658547;42
07/01/2024 21:15:47;1704658547;44
07/01/2024 21:15:48;1704658548;41
07/01/2024 21:15:49;1704658549;49
07/01/2024 21:15:50;1704658550;44
07/01/2024 21:15:50;1704658550;45
07/01/2024 21:15:51;1704658551;43
07/01/2024 21:15:52;1704658552;49
07/01/2024 21:15:53;1704658553;48
07/01/2024 21:15:53;1704658553;44
07/01/2024 21:15:54;1704658554;42
07/01/2024 21:15:55;1704658555;44
07/01/2024 21:15:56;1704658556;44
07/01/2024 21:15:56;1704658556;45
07/01/2024 21:15:57;1704658557;46
07/01/2024 21:15:58;1704658558;48
07/01/2024 21:15:58;1704658558;46
07/01/2024 21:15:59;1704658559;44
07/01/2024 21:16:00;1704658560;45
07/01/2024 21:16:01;1704658561;49
07/01/2024 21:16:01;1704658561;47
07/01/2024 21:16:02;1704658562;46
07/01/2024 21:16:03;1704658563;46
07/01/2024 21:16:04;1704658564;41
07/01/2024 21:16:04;1704658564;45
07/01/2024 21:16:05;1704658565;45
07/01/2024 21:16:06;1704658566;45
07/01/2024 21:16:07;1704658567;43
07/01/2024 21:16:07;1704658567;43
