07/01/2024 22:14:54;1704662094;26419;13;3,004469
07/01/2024 22:14:54;1704662094;26464;1;5,485099
07/01/2024 22:14:55;1704662095;26516;1;2,482499
07/01/2024 22:14:56;1704662096;26564;1;9,483999
07/01/2024 22:14:57;1704662097;26611;1;1,984502
07/01/2024 22:14:58;1704662098;26657;1;4,484704
07/01/2024 22:14:58;1704662098;26704;1;5,984299
07/01/2024 22:14:59;1704662099;26749;1;8,484903
07/01/2024 22:15:00;1704662100;26797;1;5,984001
07/01/2024 22:15:00;1704662100;26844;1;7,484199
07/01/2024 22:15:01;1704662101;26890;1;5,985
07/01/2024 22:15:02;1704662102;26938;1;5,983903
07/01/2024 22:15:02;1704662102;26983;1;3,485005
07/01/2024 22:15:03;1704662103;27028;1;4,485
07/01/2024 22:15:04;1704662104;27076;1;2,483794
07/01/2024 22:15:04;1704662104;27120;1;10,4854
07/01/2024 22:15:05;1704662105;27165;1;6,484999
07/01/2024 22:15:06;1704662106;27211;1;10,4848
07/01/2024 22:15:06;1704662106;27260;1;6,483699
07/01/2024 22:15:07;1704662107;27310;1;5,483302
07/01/2024 22:15:08;1704662108;27357;1;-9,015804
07/01/2024 22:15:09;1704662109;27401;1;10,9853
07/01/2024 22:15:09;1704662109;27448;1;1,484589
07/01/2024 22:15:10;1704662110;27495;1;6,4842
07/01/2024 22:15:11;1704662111;27545;1;8,483207
07/01/2024 22:15:11;1704662111;27594;1;3,983894
07/01/2024 22:15:12;1704662112;27641;1;3,984205
07/01/2024 22:15:13;1704662113;27687;1;8,484803
07/01/2024 22:15:13;1704662113;27731;1;8,985304
07/01/2024 22:15:14;1704662114;27779;1;4,483802
07/01/2024 22:15:15;1704662115;27825;1;7,484902
07/01/2024 22:15:15;1704662115;27875;1;-0,01680565
07/01/2024 22:15:16;1704662116;27919;1;5,485304
07/01/2024 22:15:17;1704662117;27967;1;8,484002
07/01/2024 22:15:17;1704662117;28010;1;7,485799
07/01/2024 22:15:18;1704662118;28056;1;4,984504
07/01/2024 22:15:19;1704662119;28104;1;7,4841
07/01/2024 22:15:19;1704662119;28151;1;8,484401
07/01/2024 22:15:20;1704662120;28198;1;9,984406
07/01/2024 22:15:21;1704662121;28245;1;5,4841
07/01/2024 22:15:21;1704662121;28295;1;4,483403
07/01/2024 22:15:22;1704662122;28345;1;0,4831986
07/01/2024 22:15:23;1704662123;28389;1;5,985301
07/01/2024 22:15:23;1704662123;28432;1;6,485806
07/01/2024 22:15:24;1704662124;28479;1;5,984499
07/01/2024 22:15:25;1704662125;28530;1;2,482896
07/01/2024 22:15:25;1704662125;28577;1;5,484502
07/01/2024 22:15:26;1704662126;28620;1;9,485402
07/01/2024 22:15:27;1704662127;28665;1;7,4849
07/01/2024 22:15:28;1704662128;28709;1;4,9854
07/01/2024 22:15:28;1704662128;28758;1;4,483706
07/01/2024 22:15:29;1704662129;28804;1;6,984704
07/01/2024 22:15:30;1704662130;28856;1;-2,517314
07/01/2024 22:15:31;1704662131;28907;1;-4,51691
07/01/2024 22:15:31;1704662131;28954;1;6,484102
07/01/2024 22:15:32;1704662132;29001;1;2,984605
07/01/2024 22:15:33;1704662133;29046;1;6,484799
07/01/2024 22:15:33;1704662133;29091;1;5,9852
07/01/2024 22:15:34;1704662134;29135;1;5,985099
07/01/2024 22:15:35;1704662135;29186;1;-2,016718
07/01/2024 22:15:35;1704662135;29233;1;5,484198
07/01/2024 22:15:36;1704662136;29280;1;1,484191
07/01/2024 22:15:37;1704662137;29326;1;9,984802
07/01/2024 22:15:37;1704662137;29375;1;5,983805
07/01/2024 22:15:38;1704662138;29419;1;1,485194
07/01/2024 22:15:39;1704662139;29467;1;6,983804
07/01/2024 22:15:40;1704662140;29513;1;6,484999
07/01/2024 22:15:40;1704662140;29559;1;6,9845
07/01/2024 22:15:41;1704662141;29610;1;3,483099
07/01/2024 22:15:42;1704662142;29657;1;10,4843
07/01/2024 22:15:49;1704662149;29957;1;-484,0978
07/01/2024 22:15:50;1704662150;30005;1;5,484099
07/01/2024 22:15:50;1704662150;30052;1;6,484302
07/01/2024 22:15:51;1704662151;30098;1;1,484401
07/01/2024 22:15:52;1704662152;30146;1;7,984204
07/01/2024 22:15:52;1704662152;30191;1;7,984999
07/01/2024 22:15:53;1704662153;30239;1;-2,516217
07/01/2024 22:15:54;1704662154;30292;1;-3,017611
07/01/2024 22:15:55;1704662155;30339;1;3,484302
07/01/2024 22:15:56;1704662156;30387;1;2,984107
07/01/2024 22:15:56;1704662156;30433;1;4,984704
07/01/2024 22:15:57;1704662157;30478;1;0,4849844
07/01/2024 22:15:58;1704662158;30524;1;10,9847
07/01/2024 22:15:59;1704662159;30571;1;6,984202
07/01/2024 22:15:59;1704662159;30616;1;2,984904
07/01/2024 22:16:00;1704662160;30666;1;1,983394
07/01/2024 22:16:01;1704662161;30712;1;7,984604
07/01/2024 22:16:02;1704662162;30763;1;1,983298
07/01/2024 22:16:03;1704662163;30804;1;4,9861
07/01/2024 22:16:03;1704662163;30852;1;6,484202
07/01/2024 22:16:04;1704662164;30897;1;6,984999
07/01/2024 22:16:05;1704662165;30943;1;2,984505
07/01/2024 22:16:05;1704662165;30992;1;2,483805
07/01/2024 22:16:06;1704662166;31037;1;7,984799
07/01/2024 22:16:07;1704662167;31085;1;2,984004
07/01/2024 22:16:07;1704662167;31133;1;3,984
07/01/2024 22:16:08;1704662168;31181;1;9,48411
07/01/2024 22:16:09;1704662169;31224;1;9,485703
07/01/2024 22:16:10;1704662170;31273;1;9,483605
07/01/2024 22:16:10;1704662170;31322;1;7,9836
