07/01/2024 19:49:12;1704653352;33568;2;6,24155
07/01/2024 19:49:13;1704653353;33585;6;3,135516
07/01/2024 19:49:13;1704653353;33601;6;4,140784
07/01/2024 19:49:14;1704653354;33617;6;4,6467
07/01/2024 19:49:14;1704653354;33633;6;2,069598
07/01/2024 19:49:15;1704653355;33654;6;-0,8667197
07/01/2024 19:49:16;1704653356;33667;6;3,31
07/01/2024 19:49:16;1704653356;33686;6;1,986115
07/01/2024 19:49:17;1704653357;33701;6;4,974401
07/01/2024 19:49:17;1704653357;33717;6;4,561334
07/01/2024 19:49:18;1704653358;33731;6;3,813715
07/01/2024 19:49:18;1704653358;33745;6;1,647016
07/01/2024 19:49:19;1704653359;33763;6;0,8990655
07/01/2024 19:49:20;1704653360;33779;6;4,397851
07/01/2024 19:49:21;1704653361;33796;6;-2,010982
07/01/2024 19:49:21;1704653361;33812;6;3,812532
07/01/2024 19:49:22;1704653362;33833;6;3,646899
07/01/2024 19:49:22;1704653362;33846;6;4,7286
07/01/2024 19:49:23;1704653363;33860;6;2,811217
07/01/2024 19:49:23;1704653363;33875;6;4,06565
07/01/2024 19:49:24;1704653364;33889;6;5,96915
07/01/2024 19:49:24;1704653364;33904;6;3,9779
07/01/2024 19:49:25;1704653365;33923;6;4,218882
07/01/2024 19:49:25;1704653365;33936;6;3,800584
07/01/2024 19:49:27;1704653367;33957;6;-5,941584
07/01/2024 19:49:27;1704653367;33972;6;2,978251
07/01/2024 19:49:28;1704653368;33988;6;5,721183
07/01/2024 19:49:28;1704653368;34003;6;5,64595
07/01/2024 19:49:29;1704653369;34023;6;1,730799
07/01/2024 19:49:29;1704653369;34038;6;4,568034
07/01/2024 19:49:30;1704653370;34051;6;4,151617
07/01/2024 19:49:30;1704653370;34066;6;2,803715
07/01/2024 19:49:31;1704653371;34080;6;-0,2696179
07/01/2024 19:49:32;1704653372;34094;6;3,401299
07/01/2024 19:49:32;1704653372;34112;6;0,7303481
07/01/2024 19:49:33;1704653373;34129;6;5,069417
07/01/2024 19:49:33;1704653373;34145;6;5,7326
07/01/2024 19:49:34;1704653374;34164;6;3,476799
07/01/2024 19:49:35;1704653375;34179;6;2,986066
07/01/2024 19:49:35;1704653375;34194;6;3,484432
07/01/2024 19:49:36;1704653376;34209;6;4,64975
07/01/2024 19:49:36;1704653376;34222;6;4,976483
07/01/2024 19:49:37;1704653377;34239;6;3,31185
07/01/2024 19:49:37;1704653377;34253;6;4,734618
07/01/2024 19:49:38;1704653378;34269;6;4,8951
07/01/2024 19:49:38;1704653378;34283;6;4,394284
07/01/2024 19:49:39;1704653379;34296;6;5,563833
07/01/2024 19:49:39;1704653379;34311;6;3,566149
07/01/2024 19:49:40;1704653380;34324;6;5,646817
07/01/2024 19:49:40;1704653380;34340;6;2,395999
07/01/2024 19:49:41;1704653381;34356;6;4,482384
07/01/2024 19:49:41;1704653381;34373;6;4,6477
07/01/2024 19:49:42;1704653382;34389;6;3,898134
07/01/2024 19:49:42;1704653382;34403;6;4,983201
07/01/2024 19:49:43;1704653383;34420;6;2,394765
07/01/2024 19:49:43;1704653383;34440;6;4,483783
07/01/2024 19:49:44;1704653384;34458;6;0,6458982
07/01/2024 19:49:45;1704653385;34473;6;3,059301
07/01/2024 19:49:45;1704653385;34488;6;4,316984
07/01/2024 19:49:46;1704653386;34502;6;3,9006
07/01/2024 19:49:46;1704653386;34520;6;4,477701
07/01/2024 19:49:47;1704653387;34544;6;-0,4349478
07/01/2024 19:49:48;1704653388;34561;6;4,230983
07/01/2024 19:49:48;1704653388;34577;6;2,318398
07/01/2024 19:49:49;1704653389;34591;6;4,982983
07/01/2024 19:49:49;1704653389;34606;6;2,060599
07/01/2024 19:49:50;1704653390;34622;6;1,976632
07/01/2024 19:49:51;1704653391;34638;6;3,904601
07/01/2024 19:49:51;1704653391;34652;6;5,647817
07/01/2024 19:49:52;1704653392;34667;6;4,6465
07/01/2024 19:49:52;1704653392;34681;6;3,967683
07/01/2024 19:49:53;1704653393;34697;6;3,229999
07/01/2024 19:49:53;1704653393;34712;6;2,394282
07/01/2024 19:49:54;1704653394;34728;6;2,652516
07/01/2024 19:49:54;1704653394;34742;6;4,976468
07/01/2024 19:49:55;1704653395;34759;6;2,818249
07/01/2024 19:49:56;1704653396;34773;6;5,648983
07/01/2024 19:49:56;1704653396;34786;6;5,479833
07/01/2024 19:49:56;1704653396;34803;6;5,395
07/01/2024 19:49:57;1704653397;34821;6;2,228383
07/01/2024 19:49:58;1704653398;34835;6;3,232366
07/01/2024 19:49:58;1704653398;34851;6;3,070633
07/01/2024 19:49:59;1704653399;34865;6;5,0591
07/01/2024 19:49:59;1704653399;34878;6;5,149067
07/01/2024 19:50:00;1704653400;34896;6;0,5689496
07/01/2024 19:50:01;1704653401;34913;6;4,55115
07/01/2024 19:50:01;1704653401;34928;6;3,81745
07/01/2024 19:50:02;1704653402;34943;6;4,649734
07/01/2024 19:50:02;1704653402;34959;6;3,23155
07/01/2024 19:50:03;1704653403;34976;6;2,558949
07/01/2024 19:50:04;1704653404;34994;6;3,984315
07/01/2024 19:50:04;1704653404;35011;6;3,22045
07/01/2024 19:50:05;1704653405;35027;6;3,062849
07/01/2024 19:50:05;1704653405;35045;6;5,48185
07/01/2024 19:50:06;1704653406;35061;6;3,400234
07/01/2024 19:50:06;1704653406;35075;6;4,985867
07/01/2024 19:50:07;1704653407;35090;6;4,814283
07/01/2024 19:50:07;1704653407;35104;6;4,652317
07/01/2024 19:50:08;1704653408;35120;6;3,470866
07/01/2024 19:50:09;1704653409;35136;6;3,72925
