07/01/2024 19:24:42;1704651882;29
07/01/2024 19:24:44;1704651884;77
07/01/2024 19:24:46;1704651886;78
07/01/2024 19:24:47;1704651887;75
07/01/2024 19:24:49;1704651889;80
07/01/2024 19:24:50;1704651890;73
07/01/2024 19:24:52;1704651892;71
07/01/2024 19:24:54;1704651894;79
07/01/2024 19:24:55;1704651895;74
07/01/2024 19:24:57;1704651897;73
07/01/2024 19:24:59;1704651899;75
07/01/2024 19:25:00;1704651900;76
07/01/2024 19:25:02;1704651902;77
07/01/2024 19:25:04;1704651904;75
07/01/2024 19:25:05;1704651905;72
07/01/2024 19:25:07;1704651907;78
07/01/2024 19:25:08;1704651908;77
07/01/2024 19:25:10;1704651910;75
07/01/2024 19:25:12;1704651912;73
07/01/2024 19:25:13;1704651913;76
07/01/2024 19:25:15;1704651915;75
07/01/2024 19:25:17;1704651917;83
07/01/2024 19:25:18;1704651918;75
07/01/2024 19:25:20;1704651920;74
07/01/2024 19:25:21;1704651921;75
07/01/2024 19:25:23;1704651923;83
07/01/2024 19:25:25;1704651925;77
07/01/2024 19:25:26;1704651926;73
07/01/2024 19:25:28;1704651928;73
07/01/2024 19:25:30;1704651930;75
07/01/2024 19:25:31;1704651931;76
07/01/2024 19:25:33;1704651933;76
07/01/2024 19:25:34;1704651934;74
07/01/2024 19:25:36;1704651936;76
07/01/2024 19:25:38;1704651938;77
07/01/2024 19:25:39;1704651939;77
07/01/2024 19:25:41;1704651941;77
07/01/2024 19:25:43;1704651943;77
07/01/2024 19:25:45;1704651945;78
07/01/2024 19:25:46;1704651946;80
07/01/2024 19:25:48;1704651948;77
07/01/2024 19:25:49;1704651949;73
07/01/2024 19:25:51;1704651951;77
07/01/2024 19:25:53;1704651953;76
07/01/2024 19:25:54;1704651954;73
07/01/2024 19:25:56;1704651956;78
07/01/2024 19:25:58;1704651958;72
07/01/2024 19:26:00;1704651960;79
07/01/2024 19:26:01;1704651961;73
07/01/2024 19:26:03;1704651963;73
07/01/2024 19:26:05;1704651965;82
07/01/2024 19:26:06;1704651966;75
07/01/2024 19:26:08;1704651968;77
07/01/2024 19:26:10;1704651970;74
07/01/2024 19:26:11;1704651971;75
07/01/2024 19:26:13;1704651973;75
07/01/2024 19:26:15;1704651975;75
07/01/2024 19:26:16;1704651976;75
07/01/2024 19:26:18;1704651978;74
07/01/2024 19:26:19;1704651979;72
07/01/2024 19:26:21;1704651981;76
07/01/2024 19:26:23;1704651983;74
07/01/2024 19:26:24;1704651984;73
07/01/2024 19:26:26;1704651986;77
07/01/2024 19:26:27;1704651987;75
07/01/2024 19:26:29;1704651989;77
07/01/2024 19:26:31;1704651991;79
07/01/2024 19:26:32;1704651992;78
07/01/2024 19:26:34;1704651994;73
07/01/2024 19:26:35;1704651995;73
07/01/2024 19:26:37;1704651997;75
07/01/2024 19:26:39;1704651999;83
07/01/2024 19:26:40;1704652000;77
07/01/2024 19:26:42;1704652002;72
07/01/2024 19:26:44;1704652004;76
07/01/2024 19:26:45;1704652005;78
07/01/2024 19:26:47;1704652007;74
07/01/2024 19:26:49;1704652009;78
07/01/2024 19:26:50;1704652010;76
07/01/2024 19:26:52;1704652012;74
07/01/2024 19:26:54;1704652014;76
07/01/2024 19:26:55;1704652015;79
07/01/2024 19:26:57;1704652017;79
07/01/2024 19:26:59;1704652019;85
07/01/2024 19:27:00;1704652020;77
07/01/2024 19:27:02;1704652022;77
07/01/2024 19:27:04;1704652024;76
07/01/2024 19:27:05;1704652025;76
07/01/2024 19:27:07;1704652027;74
07/01/2024 19:27:08;1704652028;76
07/01/2024 19:27:10;1704652030;75
07/01/2024 19:27:12;1704652032;77
07/01/2024 19:27:13;1704652033;76
07/01/2024 19:27:15;1704652035;74
07/01/2024 19:27:16;1704652036;79
07/01/2024 19:27:18;1704652038;78
07/01/2024 19:27:19;1704652039;78
07/01/2024 19:27:21;1704652041;75
07/01/2024 19:27:23;1704652043;75
07/01/2024 19:27:25;1704652045;75
