Wall time,Step,Value
1702402073.408111,6000,22.124025344848633
1702402084.8218524,11000,27.476192474365234
1702402096.1313179,16000,21.029254913330078
1702402107.2973814,21000,24.274431228637695
1702402117.9612339,26000,12.70301342010498
1702402129.69949,31000,7.6624040603637695
1702402141.346755,36000,9.159396171569824
1702402153.8160346,42000,6.603299140930176
1702402164.487205,47000,10.107779502868652
1702402176.5620441,52000,10.141956329345703
1702402188.0594056,57000,4.459542274475098
1702402199.6059222,62000,4.291644096374512
1702402211.690594,68000,3.176036834716797
1702402222.5943286,73000,2.085402727127075
1702402233.5504832,78000,2.1089088916778564
1702402244.4134939,83000,1.6859278678894043
1702402255.4932096,88000,2.7921266555786133
1702402266.721636,93000,1.479705810546875
1702402278.6143384,99000,1.0415167808532715
1702402289.462818,104000,0.8846614360809326
1702402300.545319,109000,0.6637997627258301
1702402312.4039872,114000,6.399562358856201
1702402324.1526313,119000,6.03054666519165
1702402336.6834016,125000,5.491537570953369
1702402348.1925309,130000,3.9692556858062744
1702402359.5647926,135000,3.104386806488037
1702402371.1339364,140000,1.788345456123352
1702402382.621497,145000,2.1902594566345215
1702402394.255583,150000,1.9251093864440918
1702402406.1844888,155000,1.5520528554916382
1702402418.2922592,161000,1.1195032596588135
1702402429.7864954,166000,1.698363184928894
1702402440.988857,171000,0.9667350649833679
1702402452.4615107,176000,1.0525782108306885
1702402463.86923,181000,0.7882916927337646
1702402475.8331306,186000,0.8441837430000305
1702402486.9595263,191000,0.5912487506866455
1702402499.5951447,197000,1.1898901462554932
1702402507.9636254,202000,8.346571922302246
1702402515.775133,207000,8.61977481842041
1702402523.7643774,212000,10.975221633911133
1702402533.0406182,218000,17.427764892578125
1702402541.036121,223000,13.19786262512207
1702402550.0844805,228000,17.56259536743164
1702402558.558781,233000,22.584959030151367
1702402567.3162453,238000,17.06679344177246
1702402575.8192046,244000,15.746222496032715
1702402584.2435215,249000,11.534517288208008
1702402592.7086005,254000,10.812005996704102
1702402600.8432372,259000,13.020380973815918
1702402609.476582,264000,4.336238861083984
1702402617.7045982,269000,8.347806930541992
1702402626.15634,274000,5.173335552215576
1702402634.6801393,280000,4.938303470611572
1702402642.4324286,285000,4.662248134613037
1702402650.7330673,290000,9.335226058959961
1702402658.7262576,295000,3.523881196975708
1702402667.1885207,300000,3.47074031829834
1702402675.3440373,306000,1.968835473060608
1702402683.6170425,311000,0.463053435087204
1702402691.9674265,316000,5.371841907501221
1702402701.9108465,321000,6.740413665771484
1702402712.5111024,327000,7.939321517944336
1702402722.06247,332000,6.956324100494385
1702402731.6255565,337000,9.40948486328125
1702402741.1168554,342000,6.166665554046631
1702402751.3293383,347000,11.864161491394043
1702402760.3668725,352000,6.882675647735596
1702402770.5731962,358000,5.421309471130371
1702402779.5771873,363000,3.6360652446746826
1702402788.7959657,368000,3.183401107788086
1702402798.4338517,373000,2.392284631729126
1702402807.3020601,378000,2.3610692024230957
1702402816.702911,383000,1.4537932872772217
1702402826.20199,389000,1.2862584590911865
1702402835.2813282,394000,2.9714930057525635
1702402844.3192275,399000,1.8070884943008423
1702402853.5263596,404000,2.1792988777160645
1702402861.2069771,409000,1.3181089162826538
1702402868.6015415,414000,1.157579779624939
1702402877.46558,420000,1.0676286220550537
1702402885.7539146,425000,0.781944215297699
1702402894.0691898,430000,0.7631977200508118
1702402902.4160736,435000,0.6119154691696167
1702402910.5726657,440000,0.9440105557441711
1702402918.6879215,445000,0.7299372553825378
1702402926.8557324,450000,0.6714149117469788
1702402935.9999902,456000,0.6168278455734253
1702402944.0230358,461000,0.6620262861251831
1702402952.0797079,466000,0.37532028555870056
1702402960.0065198,471000,0.41201263666152954
1702402968.48084,476000,0.4293728470802307
1702402976.5231864,481000,0.46316251158714294
1702402984.4159691,486000,0.19986794888973236
1702402992.6095936,491000,0.24368776381015778
1702403000.8170688,497000,2.9402079582214355
1702403010.8061087,502000,2.7587831020355225
1702403019.3754437,508000,14.08048152923584
1702403027.7238128,513000,13.638582229614258
1702403036.3392203,518000,14.731375694274902
1702403045.7822108,524000,16.931394577026367
1702403054.0798671,529000,16.05056381225586
1702403062.2340887,534000,13.34964370727539
1702403070.8905287,539000,24.66839599609375
1702403079.1484592,545000,16.351327896118164
1702403086.9261818,550000,38.7864990234375
1702403096.2420232,555000,23.40065574645996
1702403105.2163959,560000,26.34671401977539
1702403113.0713594,566000,20.917158126831055
1702403122.2012625,572000,23.704845428466797
1702403129.7445934,577000,11.490007400512695
1702403138.122208,582000,52.91083526611328
1702403146.7316723,587000,42.92809295654297
1702403155.5299745,593000,41.09225845336914
1702403163.7971342,598000,42.93910217285156
1702403172.7624693,603000,27.659727096557617
1702403182.5589964,609000,20.201810836791992
1702403190.584262,614000,24.772504806518555
1702403199.1270447,619000,29.415618896484375
1702403208.519128,625000,52.06981658935547
1702403216.4398482,630000,19.220500946044922
1702403224.8821166,635000,24.515811920166016
1702403233.3972387,640000,52.0402717590332
1702403242.033337,645000,47.32914733886719
1702403251.1082497,651000,52.59523391723633
1702403259.1737673,656000,19.863353729248047
1702403267.2840443,661000,23.875032424926758
1702403275.391692,666000,37.05713653564453
1702403283.7729285,671000,48.230716705322266
1702403292.5857966,677000,28.256803512573242
1702403301.696105,682000,31.335784912109375
1702403309.1046293,687000,20.548810958862305
1702403317.121991,692000,19.899370193481445
1702403325.2454796,697000,17.667739868164062
1702403335.5332847,703000,14.24547290802002
1702403343.3641984,708000,39.779869079589844
1702403351.5602274,713000,22.39933967590332
1702403359.373499,718000,10.028658866882324
1702403369.162815,724000,11.825823783874512
1702403376.996028,729000,10.821493148803711
1702403385.184394,734000,17.01203727722168
1702403393.032065,739000,23.526212692260742
1702403402.0378268,745000,9.555542945861816
1702403410.456895,750000,7.196590423583984
1702403418.4071245,755000,15.221665382385254
1702403427.3117712,760000,8.756543159484863
1702403436.220555,766000,10.334651947021484
1702403445.0991147,771000,11.751837730407715
1702403452.4958146,776000,12.8260498046875
1702403460.6788764,781000,8.2802095413208
1702403469.850411,786000,9.275894165039062
1702403478.16323,792000,7.644774436950684
1702403486.35703,797000,13.068597793579102
1702403495.051762,802000,15.48398494720459
1702403503.5918775,807000,12.69309139251709
1702403513.0455022,813000,12.344403266906738
1702403520.3990757,818000,20.04164695739746
1702403528.7587,823000,13.995573043823242
1702403537.236921,828000,16.151716232299805
1702403545.6267464,833000,12.639411926269531
1702403553.2033885,838000,15.233721733093262
1702403562.9864807,844000,14.687271118164062
1702403571.5864909,849000,13.040098190307617
1702403579.7451718,854000,22.731048583984375
1702403587.9109137,859000,29.042699813842773
1702403596.306409,865000,21.651988983154297
1702403604.941769,870000,21.699108123779297
1702403613.1609714,875000,8.761124610900879
1702403621.5339036,880000,10.058337211608887
1702403629.540118,885000,12.173969268798828
1702403638.8962946,891000,16.221981048583984
1702403646.7901962,896000,9.895421028137207
1702403655.1441903,901000,9.43918228149414
1702403663.368065,906000,36.74573516845703
1702403672.236157,911000,7.141319274902344
1702403680.3440783,916000,24.161985397338867
1702403689.6379323,922000,11.907181739807129
1702403697.4917786,927000,11.297247886657715
1702403706.3508096,932000,20.458131790161133
1702403713.8071592,937000,24.12618637084961
1702403721.9165335,942000,11.521486282348633
1702403730.1538222,947000,12.886438369750977
1702403739.5418544,953000,10.265897750854492
1702403748.119927,958000,12.992583274841309
1702403755.9618664,963000,10.952878952026367
1702403763.9864202,968000,5.439504623413086
1702403772.9344485,974000,10.82148551940918
1702403780.5139701,979000,9.092470169067383
1702403789.5986354,984000,10.141401290893555
1702403797.6936998,989000,8.034525871276855
1702403805.7369013,994000,8.419631004333496
1702403814.6054027,999000,8.743148803710938
1702403822.0552526,1004000,24.9228515625
1702403830.4433582,1010000,5.625420093536377
1702403839.0266178,1015000,6.534729480743408
1702403847.1470706,1020000,9.100703239440918
1702403855.1143522,1025000,5.042428970336914
1702403863.853138,1030000,4.876589775085449
1702403872.143755,1035000,4.769327640533447
1702403880.421325,1041000,4.146124362945557
1702403887.7788115,1046000,5.145761966705322
1702403896.60433,1051000,6.171859264373779
1702403904.5491827,1056000,6.09676456451416
1702403913.6807466,1062000,5.385598659515381
1702403921.8149018,1067000,4.146016597747803
1702403930.3691387,1072000,5.734291076660156
1702403938.3716946,1077000,6.082498550415039
1702403947.1422153,1082000,5.045775413513184
1702403955.5773253,1087000,5.485045909881592
1702403963.89887,1092000,7.881734371185303
1702403972.5034857,1098000,4.3860602378845215
1702403980.2700613,1103000,7.403541088104248
1702403989.0397143,1108000,6.247220993041992
1702403997.4853258,1113000,5.8474273681640625
1702404005.1401255,1118000,8.122897148132324
1702404014.5489392,1124000,4.352165699005127
1702404022.5074027,1129000,5.477269172668457
1702404030.5547574,1134000,6.273281097412109
1702404039.7484293,1139000,4.941384315490723
1702404047.213536,1144000,7.531318187713623
1702404054.9110954,1149000,7.816194534301758
1702404064.1625361,1155000,5.583558082580566
1702404071.888686,1160000,4.089347839355469
1702404080.558639,1165000,3.7414679527282715
1702404088.8208902,1170000,5.263909816741943
1702404097.4640503,1175000,3.906890392303467
1702404105.606269,1180000,5.138666152954102
1702404113.6794343,1186000,3.908090829849243
1702404122.0294704,1191000,4.532773971557617
1702404129.9214134,1196000,3.581744909286499
1702404138.743348,1201000,3.689751625061035
1702404146.3256102,1206000,4.969668865203857
1702404154.8722973,1212000,4.2723822593688965
1702404162.8683465,1217000,3.1860880851745605
1702404171.4494789,1222000,2.560840129852295
1702404179.0263374,1227000,4.374028205871582
1702404186.7094014,1232000,3.639017105102539
1702404195.570828,1237000,2.874079704284668
1702404203.3285842,1242000,2.5614120960235596
1702404212.245277,1248000,2.5269641876220703
1702404219.8972473,1253000,2.5276949405670166
1702404228.565572,1258000,2.5298142433166504
1702404236.4144914,1263000,2.6480512619018555
1702404245.1036503,1268000,2.706484317779541
1702404252.8228164,1273000,3.4030256271362305
1702404260.9597058,1278000,3.3225722312927246
1702404269.8631518,1284000,2.559469223022461
1702404277.3740733,1289000,2.5018582344055176
1702404285.5593314,1294000,2.962681531906128
1702404293.6278698,1299000,3.3042092323303223
1702404302.0660334,1304000,1.8680304288864136
1702404309.9383793,1309000,1.9803364276885986
1702404317.5336106,1314000,3.1634418964385986
1702404326.5405278,1320000,2.8051834106445312
1702404334.839614,1325000,3.0735085010528564
1702404342.6217134,1330000,1.9857463836669922
1702404351.0050743,1335000,1.7340006828308105
1702404358.705929,1340000,1.5015543699264526
1702404366.9145346,1345000,2.1927359104156494
1702404375.3820992,1350000,1.4908472299575806
1702404383.585068,1356000,0.7948570251464844
1702404391.6009092,1361000,2.2900242805480957
1702404399.9845304,1366000,4.9036784172058105
1702404407.6905735,1371000,4.314039707183838
1702404416.023307,1376000,3.4326210021972656
1702404424.6597538,1381000,2.9018845558166504
1702404433.060754,1387000,2.5520284175872803
1702404440.6184666,1392000,2.5465619564056396
1702404449.1171832,1397000,3.171823501586914
1702404457.0797176,1402000,1.601324439048767
1702404464.950717,1407000,3.6823604106903076
1702404473.4420075,1412000,2.451079845428467
1702404481.7311664,1417000,2.3292431831359863
1702404489.5761342,1422000,2.9365787506103516
1702404498.1173048,1428000,2.800288200378418
1702404505.4860227,1433000,2.500459909439087
1702404513.6797228,1438000,2.313197612762451
1702404522.4687598,1443000,2.7187612056732178
1702404530.4270554,1448000,1.7079241275787354
1702404538.2325203,1453000,3.3581998348236084
1702404546.972505,1459000,1.1660337448120117
1702404554.8010657,1464000,2.4339847564697266
1702404562.9758108,1469000,2.7152109146118164
1702404571.2896028,1474000,2.5738894939422607
1702404579.781477,1479000,3.1558210849761963
1702404587.428173,1484000,6.596205234527588
1702404595.3182945,1489000,7.494753837585449
1702404604.3642538,1495000,4.90757417678833
1702404613.3373532,1500000,3.267659902572632
1702404621.3425055,1505000,2.9005208015441895
1702404629.1802893,1510000,1.8821911811828613
1702404638.0366797,1515000,2.550187349319458
1702404646.5144756,1521000,3.4633426666259766
1702404654.4346125,1526000,2.640211582183838
1702404662.467202,1531000,4.33768367767334
1702404671.0756118,1536000,4.6513776779174805
1702404678.5375319,1541000,3.829099178314209
1702404687.7592745,1547000,6.969130992889404
1702404695.676543,1552000,8.800569534301758
1702404703.8003078,1557000,8.351363182067871
1702404711.987991,1562000,8.641021728515625
1702404720.5804515,1567000,6.908984184265137
1702404729.4211526,1573000,5.587269306182861
1702404737.3326309,1578000,6.51176118850708
1702404745.135178,1583000,7.455521583557129
1702404753.1940234,1588000,6.29553747177124
1702404762.4104683,1593000,8.131743431091309
1702404770.4290955,1598000,13.665574073791504
1702404778.778421,1604000,7.385044097900391
1702404787.0503492,1609000,6.185704708099365
1702404794.9123073,1614000,6.069736480712891
1702404802.5882537,1619000,8.969805717468262
1702404811.8206692,1624000,11.323589324951172
1702404818.9511087,1629000,12.836138725280762
1702404828.639484,1635000,12.337128639221191
1702404836.5233257,1640000,7.840127468109131
1702404845.1120515,1645000,9.000758171081543
1702404854.6632273,1650000,7.948398113250732
1702404863.329948,1655000,7.909974098205566
1702404871.5994341,1660000,6.871311187744141
1702404880.62415,1666000,9.951969146728516
1702404888.804077,1671000,21.046724319458008
1702404896.9012456,1676000,7.083539009094238
1702404905.0162635,1681000,8.688822746276855
1702404914.130122,1686000,4.874110698699951
1702404922.061894,1691000,25.683082580566406
1702404930.7205617,1697000,10.248495101928711
1702404938.3120506,1702000,14.683320045471191
1702404947.1507351,1707000,6.8591766357421875
1702404955.0191014,1712000,7.603663444519043
1702404963.0494373,1717000,5.747487545013428
1702404971.8323796,1722000,3.811063289642334
1702404979.4781573,1728000,4.508987903594971
1702404987.9201827,1733000,2.180840253829956
1702404995.8129358,1738000,3.1887896060943604
1702405003.7293181,1743000,3.741689443588257
1702405012.1952155,1748000,4.817790508270264
1702405019.9600506,1753000,8.420113563537598
1702405028.4792821,1758000,9.250408172607422
1702405037.3406186,1764000,9.92354965209961
1702405045.544353,1769000,21.293304443359375
1702405054.0290403,1774000,9.507431030273438
1702405061.7052543,1779000,7.996937274932861
1702405069.3391862,1784000,7.6021928787231445
1702405078.4732835,1789000,7.896610260009766
1702405086.8778117,1795000,9.954280853271484
1702405094.8429494,1800000,7.090691089630127
1702405103.7835095,1805000,8.244553565979004
1702405112.0850508,1810000,5.994493007659912
1702405119.828042,1815000,4.885604381561279
1702405128.8149965,1821000,7.343047142028809
1702405136.9541607,1826000,7.947930812835693
1702405145.253145,1831000,24.023107528686523
1702405153.1941326,1836000,13.45392894744873
1702405161.7749841,1841000,4.701044082641602
1702405169.9151602,1846000,4.154506683349609
1702405177.935201,1851000,6.689036846160889
1702405186.8939996,1857000,4.655947208404541
1702405194.5948672,1862000,2.7369143962860107
1702405202.927268,1867000,2.5345258712768555
1702405211.306279,1872000,3.0341975688934326
1702405218.9129925,1877000,2.7783892154693604
1702405227.3081443,1882000,1.93156898021698
1702405235.502349,1887000,3.4068164825439453
1702405244.0380473,1893000,3.5392160415649414
1702405251.4430976,1898000,3.9826948642730713
1702405260.460115,1903000,2.7891225814819336
1702405268.4042199,1908000,2.2996411323547363
1702405276.8592174,1913000,2.2333080768585205
1702405285.0866532,1918000,1.445872187614441
1702405292.5679698,1923000,2.332298755645752
1702405301.5977323,1929000,1.7546876668930054
1702405309.0971117,1934000,2.7946372032165527
1702405317.8837914,1939000,2.050318717956543
1702405325.3622246,1944000,1.2867907285690308
1702405333.8421748,1949000,1.3716377019882202
1702405341.2553763,1954000,0.9154418110847473
1702405349.0551417,1959000,1.809541940689087
1702405358.1817856,1965000,2.378016471862793
1702405365.5510733,1970000,1.1724433898925781
1702405373.936794,1975000,0.7867319583892822
1702405381.9593017,1980000,1.2880845069885254
1702405389.9452648,1985000,1.1985511779785156
1702405398.1728091,1990000,0.9517537951469421
1702405406.788293,1995000,1.8031126260757446
1702405415.105082,2001000,1.8031874895095825
1702405423.023759,2006000,1.5553476810455322
1702405430.8497431,2011000,1.6012884378433228
1702405439.0668104,2016000,1.8772807121276855
1702405447.1727161,2021000,1.5262070894241333
1702405455.1575413,2026000,1.735011339187622
1702405463.8701036,2032000,2.141049861907959
1702405471.7119918,2037000,5.818101406097412
1702405479.688006,2042000,6.651389122009277
1702405488.3432865,2047000,5.772806167602539
1702405496.5876255,2052000,9.945625305175781
1702405504.92051,2057000,9.82266902923584
1702405513.0111017,2062000,6.266515254974365
1702405521.8192976,2068000,7.004432201385498
1702405529.2675443,2073000,9.07324504852295
1702405537.2918067,2078000,5.938507556915283
1702405545.344199,2083000,10.69465160369873
1702405554.1667817,2088000,6.401970386505127
1702405562.0849657,2093000,2.7896921634674072
1702405570.7139218,2099000,8.163187980651855
1702405578.4939492,2104000,24.615108489990234
1702405586.6580074,2109000,5.092056751251221
1702405594.659737,2114000,1.2219858169555664
1702405602.3169281,2119000,1.1550511121749878
1702405610.621118,2124000,1.3309011459350586
1702405618.5071692,2129000,5.264389514923096
1702405627.0451667,2135000,3.0173444747924805
1702405634.7750916,2140000,1.9215641021728516
1702405643.5017838,2145000,0.9813434481620789
1702405651.2459567,2150000,1.659678339958191
1702405659.3626359,2155000,1.7339187860488892
1702405667.5487194,2161000,1.6788933277130127
1702405675.490908,2166000,2.0533838272094727
1702405683.5598488,2171000,0.7846891283988953
1702405691.7509122,2176000,1.0057623386383057
1702405698.9037676,2181000,1.4143038988113403
1702405707.4672318,2186000,3.326251983642578
1702405716.3180668,2192000,1.8369181156158447
1702405724.2780793,2197000,2.2067477703094482
1702405732.389793,2202000,2.082007884979248
1702405740.5547924,2207000,2.107254981994629
1702405748.6336455,2212000,1.486952543258667
1702405756.5608315,2217000,1.7688473463058472
1702405765.0506647,2223000,2.0299391746520996
1702405777.5594356,2228000,2.483050584793091
1702405797.905233,2233000,1.7529995441436768
1702405818.2615178,2238000,1.2092182636260986
1702405838.496564,2243000,1.0853296518325806
1702405858.4095628,2248000,1.2601990699768066
1702405879.161,2253000,1.1922389268875122
1702405897.5096807,2259000,1.7788746356964111
1702405905.973096,2264000,1.5980455875396729
1702405913.8404746,2269000,1.29484224319458
1702405921.2285147,2274000,1.8933144807815552
1702405929.7752569,2279000,0.9379451870918274
1702405937.1094964,2284000,1.7340354919433594
1702405944.7655315,2289000,1.1528513431549072
1702405953.384463,2295000,1.4652137756347656
1702405961.0098326,2300000,1.9732367992401123
1702405969.1837678,2305000,1.530867099761963
1702405977.0683615,2310000,1.4408749341964722
1702405984.508858,2315000,1.0093241930007935
1702405992.632721,2320000,1.8083082437515259
1702406000.979909,2326000,1.4716800451278687
1702406009.002828,2331000,0.8256104588508606
1702406016.602206,2336000,1.2734267711639404
1702406025.0416749,2341000,1.1277889013290405
1702406032.5789156,2346000,0.9999929666519165
1702406040.2798378,2351000,2.0160694122314453
1702406048.7206368,2357000,1.463100790977478
1702406056.7359946,2362000,0.6734583377838135
1702406064.7921,2367000,1.6285477876663208
1702406073.0650496,2372000,1.419912338256836
1702406081.0266707,2377000,1.1621743440628052
1702406089.21958,2382000,0.8107895255088806
1702406097.5850196,2387000,0.7162067294120789
1702406105.406018,2393000,0.9797319173812866
1702406113.6295145,2398000,0.7380262613296509
1702406121.5059462,2403000,0.6474276185035706
1702406129.1219633,2408000,0.77460116147995
1702406137.447209,2413000,0.716579794883728
1702406145.6638575,2419000,1.3967424631118774
1702406153.5117872,2424000,1.0472922325134277
1702406161.908774,2429000,1.151573896408081
1702406169.678394,2434000,0.7696285843849182
1702406177.7203832,2439000,1.2459397315979004
1702406185.4903872,2444000,1.2024670839309692
1702406193.9809618,2450000,1.7576336860656738
1702406202.0122814,2455000,1.060938835144043
1702406209.7064881,2460000,1.4558275938034058
1702406217.86042,2465000,0.943804144859314
1702406225.7313447,2470000,1.313374400138855
1702406233.993223,2475000,1.195514440536499
1702406241.9899223,2480000,2.198391914367676
1702406250.0487962,2486000,1.5994232892990112
1702406257.927663,2491000,1.1006640195846558
1702406265.5656362,2496000,1.025805115699768
1702406273.883814,2501000,1.802968144416809
1702406281.897317,2506000,0.9080595970153809
1702406290.192486,2511000,0.9496743679046631
1702406297.8334,2517000,0.905228316783905
1702406306.1338823,2522000,0.5913406610488892
1702406313.897504,2527000,3.3279335498809814
1702406322.0755446,2532000,2.9030802249908447
1702406330.4386656,2537000,4.628650665283203
1702406338.7515168,2542000,1.9997148513793945
1702406347.1825986,2547000,2.2057197093963623
1702406355.1906903,2553000,2.699613571166992
1702406362.9912739,2558000,3.507066488265991
1702406370.8725746,2563000,1.4853285551071167
1702406379.1316,2568000,10.6351900100708
1702406387.4587567,2573000,1.5335781574249268
1702406394.827599,2578000,2.448364734649658
1702406403.2246861,2584000,1.4992496967315674
1702406410.7275748,2589000,2.139263153076172
1702406418.6513994,2594000,0.7892178297042847
1702406426.4255507,2599000,0.8867695331573486
1702406434.5228963,2604000,0.8090507388114929
1702406442.765276,2610000,0.9868299961090088
1702406450.8626013,2615000,1.126082420349121
1702406458.781441,2620000,2.30485200881958
1702406466.8936493,2625000,1.2657134532928467
1702406474.830448,2630000,1.0026938915252686
1702406482.9246838,2635000,1.156969666481018
1702406490.905478,2641000,0.9326867461204529
1702406498.8136194,2646000,3.7139620780944824
1702406506.6134322,2651000,1.478856086730957
1702406514.3936474,2656000,0.8679662942886353
1702406522.5619178,2661000,2.064225196838379
1702406530.7178338,2666000,3.1721644401550293
1702406538.89042,2672000,2.5324649810791016
1702406546.6754024,2677000,1.3889622688293457
1702406554.7494588,2682000,1.0909427404403687
1702406562.8807704,2687000,1.181997537612915
1702406570.8966813,2692000,0.745956301689148
1702406578.9584632,2697000,0.8192044496536255
1702406586.9333694,2702000,0.8162819147109985
1702406594.8545825,2708000,1.121314287185669
1702406602.5235262,2713000,0.9691670536994934
1702406610.5145433,2718000,0.5438995361328125
1702406618.0349185,2723000,1.212997317314148
1702406626.1486895,2728000,0.6121532917022705
1702406633.7476795,2733000,0.5472389459609985
1702406641.6592064,2738000,0.9139016270637512
1702406649.5388508,2744000,0.664589524269104
1702406657.6182091,2749000,0.6498082876205444
1702406665.6613672,2754000,0.6981939077377319
1702406673.6723344,2759000,1.2834566831588745
1702406682.493693,2764000,1.5580015182495117
1702406691.7627234,2770000,1.420725703239441
1702406699.9643216,2775000,1.0272217988967896
1702406708.4133918,2780000,0.7464884519577026
1702406717.2819648,2785000,0.9071124792098999
1702406726.3044224,2790000,0.9509274959564209
1702406734.666755,2795000,0.9059513807296753
1702406743.7675817,2801000,1.0765384435653687
1702406752.3162885,2806000,1.7444047927856445
1702406761.2986727,2811000,1.29845130443573
1702406769.8592772,2816000,2.2437758445739746
1702406778.8795638,2821000,1.0985782146453857
1702406787.4192266,2826000,1.2575784921646118
1702406796.7190907,2832000,1.6801669597625732
1702406805.2313876,2837000,0.6226528882980347
1702406813.658986,2842000,1.1947022676467896
1702406828.1870177,2847000,1.2692103385925293
1702406848.7554517,2852000,0.6772065758705139
1702406868.4813957,2857000,0.5336229205131531
1702406889.124959,2862000,0.6772400736808777
1702406911.5196772,2868000,0.5630583167076111
1702406931.7146018,2873000,0.3469793498516083
1702406951.7311826,2878000,0.30988141894340515
1702406971.6951172,2883000,0.3040420711040497
1702406991.417113,2888000,0.24059227108955383
1702407011.5762653,2893000,0.2458237260580063
1702407034.4333603,2899000,0.21297556161880493
