[api-updater (non-obsolete-error-filter)] 04/06/2023 19:32:24 : Starting C:/Program Files/Unity/Hub/Editor/2020.3.42f1/Editor/Data/Tools/ScriptUpdater/APIUpdater.NonObsoleteApiUpdaterDetector.exe
[api-updater (non-obsolete-error-filter)] 
----------------------------------
jit/startup time      : 2770,1389ms
moved types parse time: 46ms
candidates parse time : 1ms
C# parse time         : 211ms
candidates check time : 59ms
console write time    : 0ms

[api-updater (non-obsolete-error-filter)] 07/08/2023 18:14:49 : Starting C:/Program Files/Unity/Hub/Editor/2020.3.42f1/Editor/Data/Tools/ScriptUpdater/APIUpdater.NonObsoleteApiUpdaterDetector.exe
[api-updater (non-obsolete-error-filter)] 
----------------------------------
jit/startup time      : 972,4675ms
moved types parse time: 46ms
candidates parse time : 0ms
C# parse time         : 182ms
candidates check time : 35ms
console write time    : 0ms

[api-updater (non-obsolete-error-filter)] 07/08/2023 19:12:45 : Starting C:/Program Files/Unity/Hub/Editor/2020.3.42f1/Editor/Data/Tools/ScriptUpdater/APIUpdater.NonObsoleteApiUpdaterDetector.exe
[api-updater (non-obsolete-error-filter)] 
----------------------------------
jit/startup time      : 95,2514ms
moved types parse time: 41ms
candidates parse time : 1ms
C# parse time         : 146ms
candidates check time : 35ms
console write time    : 0ms

[api-updater (non-obsolete-error-filter)] 07/08/2023 19:13:08 : Starting C:/Program Files/Unity/Hub/Editor/2020.3.42f1/Editor/Data/Tools/ScriptUpdater/APIUpdater.NonObsoleteApiUpdaterDetector.exe
[api-updater (non-obsolete-error-filter)] 
----------------------------------
jit/startup time      : 91,7541ms
moved types parse time: 41ms
candidates parse time : 1ms
C# parse time         : 147ms
candidates check time : 35ms
console write time    : 0ms

[api-updater (non-obsolete-error-filter)] 07/08/2023 19:18:59 : Starting C:/Program Files/Unity/Hub/Editor/2020.3.42f1/Editor/Data/Tools/ScriptUpdater/APIUpdater.NonObsoleteApiUpdaterDetector.exe
[api-updater (non-obsolete-error-filter)] 
----------------------------------
jit/startup time      : 96,7395ms
moved types parse time: 52ms
candidates parse time : 1ms
C# parse time         : 159ms
candidates check time : 30ms
console write time    : 0ms

[api-updater (non-obsolete-error-filter)] 07/08/2023 20:21:26 : Starting C:/Program Files/Unity/Hub/Editor/2020.3.42f1/Editor/Data/Tools/ScriptUpdater/APIUpdater.NonObsoleteApiUpdaterDetector.exe
[api-updater (non-obsolete-error-filter)] 
----------------------------------
jit/startup time      : 102,7241ms
moved types parse time: 44ms
candidates parse time : 1ms
C# parse time         : 175ms
candidates check time : 41ms
console write time    : 0ms

[api-updater (non-obsolete-error-filter)] 07/08/2023 23:46:30 : Starting C:/Program Files/Unity/Hub/Editor/2020.3.42f1/Editor/Data/Tools/ScriptUpdater/APIUpdater.NonObsoleteApiUpdaterDetector.exe
[api-updater (non-obsolete-error-filter)] 
----------------------------------
jit/startup time      : 92,7518ms
moved types parse time: 41ms
candidates parse time : 1ms
C# parse time         : 155ms
candidates check time : 34ms
console write time    : 0ms

[api-updater (non-obsolete-error-filter)] 07/08/2023 23:49:42 : Starting C:/Program Files/Unity/Hub/Editor/2020.3.42f1/Editor/Data/Tools/ScriptUpdater/APIUpdater.NonObsoleteApiUpdaterDetector.exe
[api-updater (non-obsolete-error-filter)] 
----------------------------------
jit/startup time      : 93,7494ms
moved types parse time: 44ms
candidates parse time : 1ms
C# parse time         : 174ms
candidates check time : 55ms
console write time    : 0ms

[api-updater (non-obsolete-error-filter)] 08/08/2023 17:18:45 : Starting C:/Program Files/Unity/Hub/Editor/2020.3.42f1/Editor/Data/Tools/ScriptUpdater/APIUpdater.NonObsoleteApiUpdaterDetector.exe
[api-updater (non-obsolete-error-filter)] 
----------------------------------
jit/startup time      : 120,6754ms
moved types parse time: 40ms
candidates parse time : 1ms
C# parse time         : 157ms
candidates check time : 48ms
console write time    : 0ms

[api-updater (non-obsolete-error-filter)] 08/08/2023 18:51:03 : Starting C:/Program Files/Unity/Hub/Editor/2020.3.42f1/Editor/Data/Tools/ScriptUpdater/APIUpdater.NonObsoleteApiUpdaterDetector.exe
[api-updater (non-obsolete-error-filter)] 
----------------------------------
jit/startup time      : 100,2373ms
moved types parse time: 41ms
candidates parse time : 0ms
C# parse time         : 164ms
candidates check time : 44ms
console write time    : 0ms

[api-updater (non-obsolete-error-filter)] 08/08/2023 20:23:23 : Starting C:/Program Files/Unity/Hub/Editor/2020.3.42f1/Editor/Data/Tools/ScriptUpdater/APIUpdater.NonObsoleteApiUpdaterDetector.exe
[api-updater (non-obsolete-error-filter)] 
----------------------------------
jit/startup time      : 118,6815ms
moved types parse time: 43ms
candidates parse time : 1ms
C# parse time         : 144ms
candidates check time : 21ms
console write time    : 0ms

[api-updater (non-obsolete-error-filter)] 08/08/2023 20:37:50 : Starting C:/Program Files/Unity/Hub/Editor/2020.3.42f1/Editor/Data/Tools/ScriptUpdater/APIUpdater.NonObsoleteApiUpdaterDetector.exe
[api-updater (non-obsolete-error-filter)] 
----------------------------------
jit/startup time      : 102,2346ms
moved types parse time: 47ms
candidates parse time : 1ms
C# parse time         : 163ms
candidates check time : 44ms
console write time    : 0ms

[api-updater (non-obsolete-error-filter)] 08/08/2023 21:53:34 : Starting C:/Program Files/Unity/Hub/Editor/2020.3.42f1/Editor/Data/Tools/ScriptUpdater/APIUpdater.NonObsoleteApiUpdaterDetector.exe
[api-updater (non-obsolete-error-filter)] 
----------------------------------
jit/startup time      : 96,7413ms
moved types parse time: 40ms
candidates parse time : 1ms
C# parse time         : 167ms
candidates check time : 50ms
console write time    : 0ms

[api-updater (non-obsolete-error-filter)] 08/08/2023 21:56:12 : Starting C:/Program Files/Unity/Hub/Editor/2020.3.42f1/Editor/Data/Tools/ScriptUpdater/APIUpdater.NonObsoleteApiUpdaterDetector.exe
[api-updater (non-obsolete-error-filter)] 
----------------------------------
jit/startup time      : 115,6897ms
moved types parse time: 42ms
candidates parse time : 0ms
C# parse time         : 170ms
candidates check time : 50ms
console write time    : 0ms

[api-updater (non-obsolete-error-filter)] 08/08/2023 23:30:42 : Starting C:/Program Files/Unity/Hub/Editor/2020.3.42f1/Editor/Data/Tools/ScriptUpdater/APIUpdater.NonObsoleteApiUpdaterDetector.exe
[api-updater (non-obsolete-error-filter)] 
----------------------------------
jit/startup time      : 95,7434ms
moved types parse time: 48ms
candidates parse time : 0ms
C# parse time         : 171ms
candidates check time : 36ms
console write time    : 0ms

[api-updater (non-obsolete-error-filter)] 09/08/2023 16:58:25 : Starting C:/Program Files/Unity/Hub/Editor/2020.3.42f1/Editor/Data/Tools/ScriptUpdater/APIUpdater.NonObsoleteApiUpdaterDetector.exe
[api-updater (non-obsolete-error-filter)] 
----------------------------------
jit/startup time      : 181,0333ms
moved types parse time: 47ms
candidates parse time : 1ms
C# parse time         : 238ms
candidates check time : 74ms
console write time    : 0ms

[api-updater (non-obsolete-error-filter)] 09/08/2023 17:01:31 : Starting C:/Program Files/Unity/Hub/Editor/2020.3.42f1/Editor/Data/Tools/ScriptUpdater/APIUpdater.NonObsoleteApiUpdaterDetector.exe
[api-updater (non-obsolete-error-filter)] 
----------------------------------
jit/startup time      : 91,7546ms
moved types parse time: 41ms
candidates parse time : 1ms
C# parse time         : 181ms
candidates check time : 46ms
console write time    : 0ms

[api-updater (non-obsolete-error-filter)] 09/08/2023 17:20:10 : Starting C:/Program Files/Unity/Hub/Editor/2020.3.42f1/Editor/Data/Tools/ScriptUpdater/APIUpdater.NonObsoleteApiUpdaterDetector.exe
[api-updater (non-obsolete-error-filter)] 
----------------------------------
jit/startup time      : 106,7138ms
moved types parse time: 53ms
candidates parse time : 1ms
C# parse time         : 246ms
candidates check time : 44ms
console write time    : 0ms

[api-updater (non-obsolete-error-filter)] 09/08/2023 17:20:30 : Starting C:/Program Files/Unity/Hub/Editor/2020.3.42f1/Editor/Data/Tools/ScriptUpdater/APIUpdater.NonObsoleteApiUpdaterDetector.exe
[api-updater (non-obsolete-error-filter)] 
----------------------------------
jit/startup time      : 101,2359ms
moved types parse time: 54ms
candidates parse time : 1ms
C# parse time         : 215ms
candidates check time : 40ms
console write time    : 0ms

[api-updater (non-obsolete-error-filter)] 09/08/2023 17:24:05 : Starting C:/Program Files/Unity/Hub/Editor/2020.3.42f1/Editor/Data/Tools/ScriptUpdater/APIUpdater.NonObsoleteApiUpdaterDetector.exe
[api-updater (non-obsolete-error-filter)] 
----------------------------------
jit/startup time      : 93,7495ms
moved types parse time: 42ms
candidates parse time : 1ms
C# parse time         : 176ms
candidates check time : 59ms
console write time    : 0ms

[api-updater (non-obsolete-error-filter)] 09/08/2023 17:31:49 : Starting C:/Program Files/Unity/Hub/Editor/2020.3.42f1/Editor/Data/Tools/ScriptUpdater/APIUpdater.NonObsoleteApiUpdaterDetector.exe
[api-updater (non-obsolete-error-filter)] 
----------------------------------
jit/startup time      : 93,2558ms
moved types parse time: 42ms
candidates parse time : 0ms
C# parse time         : 179ms
candidates check time : 35ms
console write time    : 0ms

[api-updater (non-obsolete-error-filter)] 09/08/2023 17:54:14 : Starting C:/Program Files/Unity/Hub/Editor/2020.3.42f1/Editor/Data/Tools/ScriptUpdater/APIUpdater.NonObsoleteApiUpdaterDetector.exe
[api-updater (non-obsolete-error-filter)] 
----------------------------------
jit/startup time      : 90,7565ms
moved types parse time: 41ms
candidates parse time : 1ms
C# parse time         : 180ms
candidates check time : 35ms
console write time    : 0ms

[api-updater (non-obsolete-error-filter)] 09/08/2023 17:55:40 : Starting C:/Program Files/Unity/Hub/Editor/2020.3.42f1/Editor/Data/Tools/ScriptUpdater/APIUpdater.NonObsoleteApiUpdaterDetector.exe
[api-updater (non-obsolete-error-filter)] 
----------------------------------
jit/startup time      : 89,267ms
moved types parse time: 41ms
candidates parse time : 1ms
C# parse time         : 184ms
candidates check time : 35ms
console write time    : 0ms

[api-updater (non-obsolete-error-filter)] 09/08/2023 17:58:55 : Starting C:/Program Files/Unity/Hub/Editor/2020.3.42f1/Editor/Data/Tools/ScriptUpdater/APIUpdater.NonObsoleteApiUpdaterDetector.exe
[api-updater (non-obsolete-error-filter)] 
----------------------------------
jit/startup time      : 85,77ms
moved types parse time: 42ms
candidates parse time : 1ms
C# parse time         : 175ms
candidates check time : 36ms
console write time    : 0ms

[api-updater (non-obsolete-error-filter)] 09/08/2023 18:02:09 : Starting C:/Program Files/Unity/Hub/Editor/2020.3.42f1/Editor/Data/Tools/ScriptUpdater/APIUpdater.NonObsoleteApiUpdaterDetector.exe
[api-updater (non-obsolete-error-filter)] 
----------------------------------
jit/startup time      : 94,7466ms
moved types parse time: 54ms
candidates parse time : 1ms
C# parse time         : 189ms
candidates check time : 42ms
console write time    : 0ms

[api-updater (non-obsolete-error-filter)] 09/08/2023 18:02:34 : Starting C:/Program Files/Unity/Hub/Editor/2020.3.42f1/Editor/Data/Tools/ScriptUpdater/APIUpdater.NonObsoleteApiUpdaterDetector.exe
[api-updater (non-obsolete-error-filter)] 
----------------------------------
jit/startup time      : 92,2612ms
moved types parse time: 42ms
candidates parse time : 1ms
C# parse time         : 201ms
candidates check time : 35ms
console write time    : 0ms

[api-updater (non-obsolete-error-filter)] 09/08/2023 18:07:01 : Starting C:/Program Files/Unity/Hub/Editor/2020.3.42f1/Editor/Data/Tools/ScriptUpdater/APIUpdater.NonObsoleteApiUpdaterDetector.exe
[api-updater (non-obsolete-error-filter)] 
----------------------------------
jit/startup time      : 89,2661ms
moved types parse time: 47ms
candidates parse time : 1ms
C# parse time         : 173ms
candidates check time : 35ms
console write time    : 0ms

[api-updater (non-obsolete-error-filter)] 09/08/2023 18:12:51 : Starting C:/Program Files/Unity/Hub/Editor/2020.3.42f1/Editor/Data/Tools/ScriptUpdater/APIUpdater.NonObsoleteApiUpdaterDetector.exe
[api-updater (non-obsolete-error-filter)] 
----------------------------------
jit/startup time      : 92,7537ms
moved types parse time: 57ms
candidates parse time : 1ms
C# parse time         : 221ms
candidates check time : 41ms
console write time    : 0ms

[api-updater (non-obsolete-error-filter)] 09/08/2023 18:15:33 : Starting C:/Program Files/Unity/Hub/Editor/2020.3.42f1/Editor/Data/Tools/ScriptUpdater/APIUpdater.NonObsoleteApiUpdaterDetector.exe
[api-updater (non-obsolete-error-filter)] 
----------------------------------
jit/startup time      : 88,2702ms
moved types parse time: 49ms
candidates parse time : 1ms
C# parse time         : 188ms
candidates check time : 36ms
console write time    : 0ms

[api-updater (non-obsolete-error-filter)] 09/08/2023 18:17:58 : Starting C:/Program Files/Unity/Hub/Editor/2020.3.42f1/Editor/Data/Tools/ScriptUpdater/APIUpdater.NonObsoleteApiUpdaterDetector.exe
[api-updater (non-obsolete-error-filter)] 
----------------------------------
jit/startup time      : 88,7766ms
moved types parse time: 44ms
candidates parse time : 1ms
C# parse time         : 175ms
candidates check time : 35ms
console write time    : 0ms

[api-updater (non-obsolete-error-filter)] 09/08/2023 18:32:23 : Starting C:/Program Files/Unity/Hub/Editor/2020.3.42f1/Editor/Data/Tools/ScriptUpdater/APIUpdater.NonObsoleteApiUpdaterDetector.exe
[api-updater (non-obsolete-error-filter)] 
----------------------------------
jit/startup time      : 92,7514ms
moved types parse time: 41ms
candidates parse time : 1ms
C# parse time         : 168ms
candidates check time : 62ms
console write time    : 0ms

[api-updater (non-obsolete-error-filter)] 09/08/2023 21:27:00 : Starting C:/Program Files/Unity/Hub/Editor/2020.3.42f1/Editor/Data/Tools/ScriptUpdater/APIUpdater.NonObsoleteApiUpdaterDetector.exe
[api-updater (non-obsolete-error-filter)] 
----------------------------------
jit/startup time      : 90,2641ms
moved types parse time: 40ms
candidates parse time : 1ms
C# parse time         : 163ms
candidates check time : 46ms
console write time    : 0ms

[api-updater (non-obsolete-error-filter)] 09/08/2023 21:29:25 : Starting C:/Program Files/Unity/Hub/Editor/2020.3.42f1/Editor/Data/Tools/ScriptUpdater/APIUpdater.NonObsoleteApiUpdaterDetector.exe
[api-updater (non-obsolete-error-filter)] 
----------------------------------
jit/startup time      : 86,2767ms
moved types parse time: 42ms
candidates parse time : 1ms
C# parse time         : 167ms
candidates check time : 44ms
console write time    : 0ms

[api-updater (non-obsolete-error-filter)] 09/08/2023 21:29:41 : Starting C:/Program Files/Unity/Hub/Editor/2020.3.42f1/Editor/Data/Tools/ScriptUpdater/APIUpdater.NonObsoleteApiUpdaterDetector.exe
[api-updater (non-obsolete-error-filter)] 
----------------------------------
jit/startup time      : 88,7626ms
moved types parse time: 43ms
candidates parse time : 1ms
C# parse time         : 180ms
candidates check time : 45ms
console write time    : 0ms

[api-updater (non-obsolete-error-filter)] 09/08/2023 21:29:56 : Starting C:/Program Files/Unity/Hub/Editor/2020.3.42f1/Editor/Data/Tools/ScriptUpdater/APIUpdater.NonObsoleteApiUpdaterDetector.exe
[api-updater (non-obsolete-error-filter)] 
----------------------------------
jit/startup time      : 86,7684ms
moved types parse time: 43ms
candidates parse time : 1ms
C# parse time         : 172ms
candidates check time : 49ms
console write time    : 0ms

[api-updater (non-obsolete-error-filter)] 09/08/2023 21:33:33 : Starting C:/Program Files/Unity/Hub/Editor/2020.3.42f1/Editor/Data/Tools/ScriptUpdater/APIUpdater.NonObsoleteApiUpdaterDetector.exe
[api-updater (non-obsolete-error-filter)] 
----------------------------------
jit/startup time      : 87,2727ms
moved types parse time: 40ms
candidates parse time : 1ms
C# parse time         : 168ms
candidates check time : 61ms
console write time    : 0ms

[api-updater (non-obsolete-error-filter)] 09/08/2023 21:35:13 : Starting C:/Program Files/Unity/Hub/Editor/2020.3.42f1/Editor/Data/Tools/ScriptUpdater/APIUpdater.NonObsoleteApiUpdaterDetector.exe
[api-updater (non-obsolete-error-filter)] 
----------------------------------
jit/startup time      : 92,2593ms
moved types parse time: 54ms
candidates parse time : 1ms
C# parse time         : 195ms
candidates check time : 61ms
console write time    : 0ms

[api-updater (non-obsolete-error-filter)] 09/08/2023 21:35:26 : Starting C:/Program Files/Unity/Hub/Editor/2020.3.42f1/Editor/Data/Tools/ScriptUpdater/APIUpdater.NonObsoleteApiUpdaterDetector.exe
[api-updater (non-obsolete-error-filter)] 
----------------------------------
jit/startup time      : 85,7822ms
moved types parse time: 41ms
candidates parse time : 1ms
C# parse time         : 172ms
candidates check time : 55ms
console write time    : 0ms

[api-updater (non-obsolete-error-filter)] 09/08/2023 21:36:01 : Starting C:/Program Files/Unity/Hub/Editor/2020.3.42f1/Editor/Data/Tools/ScriptUpdater/APIUpdater.NonObsoleteApiUpdaterDetector.exe
[api-updater (non-obsolete-error-filter)] 
----------------------------------
jit/startup time      : 87,273ms
moved types parse time: 44ms
candidates parse time : 1ms
C# parse time         : 177ms
candidates check time : 56ms
console write time    : 0ms

[api-updater (non-obsolete-error-filter)] 09/08/2023 21:36:41 : Starting C:/Program Files/Unity/Hub/Editor/2020.3.42f1/Editor/Data/Tools/ScriptUpdater/APIUpdater.NonObsoleteApiUpdaterDetector.exe
[api-updater (non-obsolete-error-filter)] 
----------------------------------
jit/startup time      : 86,7673ms
moved types parse time: 41ms
candidates parse time : 1ms
C# parse time         : 167ms
candidates check time : 66ms
console write time    : 0ms

[api-updater (non-obsolete-error-filter)] 09/08/2023 21:39:50 : Starting C:/Program Files/Unity/Hub/Editor/2020.3.42f1/Editor/Data/Tools/ScriptUpdater/APIUpdater.NonObsoleteApiUpdaterDetector.exe
[api-updater (non-obsolete-error-filter)] 
----------------------------------
jit/startup time      : 95,744ms
moved types parse time: 41ms
candidates parse time : 1ms
C# parse time         : 178ms
candidates check time : 45ms
console write time    : 0ms

[api-updater (non-obsolete-error-filter)] 09/08/2023 21:40:04 : Starting C:/Program Files/Unity/Hub/Editor/2020.3.42f1/Editor/Data/Tools/ScriptUpdater/APIUpdater.NonObsoleteApiUpdaterDetector.exe
[api-updater (non-obsolete-error-filter)] 
----------------------------------
jit/startup time      : 88,7736ms
moved types parse time: 48ms
candidates parse time : 1ms
C# parse time         : 174ms
candidates check time : 36ms
console write time    : 0ms

[api-updater (non-obsolete-error-filter)] 09/08/2023 21:40:56 : Starting C:/Program Files/Unity/Hub/Editor/2020.3.42f1/Editor/Data/Tools/ScriptUpdater/APIUpdater.NonObsoleteApiUpdaterDetector.exe
[api-updater (non-obsolete-error-filter)] 
----------------------------------
jit/startup time      : 89,7733ms
moved types parse time: 42ms
candidates parse time : 1ms
C# parse time         : 174ms
candidates check time : 38ms
console write time    : 0ms

[api-updater (non-obsolete-error-filter)] 09/08/2023 21:41:03 : Starting C:/Program Files/Unity/Hub/Editor/2020.3.42f1/Editor/Data/Tools/ScriptUpdater/APIUpdater.NonObsoleteApiUpdaterDetector.exe
[api-updater (non-obsolete-error-filter)] 
----------------------------------
jit/startup time      : 89,7602ms
moved types parse time: 42ms
candidates parse time : 1ms
C# parse time         : 178ms
candidates check time : 37ms
console write time    : 0ms

[api-updater (non-obsolete-error-filter)] 09/08/2023 23:16:45 : Starting C:/Program Files/Unity/Hub/Editor/2020.3.42f1/Editor/Data/Tools/ScriptUpdater/APIUpdater.NonObsoleteApiUpdaterDetector.exe
[api-updater (non-obsolete-error-filter)] 
----------------------------------
jit/startup time      : 93,7616ms
moved types parse time: 41ms
candidates parse time : 1ms
C# parse time         : 170ms
candidates check time : 46ms
console write time    : 0ms

[api-updater (non-obsolete-error-filter)] 09/08/2023 23:21:11 : Starting C:/Program Files/Unity/Hub/Editor/2020.3.42f1/Editor/Data/Tools/ScriptUpdater/APIUpdater.NonObsoleteApiUpdaterDetector.exe
[api-updater (non-obsolete-error-filter)] 
----------------------------------
jit/startup time      : 85,7697ms
moved types parse time: 41ms
candidates parse time : 1ms
C# parse time         : 167ms
candidates check time : 61ms
console write time    : 0ms

[api-updater (non-obsolete-error-filter)] 09/08/2023 23:24:27 : Starting C:/Program Files/Unity/Hub/Editor/2020.3.42f1/Editor/Data/Tools/ScriptUpdater/APIUpdater.NonObsoleteApiUpdaterDetector.exe
[api-updater (non-obsolete-error-filter)] 
----------------------------------
jit/startup time      : 89,2666ms
moved types parse time: 41ms
candidates parse time : 1ms
C# parse time         : 152ms
candidates check time : 54ms
console write time    : 0ms

[api-updater (non-obsolete-error-filter)] 09/08/2023 23:27:15 : Starting C:/Program Files/Unity/Hub/Editor/2020.3.42f1/Editor/Data/Tools/ScriptUpdater/APIUpdater.NonObsoleteApiUpdaterDetector.exe
[api-updater (non-obsolete-error-filter)] 
----------------------------------
jit/startup time      : 89,774ms
moved types parse time: 44ms
candidates parse time : 1ms
C# parse time         : 158ms
candidates check time : 57ms
console write time    : 0ms

[api-updater (non-obsolete-error-filter)] 09/08/2023 23:29:40 : Starting C:/Program Files/Unity/Hub/Editor/2020.3.42f1/Editor/Data/Tools/ScriptUpdater/APIUpdater.NonObsoleteApiUpdaterDetector.exe
[api-updater (non-obsolete-error-filter)] 
----------------------------------
jit/startup time      : 87,2726ms
moved types parse time: 41ms
candidates parse time : 0ms
C# parse time         : 172ms
candidates check time : 43ms
console write time    : 0ms

[api-updater (non-obsolete-error-filter)] 10/08/2023 20:46:41 : Starting C:/Program Files/Unity/Hub/Editor/2020.3.42f1/Editor/Data/Tools/ScriptUpdater/APIUpdater.NonObsoleteApiUpdaterDetector.exe
[api-updater (non-obsolete-error-filter)] 
----------------------------------
jit/startup time      : 128,1641ms
moved types parse time: 57ms
candidates parse time : 1ms
C# parse time         : 204ms
candidates check time : 49ms
console write time    : 0ms

[api-updater (non-obsolete-error-filter)] 10/08/2023 21:18:59 : Starting C:/Program Files/Unity/Hub/Editor/2020.3.42f1/Editor/Data/Tools/ScriptUpdater/APIUpdater.NonObsoleteApiUpdaterDetector.exe
[api-updater (non-obsolete-error-filter)] 
----------------------------------
jit/startup time      : 95,2522ms
moved types parse time: 40ms
candidates parse time : 1ms
C# parse time         : 167ms
candidates check time : 39ms
console write time    : 0ms

[api-updater (non-obsolete-error-filter)] 19/08/2023 12:29:45 : Starting C:/Program Files/Unity/Hub/Editor/2020.3.42f1/Editor/Data/Tools/ScriptUpdater/APIUpdater.NonObsoleteApiUpdaterDetector.exe
[api-updater (non-obsolete-error-filter)] 
----------------------------------
jit/startup time      : 737,0532ms
moved types parse time: 44ms
candidates parse time : 0ms
C# parse time         : 187ms
candidates check time : 51ms
console write time    : 0ms

[api-updater (non-obsolete-error-filter)] 19/08/2023 12:33:40 : Starting C:/Program Files/Unity/Hub/Editor/2020.3.42f1/Editor/Data/Tools/ScriptUpdater/APIUpdater.NonObsoleteApiUpdaterDetector.exe
[api-updater (non-obsolete-error-filter)] 
----------------------------------
jit/startup time      : 84,2808ms
moved types parse time: 40ms
candidates parse time : 1ms
C# parse time         : 170ms
candidates check time : 50ms
console write time    : 0ms

[api-updater (non-obsolete-error-filter)] 19/08/2023 12:35:09 : Starting C:/Program Files/Unity/Hub/Editor/2020.3.42f1/Editor/Data/Tools/ScriptUpdater/APIUpdater.NonObsoleteApiUpdaterDetector.exe
[api-updater (non-obsolete-error-filter)] 
----------------------------------
jit/startup time      : 82,7778ms
moved types parse time: 40ms
candidates parse time : 0ms
C# parse time         : 153ms
candidates check time : 49ms
console write time    : 0ms

[api-updater (non-obsolete-error-filter)] 19/08/2023 18:00:46 : Starting C:/Program Files/Unity/Hub/Editor/2020.3.42f1/Editor/Data/Tools/ScriptUpdater/APIUpdater.NonObsoleteApiUpdaterDetector.exe
[api-updater (non-obsolete-error-filter)] 
----------------------------------
jit/startup time      : 137,6423ms
moved types parse time: 39ms
candidates parse time : 1ms
C# parse time         : 156ms
candidates check time : 35ms
console write time    : 0ms

[api-updater (non-obsolete-error-filter)] 20/08/2023 15:33:17 : Starting C:/Program Files/Unity/Hub/Editor/2020.3.42f1/Editor/Data/Tools/ScriptUpdater/APIUpdater.NonObsoleteApiUpdaterDetector.exe
[api-updater (non-obsolete-error-filter)] 
----------------------------------
jit/startup time      : 176,527ms
moved types parse time: 47ms
candidates parse time : 1ms
C# parse time         : 198ms
candidates check time : 51ms
console write time    : 0ms

[api-updater (non-obsolete-error-filter)] 20/08/2023 15:33:49 : Starting C:/Program Files/Unity/Hub/Editor/2020.3.42f1/Editor/Data/Tools/ScriptUpdater/APIUpdater.NonObsoleteApiUpdaterDetector.exe
[api-updater (non-obsolete-error-filter)] 
----------------------------------
jit/startup time      : 98,7368ms
moved types parse time: 47ms
candidates parse time : 1ms
C# parse time         : 192ms
candidates check time : 56ms
console write time    : 0ms

[api-updater (non-obsolete-error-filter)] 20/08/2023 15:34:23 : Starting C:/Program Files/Unity/Hub/Editor/2020.3.42f1/Editor/Data/Tools/ScriptUpdater/APIUpdater.NonObsoleteApiUpdaterDetector.exe
[api-updater (non-obsolete-error-filter)] 
----------------------------------
jit/startup time      : 89,76ms
moved types parse time: 46ms
candidates parse time : 1ms
C# parse time         : 200ms
candidates check time : 55ms
console write time    : 0ms

[api-updater (non-obsolete-error-filter)] 20/08/2023 15:34:50 : Starting C:/Program Files/Unity/Hub/Editor/2020.3.42f1/Editor/Data/Tools/ScriptUpdater/APIUpdater.NonObsoleteApiUpdaterDetector.exe
[api-updater (non-obsolete-error-filter)] 
----------------------------------
jit/startup time      : 86,2744ms
moved types parse time: 41ms
candidates parse time : 1ms
C# parse time         : 155ms
candidates check time : 53ms
console write time    : 0ms

[api-updater (non-obsolete-error-filter)] 20/08/2023 15:34:57 : Starting C:/Program Files/Unity/Hub/Editor/2020.3.42f1/Editor/Data/Tools/ScriptUpdater/APIUpdater.NonObsoleteApiUpdaterDetector.exe
[api-updater (non-obsolete-error-filter)] 
----------------------------------
jit/startup time      : 90,7575ms
moved types parse time: 57ms
candidates parse time : 1ms
C# parse time         : 172ms
candidates check time : 51ms
console write time    : 0ms

[api-updater (non-obsolete-error-filter)] 20/08/2023 15:42:42 : Starting C:/Program Files/Unity/Hub/Editor/2020.3.42f1/Editor/Data/Tools/ScriptUpdater/APIUpdater.NonObsoleteApiUpdaterDetector.exe
[api-updater (non-obsolete-error-filter)] 
----------------------------------
jit/startup time      : 91,2617ms
moved types parse time: 41ms
candidates parse time : 1ms
C# parse time         : 168ms
candidates check time : 40ms
console write time    : 0ms

[api-updater (non-obsolete-error-filter)] 22/08/2023 00:31:55 : Starting C:/Program Files/Unity/Hub/Editor/2020.3.42f1/Editor/Data/Tools/ScriptUpdater/APIUpdater.NonObsoleteApiUpdaterDetector.exe
[api-updater (non-obsolete-error-filter)] 
----------------------------------
jit/startup time      : 159,0926ms
moved types parse time: 45ms
candidates parse time : 0ms
C# parse time         : 191ms
candidates check time : 39ms
console write time    : 0ms

[api-updater (non-obsolete-error-filter)] 23/08/2023 22:47:42 : Starting C:/Program Files/Unity/Hub/Editor/2020.3.42f1/Editor/Data/Tools/ScriptUpdater/APIUpdater.NonObsoleteApiUpdaterDetector.exe
[api-updater (non-obsolete-error-filter)] 
----------------------------------
jit/startup time      : 175,0378ms
moved types parse time: 45ms
candidates parse time : 1ms
C# parse time         : 163ms
candidates check time : 21ms
console write time    : 0ms

[api-updater (non-obsolete-error-filter)] 24/08/2023 00:08:26 : Starting C:/Program Files/Unity/Hub/Editor/2020.3.42f1/Editor/Data/Tools/ScriptUpdater/APIUpdater.NonObsoleteApiUpdaterDetector.exe
[api-updater (non-obsolete-error-filter)] 
----------------------------------
jit/startup time      : 87,7647ms
moved types parse time: 39ms
candidates parse time : 0ms
C# parse time         : 145ms
candidates check time : 38ms
console write time    : 0ms

[api-updater (non-obsolete-error-filter)] 24/08/2023 00:08:57 : Starting C:/Program Files/Unity/Hub/Editor/2020.3.42f1/Editor/Data/Tools/ScriptUpdater/APIUpdater.NonObsoleteApiUpdaterDetector.exe
[api-updater (non-obsolete-error-filter)] 
----------------------------------
jit/startup time      : 82,2843ms
moved types parse time: 40ms
candidates parse time : 1ms
C# parse time         : 143ms
candidates check time : 33ms
console write time    : 0ms

[api-updater (non-obsolete-error-filter)] 24/08/2023 00:10:35 : Starting C:/Program Files/Unity/Hub/Editor/2020.3.42f1/Editor/Data/Tools/ScriptUpdater/APIUpdater.NonObsoleteApiUpdaterDetector.exe
[api-updater (non-obsolete-error-filter)] 
----------------------------------
jit/startup time      : 83,7756ms
moved types parse time: 40ms
candidates parse time : 1ms
C# parse time         : 144ms
candidates check time : 35ms
console write time    : 0ms

[api-updater (non-obsolete-error-filter)] 24/08/2023 00:11:39 : Starting C:/Program Files/Unity/Hub/Editor/2020.3.42f1/Editor/Data/Tools/ScriptUpdater/APIUpdater.NonObsoleteApiUpdaterDetector.exe
[api-updater (non-obsolete-error-filter)] 
----------------------------------
jit/startup time      : 85,2794ms
moved types parse time: 41ms
candidates parse time : 0ms
C# parse time         : 140ms
candidates check time : 34ms
console write time    : 0ms

[api-updater (non-obsolete-error-filter)] 24/08/2023 00:14:09 : Starting C:/Program Files/Unity/Hub/Editor/2020.3.42f1/Editor/Data/Tools/ScriptUpdater/APIUpdater.NonObsoleteApiUpdaterDetector.exe
[api-updater (non-obsolete-error-filter)] 
----------------------------------
jit/startup time      : 83,7756ms
moved types parse time: 46ms
candidates parse time : 0ms
C# parse time         : 141ms
candidates check time : 35ms
console write time    : 0ms

[api-updater (non-obsolete-error-filter)] 24/08/2023 21:09:36 : Starting C:/Program Files/Unity/Hub/Editor/2020.3.42f1/Editor/Data/Tools/ScriptUpdater/APIUpdater.NonObsoleteApiUpdaterDetector.exe
[api-updater (non-obsolete-error-filter)] 
----------------------------------
jit/startup time      : 157,0881ms
moved types parse time: 44ms
candidates parse time : 1ms
C# parse time         : 196ms
candidates check time : 39ms
console write time    : 0ms

[api-updater (non-obsolete-error-filter)] 24/08/2023 21:14:48 : Starting C:/Program Files/Unity/Hub/Editor/2020.3.42f1/Editor/Data/Tools/ScriptUpdater/APIUpdater.NonObsoleteApiUpdaterDetector.exe
[api-updater (non-obsolete-error-filter)] 
----------------------------------
jit/startup time      : 84,7724ms
moved types parse time: 41ms
candidates parse time : 0ms
C# parse time         : 175ms
candidates check time : 37ms
console write time    : 0ms

[api-updater (non-obsolete-error-filter)] 24/08/2023 21:15:29 : Starting C:/Program Files/Unity/Hub/Editor/2020.3.42f1/Editor/Data/Tools/ScriptUpdater/APIUpdater.NonObsoleteApiUpdaterDetector.exe
[api-updater (non-obsolete-error-filter)] 
----------------------------------
jit/startup time      : 84,2806ms
moved types parse time: 42ms
candidates parse time : 1ms
C# parse time         : 181ms
candidates check time : 44ms
console write time    : 0ms

[api-updater (non-obsolete-error-filter)] 03/09/2023 21:56:22 : Starting C:/Program Files/Unity/Hub/Editor/2020.3.42f1/Editor/Data/Tools/ScriptUpdater/APIUpdater.NonObsoleteApiUpdaterDetector.exe
[api-updater (non-obsolete-error-filter)] 
----------------------------------
jit/startup time      : 1011,3061ms
moved types parse time: 45ms
candidates parse time : 1ms
C# parse time         : 180ms
candidates check time : 36ms
console write time    : 0ms

[api-updater (non-obsolete-error-filter)] 03/09/2023 21:56:42 : Starting C:/Program Files/Unity/Hub/Editor/2020.3.42f1/Editor/Data/Tools/ScriptUpdater/APIUpdater.NonObsoleteApiUpdaterDetector.exe
[api-updater (non-obsolete-error-filter)] 
----------------------------------
jit/startup time      : 85,7709ms
moved types parse time: 40ms
candidates parse time : 1ms
C# parse time         : 147ms
candidates check time : 36ms
console write time    : 0ms

[api-updater (non-obsolete-error-filter)] 03/09/2023 22:20:49 : Starting C:/Program Files/Unity/Hub/Editor/2020.3.42f1/Editor/Data/Tools/ScriptUpdater/APIUpdater.NonObsoleteApiUpdaterDetector.exe
[api-updater (non-obsolete-error-filter)] 
----------------------------------
jit/startup time      : 87,7655ms
moved types parse time: 41ms
candidates parse time : 0ms
C# parse time         : 140ms
candidates check time : 34ms
console write time    : 0ms

[api-updater (non-obsolete-error-filter)] 03/09/2023 23:25:40 : Starting C:/Program Files/Unity/Hub/Editor/2020.3.42f1/Editor/Data/Tools/ScriptUpdater/APIUpdater.NonObsoleteApiUpdaterDetector.exe
[api-updater (non-obsolete-error-filter)] 
----------------------------------
jit/startup time      : 87,7645ms
moved types parse time: 40ms
candidates parse time : 0ms
C# parse time         : 145ms
candidates check time : 35ms
console write time    : 0ms

[api-updater (non-obsolete-error-filter)] 03/09/2023 23:26:05 : Starting C:/Program Files/Unity/Hub/Editor/2020.3.42f1/Editor/Data/Tools/ScriptUpdater/APIUpdater.NonObsoleteApiUpdaterDetector.exe
[api-updater (non-obsolete-error-filter)] 
----------------------------------
jit/startup time      : 88,7621ms
moved types parse time: 40ms
candidates parse time : 0ms
C# parse time         : 173ms
candidates check time : 40ms
console write time    : 0ms

[api-updater (non-obsolete-error-filter)] 13/09/2023 22:28:59 : Starting C:/Program Files/Unity/Hub/Editor/2020.3.42f1/Editor/Data/Tools/ScriptUpdater/APIUpdater.NonObsoleteApiUpdaterDetector.exe
[api-updater (non-obsolete-error-filter)] 
----------------------------------
jit/startup time      : 831,9035ms
moved types parse time: 45ms
candidates parse time : 0ms
C# parse time         : 180ms
candidates check time : 36ms
console write time    : 0ms

[api-updater (non-obsolete-error-filter)] 24/09/2023 10:39:23 : Starting C:/Program Files/Unity/Hub/Editor/2020.3.42f1/Editor/Data/Tools/ScriptUpdater/APIUpdater.NonObsoleteApiUpdaterDetector.exe
[api-updater (non-obsolete-error-filter)] 
----------------------------------
jit/startup time      : 808,8562ms
moved types parse time: 44ms
candidates parse time : 1ms
C# parse time         : 198ms
candidates check time : 42ms
console write time    : 0ms

[api-updater (non-obsolete-error-filter)] 24/09/2023 10:40:16 : Starting C:/Program Files/Unity/Hub/Editor/2020.3.42f1/Editor/Data/Tools/ScriptUpdater/APIUpdater.NonObsoleteApiUpdaterDetector.exe
[api-updater (non-obsolete-error-filter)] 
----------------------------------
jit/startup time      : 81,2888ms
moved types parse time: 40ms
candidates parse time : 1ms
C# parse time         : 162ms
candidates check time : 90ms
console write time    : 0ms

[api-updater (non-obsolete-error-filter)] 30/09/2023 17:52:56 : Starting C:/Program Files/Unity/Hub/Editor/2020.3.42f1/Editor/Data/Tools/ScriptUpdater/APIUpdater.NonObsoleteApiUpdaterDetector.exe
[api-updater (non-obsolete-error-filter)] 
----------------------------------
jit/startup time      : 168,5486ms
moved types parse time: 49ms
candidates parse time : 1ms
C# parse time         : 187ms
candidates check time : 73ms
console write time    : 0ms

[api-updater (non-obsolete-error-filter)] 30/09/2023 17:52:57 : Starting C:/Program Files/Unity/Hub/Editor/2020.3.42f1/Editor/Data/Tools/ScriptUpdater/APIUpdater.NonObsoleteApiUpdaterDetector.exe
[api-updater (non-obsolete-error-filter)] 
----------------------------------
jit/startup time      : 90,2642ms
moved types parse time: 42ms
candidates parse time : 1ms
C# parse time         : 150ms
candidates check time : 69ms
console write time    : 0ms

[api-updater (non-obsolete-error-filter)] 30/09/2023 17:55:36 : Starting C:/Program Files/Unity/Hub/Editor/2020.3.42f1/Editor/Data/Tools/ScriptUpdater/APIUpdater.NonObsoleteApiUpdaterDetector.exe
[api-updater (non-obsolete-error-filter)] 
----------------------------------
jit/startup time      : 100,7304ms
moved types parse time: 45ms
candidates parse time : 1ms
C# parse time         : 162ms
candidates check time : 81ms
console write time    : 0ms

[api-updater (non-obsolete-error-filter)] 30/09/2023 17:55:37 : Starting C:/Program Files/Unity/Hub/Editor/2020.3.42f1/Editor/Data/Tools/ScriptUpdater/APIUpdater.NonObsoleteApiUpdaterDetector.exe
[api-updater (non-obsolete-error-filter)] 
----------------------------------
jit/startup time      : 97,246ms
moved types parse time: 42ms
candidates parse time : 1ms
C# parse time         : 170ms
candidates check time : 78ms
console write time    : 0ms

[api-updater (non-obsolete-error-filter)] 30/09/2023 18:26:56 : Starting C:/Program Files/Unity/Hub/Editor/2020.3.42f1/Editor/Data/Tools/ScriptUpdater/APIUpdater.NonObsoleteApiUpdaterDetector.exe
[api-updater (non-obsolete-error-filter)] 
----------------------------------
jit/startup time      : 101,7245ms
moved types parse time: 41ms
candidates parse time : 1ms
C# parse time         : 136ms
candidates check time : 20ms
console write time    : 0ms

[api-updater (non-obsolete-error-filter)] 30/09/2023 19:18:32 : Starting C:/Program Files/Unity/Hub/Editor/2020.3.42f1/Editor/Data/Tools/ScriptUpdater/APIUpdater.NonObsoleteApiUpdaterDetector.exe
[api-updater (non-obsolete-error-filter)] 
----------------------------------
jit/startup time      : 96,7406ms
moved types parse time: 43ms
candidates parse time : 1ms
C# parse time         : 148ms
candidates check time : 26ms
console write time    : 0ms

[api-updater (non-obsolete-error-filter)] 30/09/2023 19:50:38 : Starting C:/Program Files/Unity/Hub/Editor/2020.3.42f1/Editor/Data/Tools/ScriptUpdater/APIUpdater.NonObsoleteApiUpdaterDetector.exe
[api-updater (non-obsolete-error-filter)] 
----------------------------------
jit/startup time      : 139,6251ms
moved types parse time: 59ms
candidates parse time : 1ms
C# parse time         : 134ms
candidates check time : 24ms
console write time    : 0ms

[api-updater (non-obsolete-error-filter)] 01/10/2023 16:23:13 : Starting C:/Program Files/Unity/Hub/Editor/2020.3.42f1/Editor/Data/Tools/ScriptUpdater/APIUpdater.NonObsoleteApiUpdaterDetector.exe
[api-updater (non-obsolete-error-filter)] 
----------------------------------
jit/startup time      : 1008,8066ms
moved types parse time: 51ms
candidates parse time : 1ms
C# parse time         : 163ms
candidates check time : 22ms
console write time    : 0ms

