06/01/2024 01:56:29;1704502589;32501;0,3094856;0,1485326;Agent;Medium;627f9b67-2cb4-43ca-af35-bae5b3772955
06/01/2024 01:56:29;1704502589;32501;0,3094856;0,1485326;Agent;Medium;627f9b67-2cb4-43ca-af35-bae5b3772955
06/01/2024 01:56:29;1704502589;32501;0,3094856;0,1485326;Agent;Medium;627f9b67-2cb4-43ca-af35-bae5b3772955
06/01/2024 01:56:29;1704502589;32501;-0,1931158;-0,7870649;Agent;Medium;fddb438e-5a2e-48c9-9fa7-96de0ccbec77
06/01/2024 01:56:29;1704502589;32501;-0,1931158;-0,7870649;Agent;Medium;fddb438e-5a2e-48c9-9fa7-96de0ccbec77
06/01/2024 01:56:29;1704502589;32501;-0,1931158;-0,7870649;Agent;Medium;fddb438e-5a2e-48c9-9fa7-96de0ccbec77
06/01/2024 01:56:29;1704502589;32501;0,4130627;-0,3387592;Agent;Small;627f9b67-2cb4-43ca-af35-bae5b3772955
06/01/2024 01:56:29;1704502589;32501;0,4130627;-0,3387592;Agent;Small;627f9b67-2cb4-43ca-af35-bae5b3772955
06/01/2024 01:56:29;1704502589;32501;-0,2621085;-0,3514625;Agent;Small;fddb438e-5a2e-48c9-9fa7-96de0ccbec77
06/01/2024 01:56:29;1704502589;32501;-0,2621085;-0,3514625;Agent;Small;fddb438e-5a2e-48c9-9fa7-96de0ccbec77
06/01/2024 01:56:29;1704502589;32511;0,5506245;0,5037118;Agent;Large;cc9a19f8-836b-4b85-b24e-1b57380867cb
06/01/2024 01:56:29;1704502589;32511;-0,6127751;-0,6591789;Agent;Large;92bd9ecb-98db-41a0-85a3-f76464ef08e5
06/01/2024 01:56:30;1704502590;32522;0,5377855;-0,004717872;Agent;Medium;6e535ad9-ded8-4dcb-a3e5-6a8b401a4465
06/01/2024 01:56:30;1704502590;32522;0,5377855;-0,004717872;Agent;Medium;6e535ad9-ded8-4dcb-a3e5-6a8b401a4465
06/01/2024 01:56:30;1704502590;32522;0,5377855;-0,004717872;Agent;Medium;6e535ad9-ded8-4dcb-a3e5-6a8b401a4465
06/01/2024 01:56:30;1704502590;32522;-0,215009;-0,9026479;Agent;Medium;746c43ea-7b23-45da-817f-e4423137ec09
06/01/2024 01:56:30;1704502590;32522;-0,215009;-0,9026479;Agent;Medium;746c43ea-7b23-45da-817f-e4423137ec09
06/01/2024 01:56:30;1704502590;32532;0,1978889;0,8025313;Agent;Large;6875dc09-571f-4574-8c51-826eb98888a5
06/01/2024 01:56:30;1704502590;32532;0,1978889;0,8025313;Agent;Medium;6875dc09-571f-4574-8c51-826eb98888a5
06/01/2024 01:56:30;1704502590;32532;0,1978889;0,8025313;Agent;Medium;6875dc09-571f-4574-8c51-826eb98888a5
06/01/2024 01:56:30;1704502590;32532;0,1978889;0,8025313;Agent;Medium;6875dc09-571f-4574-8c51-826eb98888a5
06/01/2024 01:56:30;1704502590;32532;0,1978889;0,8025313;Agent;Medium;6875dc09-571f-4574-8c51-826eb98888a5
06/01/2024 01:56:30;1704502590;32532;0,1978889;0,8025313;Agent;Medium;6875dc09-571f-4574-8c51-826eb98888a5
06/01/2024 01:56:30;1704502590;32532;-0,1385614;-0,3347686;Agent;Medium;7f27a9f3-b6ef-4c57-af85-b1684aa79b2a
06/01/2024 01:56:30;1704502590;32532;-0,1385614;-0,3347686;Agent;Medium;7f27a9f3-b6ef-4c57-af85-b1684aa79b2a
06/01/2024 01:56:30;1704502590;32532;-0,1385614;-0,3347686;Agent;Medium;7f27a9f3-b6ef-4c57-af85-b1684aa79b2a
06/01/2024 01:56:30;1704502590;32532;-0,1385614;-0,3347686;Agent;Medium;7f27a9f3-b6ef-4c57-af85-b1684aa79b2a
06/01/2024 01:56:30;1704502590;32532;-0,1385614;-0,3347686;Agent;Medium;7f27a9f3-b6ef-4c57-af85-b1684aa79b2a
06/01/2024 01:56:30;1704502590;32532;-0,1385614;-0,3347686;Agent;Medium;7f27a9f3-b6ef-4c57-af85-b1684aa79b2a
06/01/2024 01:56:30;1704502590;32532;-0,1385614;-0,3347686;Agent;Medium;7f27a9f3-b6ef-4c57-af85-b1684aa79b2a
06/01/2024 01:56:30;1704502590;32532;0,2372036;0,4614041;Agent;Small;6875dc09-571f-4574-8c51-826eb98888a5
06/01/2024 01:56:30;1704502590;32532;0,2372036;0,4614041;Agent;Small;6875dc09-571f-4574-8c51-826eb98888a5
06/01/2024 01:56:30;1704502590;32532;0,2372036;0,4614041;Agent;Small;6875dc09-571f-4574-8c51-826eb98888a5
06/01/2024 01:56:30;1704502590;32532;0,2372036;0,4614041;Agent;Small;6875dc09-571f-4574-8c51-826eb98888a5
06/01/2024 01:56:30;1704502590;32532;0,2372036;0,4614041;Agent;Small;6875dc09-571f-4574-8c51-826eb98888a5
06/01/2024 01:56:30;1704502590;32532;-0,1613904;0,0365604;Agent;Small;7f27a9f3-b6ef-4c57-af85-b1684aa79b2a
06/01/2024 01:56:30;1704502590;32532;-0,1613904;0,0365604;Agent;Small;7f27a9f3-b6ef-4c57-af85-b1684aa79b2a
06/01/2024 01:56:30;1704502590;32532;-0,1613904;0,0365604;Agent;Small;7f27a9f3-b6ef-4c57-af85-b1684aa79b2a
06/01/2024 01:56:30;1704502590;32532;-0,1613904;0,0365604;Agent;Small;7f27a9f3-b6ef-4c57-af85-b1684aa79b2a
06/01/2024 01:56:30;1704502590;32532;-0,1613904;0,0365604;Agent;Small;7f27a9f3-b6ef-4c57-af85-b1684aa79b2a
06/01/2024 01:56:30;1704502590;32533;0,3701627;0,3227089;Agent;Small;6875dc09-571f-4574-8c51-826eb98888a5
06/01/2024 01:56:30;1704502590;32533;0,3701627;0,3227089;Agent;Small;6875dc09-571f-4574-8c51-826eb98888a5
06/01/2024 01:56:30;1704502590;32533;-0,2953323;0,1762671;Agent;Small;7f27a9f3-b6ef-4c57-af85-b1684aa79b2a
06/01/2024 01:56:30;1704502590;32533;-0,2953323;0,1762671;Agent;Small;7f27a9f3-b6ef-4c57-af85-b1684aa79b2a
06/01/2024 01:56:30;1704502590;32543;0,4570524;0,8132586;Agent;Medium;7a6397ad-71a3-41d0-999e-69753ae82ae4
06/01/2024 01:56:30;1704502590;32543;0,4570524;0,8132586;Agent;Medium;7a6397ad-71a3-41d0-999e-69753ae82ae4
06/01/2024 01:56:30;1704502590;32543;-0,4800495;0,1286055;Agent;Medium;a1070e0a-0f51-49c7-bf02-5b3dafed22a1
06/01/2024 01:56:30;1704502590;32543;-0,4800495;0,1286055;Agent;Medium;a1070e0a-0f51-49c7-bf02-5b3dafed22a1
06/01/2024 01:56:30;1704502590;32554;0,2864609;0,6399529;Agent;Medium;e5548590-46b4-4ac7-a528-558d050e647a
06/01/2024 01:56:30;1704502590;32554;0,2864609;0,6399529;Agent;Medium;e5548590-46b4-4ac7-a528-558d050e647a
06/01/2024 01:56:30;1704502590;32554;0,2864609;0,6399529;Agent;Medium;e5548590-46b4-4ac7-a528-558d050e647a
06/01/2024 01:56:30;1704502590;32554;-0,3362461;-0,3416733;Agent;Medium;bcbdbc4e-9c63-4f58-b973-dfc5399e9345
06/01/2024 01:56:30;1704502590;32554;-0,3362461;-0,3416733;Agent;Medium;bcbdbc4e-9c63-4f58-b973-dfc5399e9345
06/01/2024 01:56:30;1704502590;32554;-0,3362461;-0,3416733;Agent;Large;bcbdbc4e-9c63-4f58-b973-dfc5399e9345
06/01/2024 01:56:30;1704502590;32554;0,3751016;0,1839348;Agent;Medium;e5548590-46b4-4ac7-a528-558d050e647a
06/01/2024 01:56:30;1704502590;32554;0,3751016;0,1839348;Agent;Small;e5548590-46b4-4ac7-a528-558d050e647a
06/01/2024 01:56:30;1704502590;32564;0,50603;0,6577446;Agent;Large;63e57465-c07e-4840-ac12-17d45a45ca90
06/01/2024 01:56:30;1704502590;32564;0,50603;0,6577446;Agent;Large;63e57465-c07e-4840-ac12-17d45a45ca90
06/01/2024 01:56:30;1704502590;32564;-0,4233371;-0,2777671;Agent;Large;b4afdaf7-8d2f-4f5f-8642-556a10fcccc7
06/01/2024 01:56:30;1704502590;32564;-0,4233371;-0,2777671;Agent;Large;b4afdaf7-8d2f-4f5f-8642-556a10fcccc7
06/01/2024 01:56:31;1704502591;32575;0,2669754;0,8854822;Agent;Large;476727a9-1fca-41b9-bb25-47f003182d46
06/01/2024 01:56:31;1704502591;32575;0,2669754;0,8854822;Agent;Large;476727a9-1fca-41b9-bb25-47f003182d46
06/01/2024 01:56:31;1704502591;32575;-0,4060643;-0,407458;Agent;Large;24a8f3db-deb5-4989-9723-7ac7531b54b6
06/01/2024 01:56:31;1704502591;32575;-0,4060643;-0,407458;Agent;Large;24a8f3db-deb5-4989-9723-7ac7531b54b6
06/01/2024 01:56:31;1704502591;32575;0,3142225;0,4359582;Agent;Medium;476727a9-1fca-41b9-bb25-47f003182d46
06/01/2024 01:56:31;1704502591;32575;0,3142225;0,4359582;Agent;Medium;476727a9-1fca-41b9-bb25-47f003182d46
06/01/2024 01:56:31;1704502591;32575;0,3142225;0,4359582;Agent;Medium;476727a9-1fca-41b9-bb25-47f003182d46
06/01/2024 01:56:31;1704502591;32575;-0,5231377;0,02946533;Agent;Medium;24a8f3db-deb5-4989-9723-7ac7531b54b6
06/01/2024 01:56:31;1704502591;32575;-0,5231377;0,02946533;Agent;Medium;24a8f3db-deb5-4989-9723-7ac7531b54b6
06/01/2024 01:56:31;1704502591;32586;0,5773939;0,4852119;Agent;Large;f68b15f7-f925-4e24-8d7f-c7c70a5308e7
06/01/2024 01:56:31;1704502591;32596;0,3161184;1,330475;Agent;Large;c387f583-4285-4b82-a814-9043ed1014fa
06/01/2024 01:56:31;1704502591;32596;0,3161184;1,330475;Agent;Large;c387f583-4285-4b82-a814-9043ed1014fa
06/01/2024 01:56:31;1704502591;32596;-0,4293068;0,1047136;Agent;Large;dffc12e1-afe8-4fc3-b975-c286619e6b55
06/01/2024 01:56:31;1704502591;32596;-0,4293068;0,1047136;Agent;Large;dffc12e1-afe8-4fc3-b975-c286619e6b55
06/01/2024 01:56:31;1704502591;32597;0,4079403;0,8984867;Agent;Medium;c387f583-4285-4b82-a814-9043ed1014fa
06/01/2024 01:56:31;1704502591;32597;0,4079403;0,8984867;Agent;Medium;c387f583-4285-4b82-a814-9043ed1014fa
06/01/2024 01:56:31;1704502591;32597;-0,591559;0,5504973;Agent;Medium;dffc12e1-afe8-4fc3-b975-c286619e6b55
06/01/2024 01:56:31;1704502591;32608;0,5208529;0,9813299;Agent;Medium;283cf022-fd2d-4078-a89b-c47b04bf01af
06/01/2024 01:56:31;1704502591;32608;0,5208529;0,9813299;Agent;Large;283cf022-fd2d-4078-a89b-c47b04bf01af
06/01/2024 01:56:31;1704502591;32608;-0,3793548;0,1056285;Agent;Medium;8bfced8c-c9f9-481f-b12d-79059aa5a511
06/01/2024 01:56:31;1704502591;32608;-0,3793548;0,1056285;Agent;Large;8bfced8c-c9f9-481f-b12d-79059aa5a511
06/01/2024 01:56:31;1704502591;32619;0,07978413;0,8173926;Agent;Large;ca0b737d-1df7-47db-9278-9e3cd215c41a
06/01/2024 01:56:31;1704502591;32619;0,07978413;0,8173926;Agent;Large;ca0b737d-1df7-47db-9278-9e3cd215c41a
06/01/2024 01:56:31;1704502591;32619;-0,3849204;-0,6431717;Agent;Large;404b910c-9e1a-475b-bb8f-a61dc49ea718
06/01/2024 01:56:31;1704502591;32619;-0,3849204;-0,6431717;Agent;Large;404b910c-9e1a-475b-bb8f-a61dc49ea718
06/01/2024 01:56:31;1704502591;32619;0,221032;0,3826765;Agent;Medium;ca0b737d-1df7-47db-9278-9e3cd215c41a
06/01/2024 01:56:31;1704502591;32619;0,221032;0,3826765;Agent;Small;ca0b737d-1df7-47db-9278-9e3cd215c41a
06/01/2024 01:56:31;1704502591;32619;0,221032;0,3826765;Agent;Medium;ca0b737d-1df7-47db-9278-9e3cd215c41a
06/01/2024 01:56:31;1704502591;32619;-0,4534415;-0,2105478;Agent;Medium;404b910c-9e1a-475b-bb8f-a61dc49ea718
06/01/2024 01:56:31;1704502591;32619;-0,4534415;-0,2105478;Agent;Small;404b910c-9e1a-475b-bb8f-a61dc49ea718
06/01/2024 01:56:31;1704502591;32619;-0,4534415;-0,2105478;Agent;Medium;404b910c-9e1a-475b-bb8f-a61dc49ea718
06/01/2024 01:56:32;1704502592;32630;0,5449398;0,8629388;Agent;Large;4bef8b61-cd8a-4b23-bd52-c6e6501b57d4
06/01/2024 01:56:32;1704502592;32630;0,5449398;0,8629388;Agent;Large;4bef8b61-cd8a-4b23-bd52-c6e6501b57d4
06/01/2024 01:56:32;1704502592;32630;-0,3449684;-0,3385988;Agent;Large;6bf31716-7bbf-48dc-b23c-927c74b115b0
06/01/2024 01:56:32;1704502592;32630;-0,3449684;-0,3385988;Agent;Large;6bf31716-7bbf-48dc-b23c-927c74b115b0
06/01/2024 01:56:32;1704502592;32630;0,66391;0,4189357;Agent;Medium;4bef8b61-cd8a-4b23-bd52-c6e6501b57d4
06/01/2024 01:56:32;1704502592;32630;-0,4078877;0,1090959;Agent;Medium;6bf31716-7bbf-48dc-b23c-927c74b115b0
06/01/2024 01:56:32;1704502592;32630;-0,4078877;0,1090959;Agent;Medium;6bf31716-7bbf-48dc-b23c-927c74b115b0
06/01/2024 01:56:32;1704502592;32640;0,2054934;1,218156;Agent;Medium;894e0c00-b610-4a59-9771-e3a6e96261c4
06/01/2024 01:56:32;1704502592;32640;0,2054934;1,218156;Agent;Medium;894e0c00-b610-4a59-9771-e3a6e96261c4
06/01/2024 01:56:32;1704502592;32640;-0,5121042;0,3848933;Agent;Medium;7e0a246d-3512-42b7-bb14-4212c47b5156
06/01/2024 01:56:32;1704502592;32640;-0,5121042;0,3848933;Agent;Medium;7e0a246d-3512-42b7-bb14-4212c47b5156
06/01/2024 01:56:32;1704502592;32652;0,2680136;1,040898;Agent;Medium;771376f3-f031-4d1c-88aa-e7e40a340229
06/01/2024 01:56:32;1704502592;32652;0,2680136;1,040898;Agent;Medium;771376f3-f031-4d1c-88aa-e7e40a340229
06/01/2024 01:56:32;1704502592;32652;0,2680136;1,040898;Agent;Medium;771376f3-f031-4d1c-88aa-e7e40a340229
06/01/2024 01:56:32;1704502592;32652;-0,2335312;-0,00176087;Agent;Medium;4fe3d834-58e5-4273-ab56-0f1afe455563
06/01/2024 01:56:32;1704502592;32652;-0,2335312;-0,00176087;Agent;Medium;4fe3d834-58e5-4273-ab56-0f1afe455563
06/01/2024 01:56:32;1704502592;32652;-0,2335312;-0,00176087;Agent;Medium;4fe3d834-58e5-4273-ab56-0f1afe455563
06/01/2024 01:56:32;1704502592;32652;0,3603527;0,6409334;Agent;Small;771376f3-f031-4d1c-88aa-e7e40a340229
06/01/2024 01:56:32;1704502592;32652;0,3603527;0,6409334;Agent;Small;771376f3-f031-4d1c-88aa-e7e40a340229
06/01/2024 01:56:32;1704502592;32652;0,3603527;0,6409334;Agent;Small;771376f3-f031-4d1c-88aa-e7e40a340229
06/01/2024 01:56:32;1704502592;32652;-0,3325419;0,427102;Agent;Small;4fe3d834-58e5-4273-ab56-0f1afe455563
06/01/2024 01:56:32;1704502592;32652;-0,3325419;0,427102;Agent;Small;4fe3d834-58e5-4273-ab56-0f1afe455563
06/01/2024 01:56:32;1704502592;32652;-0,3325419;0,427102;Agent;Small;4fe3d834-58e5-4273-ab56-0f1afe455563
06/01/2024 01:56:32;1704502592;32663;0,3841316;0,9806826;Agent;Large;115ba193-cca8-4a3a-916d-e5f6ab2ad5f7
06/01/2024 01:56:32;1704502592;32663;0,3841316;0,9806826;Agent;Large;115ba193-cca8-4a3a-916d-e5f6ab2ad5f7
06/01/2024 01:56:32;1704502592;32663;-0,1906489;-0,4990297;Agent;Large;ad56a429-ddad-4b21-b2fe-100c446ed3b6
06/01/2024 01:56:32;1704502592;32663;-0,1906489;-0,4990297;Agent;Large;ad56a429-ddad-4b21-b2fe-100c446ed3b6
06/01/2024 01:56:32;1704502592;32663;0,4238028;0,5272382;Agent;Medium;115ba193-cca8-4a3a-916d-e5f6ab2ad5f7
06/01/2024 01:56:32;1704502592;32663;0,4238028;0,5272382;Agent;Medium;115ba193-cca8-4a3a-916d-e5f6ab2ad5f7
06/01/2024 01:56:32;1704502592;32663;0,4238028;0,5272382;Agent;Medium;115ba193-cca8-4a3a-916d-e5f6ab2ad5f7
06/01/2024 01:56:32;1704502592;32663;-0,3251456;-0,05911112;Agent;Medium;ad56a429-ddad-4b21-b2fe-100c446ed3b6
06/01/2024 01:56:32;1704502592;32663;-0,3251456;-0,05911112;Agent;Medium;ad56a429-ddad-4b21-b2fe-100c446ed3b6
06/01/2024 01:56:32;1704502592;32663;-0,3251456;-0,05911112;Agent;Medium;ad56a429-ddad-4b21-b2fe-100c446ed3b6
06/01/2024 01:56:32;1704502592;32673;0,43984;0,9389008;Agent;Large;934fa950-7f16-4c88-a7be-0dbe75d3644b
06/01/2024 01:56:32;1704502592;32673;0,43984;0,9389008;Agent;Large;934fa950-7f16-4c88-a7be-0dbe75d3644b
06/01/2024 01:56:32;1704502592;32673;-0,3200758;-0,4676316;Agent;Large;b8e859ac-6bc4-4408-afbf-2fe0b27f98b0
06/01/2024 01:56:32;1704502592;32673;-0,3200758;-0,4676316;Agent;Large;b8e859ac-6bc4-4408-afbf-2fe0b27f98b0
06/01/2024 01:56:32;1704502592;32673;0,5457973;0,4799489;Agent;Medium;934fa950-7f16-4c88-a7be-0dbe75d3644b
06/01/2024 01:56:32;1704502592;32673;0,5457973;0,4799489;Agent;Medium;934fa950-7f16-4c88-a7be-0dbe75d3644b
06/01/2024 01:56:32;1704502592;32673;-0,3767424;-0,006119519;Agent;Medium;b8e859ac-6bc4-4408-afbf-2fe0b27f98b0
06/01/2024 01:56:32;1704502592;32673;-0,3767424;-0,006119519;Agent;Medium;b8e859ac-6bc4-4408-afbf-2fe0b27f98b0
06/01/2024 01:56:32;1704502592;32673;-0,3767424;-0,006119519;Agent;Medium;b8e859ac-6bc4-4408-afbf-2fe0b27f98b0
06/01/2024 01:56:33;1704502593;32683;0,2237983;0,5052745;Agent;Large;d59f8a21-a0df-4c4f-b243-a0a5dc746c9c
06/01/2024 01:56:33;1704502593;32683;0,2237983;0,5052745;Agent;Medium;d59f8a21-a0df-4c4f-b243-a0a5dc746c9c
06/01/2024 01:56:33;1704502593;32683;0,2237983;0,5052745;Agent;Large;d59f8a21-a0df-4c4f-b243-a0a5dc746c9c
06/01/2024 01:56:33;1704502593;32683;-0,3957621;-0,6445097;Agent;Large;d0424c08-5b02-4ee1-88a4-af016bc2e25b
06/01/2024 01:56:33;1704502593;32683;-0,3957621;-0,6445097;Agent;Medium;d0424c08-5b02-4ee1-88a4-af016bc2e25b
06/01/2024 01:56:33;1704502593;32683;-0,3957621;-0,6445097;Agent;Large;d0424c08-5b02-4ee1-88a4-af016bc2e25b
06/01/2024 01:56:33;1704502593;32684;0,2933077;0,06641009;Agent;Small;d59f8a21-a0df-4c4f-b243-a0a5dc746c9c
06/01/2024 01:56:33;1704502593;32684;0,2933077;0,06641009;Agent;Small;d59f8a21-a0df-4c4f-b243-a0a5dc746c9c
06/01/2024 01:56:33;1704502593;32684;0,2933077;0,06641009;Agent;Small;d59f8a21-a0df-4c4f-b243-a0a5dc746c9c
06/01/2024 01:56:33;1704502593;32684;-0,463655;-0,2158495;Agent;Small;d0424c08-5b02-4ee1-88a4-af016bc2e25b
06/01/2024 01:56:33;1704502593;32684;-0,463655;-0,2158495;Agent;Small;d0424c08-5b02-4ee1-88a4-af016bc2e25b
06/01/2024 01:56:33;1704502593;32684;-0,463655;-0,2158495;Agent;Small;d0424c08-5b02-4ee1-88a4-af016bc2e25b
06/01/2024 01:56:33;1704502593;32694;0,4717907;0,5273136;Agent;Medium;771f754f-628e-4af9-8d84-87f66f432f1a
06/01/2024 01:56:33;1704502593;32694;0,4717907;0,5273136;Agent;Medium;771f754f-628e-4af9-8d84-87f66f432f1a
06/01/2024 01:56:33;1704502593;32694;0,4717907;0,5273136;Agent;Large;771f754f-628e-4af9-8d84-87f66f432f1a
06/01/2024 01:56:33;1704502593;32694;-0,2051443;-0,4852498;Agent;Medium;8d1dd5fb-770f-49e3-b198-92d9d6bd0d8c
06/01/2024 01:56:33;1704502593;32694;-0,2051443;-0,4852498;Agent;Medium;8d1dd5fb-770f-49e3-b198-92d9d6bd0d8c
06/01/2024 01:56:33;1704502593;32694;0,6065726;0,08646218;Agent;Medium;771f754f-628e-4af9-8d84-87f66f432f1a
06/01/2024 01:56:33;1704502593;32694;-0,3318483;-0,04338044;Agent;Medium;8d1dd5fb-770f-49e3-b198-92d9d6bd0d8c
06/01/2024 01:56:33;1704502593;32704;0,3167323;0,4082652;Agent;Medium;25076b67-2e7b-4bd7-b572-748c9e39fa93
06/01/2024 01:56:33;1704502593;32704;0,3167323;0,4082652;Agent;Medium;25076b67-2e7b-4bd7-b572-748c9e39fa93
06/01/2024 01:56:33;1704502593;32704;-0,6181624;-0,2331942;Agent;Medium;9f3f41dc-3d03-4de8-8a2c-2e275ac0a2d5
06/01/2024 01:56:33;1704502593;32704;-0,6181624;-0,2331942;Agent;Medium;9f3f41dc-3d03-4de8-8a2c-2e275ac0a2d5
06/01/2024 01:56:33;1704502593;32715;0,1504467;0,748628;Agent;Large;11f3a31a-c69d-4372-b4ef-3d10479f03af
06/01/2024 01:56:33;1704502593;32715;0,1504467;0,748628;Agent;Large;11f3a31a-c69d-4372-b4ef-3d10479f03af
06/01/2024 01:56:33;1704502593;32715;0,1504467;0,748628;Agent;Large;11f3a31a-c69d-4372-b4ef-3d10479f03af
06/01/2024 01:56:33;1704502593;32715;-0,4594459;-0,5799516;Agent;Large;c43a0341-e2de-4271-b313-6b5fb8103b4d
06/01/2024 01:56:33;1704502593;32715;-0,4594459;-0,5799516;Agent;Large;c43a0341-e2de-4271-b313-6b5fb8103b4d
06/01/2024 01:56:33;1704502593;32715;0,2116977;0,3128048;Agent;Medium;11f3a31a-c69d-4372-b4ef-3d10479f03af
06/01/2024 01:56:33;1704502593;32715;0,2116977;0,3128048;Agent;Small;11f3a31a-c69d-4372-b4ef-3d10479f03af
06/01/2024 01:56:33;1704502593;32715;0,2116977;0,3128048;Agent;Medium;11f3a31a-c69d-4372-b4ef-3d10479f03af
06/01/2024 01:56:33;1704502593;32715;-0,5441188;-0,1443467;Agent;Medium;c43a0341-e2de-4271-b313-6b5fb8103b4d
06/01/2024 01:56:33;1704502593;32715;-0,5441188;-0,1443467;Agent;Small;c43a0341-e2de-4271-b313-6b5fb8103b4d
06/01/2024 01:56:33;1704502593;32715;-0,5441188;-0,1443467;Agent;Medium;c43a0341-e2de-4271-b313-6b5fb8103b4d
06/01/2024 01:56:33;1704502593;32725;0,2380338;0,5706532;Agent;Medium;f90942fb-abf6-48bf-90c7-c9f277420e14
06/01/2024 01:56:33;1704502593;32725;0,2380338;0,5706532;Agent;Medium;f90942fb-abf6-48bf-90c7-c9f277420e14
06/01/2024 01:56:33;1704502593;32725;0,2380338;0,5706532;Agent;Medium;f90942fb-abf6-48bf-90c7-c9f277420e14
06/01/2024 01:56:33;1704502593;32725;-0,228856;-0,5709893;Agent;Medium;ae76ab6f-8f85-4da8-93cb-59e554459f26
06/01/2024 01:56:33;1704502593;32725;-0,228856;-0,5709893;Agent;Medium;ae76ab6f-8f85-4da8-93cb-59e554459f26
06/01/2024 01:56:33;1704502593;32725;-0,228856;-0,5709893;Agent;Medium;ae76ab6f-8f85-4da8-93cb-59e554459f26
06/01/2024 01:56:33;1704502593;32726;0,4017035;0,1209742;Agent;Small;f90942fb-abf6-48bf-90c7-c9f277420e14
06/01/2024 01:56:33;1704502593;32726;0,4017035;0,1209742;Agent;Small;f90942fb-abf6-48bf-90c7-c9f277420e14
06/01/2024 01:56:33;1704502593;32726;-0,334995;-0,111251;Agent;Small;ae76ab6f-8f85-4da8-93cb-59e554459f26
06/01/2024 01:56:33;1704502593;32726;-0,334995;-0,111251;Agent;Small;ae76ab6f-8f85-4da8-93cb-59e554459f26
06/01/2024 01:56:33;1704502593;32726;-0,334995;-0,111251;Agent;Small;ae76ab6f-8f85-4da8-93cb-59e554459f26
06/01/2024 01:56:33;1704502593;32736;0,6058763;0,5188532;Agent;Large;041f7793-eb05-49f7-9087-0f54abace02f
06/01/2024 01:56:33;1704502593;32736;0,6058763;0,5188532;Agent;Large;041f7793-eb05-49f7-9087-0f54abace02f
06/01/2024 01:56:33;1704502593;32736;-0,4554014;-0,5574193;Agent;Large;bafc3fa5-5f28-4bc0-a3aa-c4572eb25494
06/01/2024 01:56:33;1704502593;32736;-0,4554014;-0,5574193;Agent;Large;bafc3fa5-5f28-4bc0-a3aa-c4572eb25494
06/01/2024 01:56:34;1704502594;32746;0,4138882;1,179418;Agent;Medium;51c31c18-e317-4ef9-a45d-c8d4a77674c9
06/01/2024 01:56:34;1704502594;32746;0,4138882;1,179418;Agent;Medium;51c31c18-e317-4ef9-a45d-c8d4a77674c9
06/01/2024 01:56:34;1704502594;32746;-0,238962;0,08712796;Agent;Medium;bc51b32d-0572-4166-8b13-42deab943bd2
06/01/2024 01:56:34;1704502594;32746;-0,238962;0,08712796;Agent;Medium;bc51b32d-0572-4166-8b13-42deab943bd2
06/01/2024 01:56:34;1704502594;32746;0,5245785;0,735464;Agent;Small;51c31c18-e317-4ef9-a45d-c8d4a77674c9
06/01/2024 01:56:34;1704502594;32746;0,5245785;0,735464;Agent;Small;51c31c18-e317-4ef9-a45d-c8d4a77674c9
06/01/2024 01:56:34;1704502594;32746;-0,3384326;0,5550997;Agent;Small;bc51b32d-0572-4166-8b13-42deab943bd2
06/01/2024 01:56:34;1704502594;32746;-0,3384326;0,5550997;Agent;Small;bc51b32d-0572-4166-8b13-42deab943bd2
06/01/2024 01:56:34;1704502594;32757;0,4957508;1,069242;Agent;Large;0b32634b-bcf0-4ec3-8ee9-619063e725ea
06/01/2024 01:56:34;1704502594;32757;0,4957508;1,069242;Agent;Large;0b32634b-bcf0-4ec3-8ee9-619063e725ea
06/01/2024 01:56:34;1704502594;32757;0,4957508;1,069242;Agent;Large;0b32634b-bcf0-4ec3-8ee9-619063e725ea
06/01/2024 01:56:34;1704502594;32757;-0,04536662;-0,3360282;Agent;Large;be10eff3-c8c2-4774-b8b4-196ce3fd0548
06/01/2024 01:56:34;1704502594;32757;-0,04536662;-0,3360282;Agent;Large;be10eff3-c8c2-4774-b8b4-196ce3fd0548
06/01/2024 01:56:34;1704502594;32757;0,5943345;0,6422291;Agent;Medium;0b32634b-bcf0-4ec3-8ee9-619063e725ea
06/01/2024 01:56:34;1704502594;32757;0,5943345;0,6422291;Agent;Medium;0b32634b-bcf0-4ec3-8ee9-619063e725ea
06/01/2024 01:56:34;1704502594;32757;0,5943345;0,6422291;Agent;Medium;0b32634b-bcf0-4ec3-8ee9-619063e725ea
06/01/2024 01:56:34;1704502594;32757;-0,1880532;0,1031161;Agent;Medium;be10eff3-c8c2-4774-b8b4-196ce3fd0548
06/01/2024 01:56:34;1704502594;32757;-0,1880532;0,1031161;Agent;Medium;be10eff3-c8c2-4774-b8b4-196ce3fd0548
06/01/2024 01:56:34;1704502594;32768;0,3815364;1,040947;Agent;Large;619304a9-a392-43b0-abc2-40a85f8efd4b
06/01/2024 01:56:34;1704502594;32768;0,3815364;1,040947;Agent;Large;619304a9-a392-43b0-abc2-40a85f8efd4b
06/01/2024 01:56:34;1704502594;32768;-0,2756045;-0,2153131;Agent;Large;37a247a3-cedb-4101-83e7-71e012ce012f
06/01/2024 01:56:34;1704502594;32768;-0,2756045;-0,2153131;Agent;Large;37a247a3-cedb-4101-83e7-71e012ce012f
06/01/2024 01:56:34;1704502594;32768;-0,2756045;-0,2153131;Agent;Large;37a247a3-cedb-4101-83e7-71e012ce012f
06/01/2024 01:56:34;1704502594;32768;0,4850683;0,6257035;Agent;Medium;619304a9-a392-43b0-abc2-40a85f8efd4b
06/01/2024 01:56:34;1704502594;32768;0,4850683;0,6257035;Agent;Medium;619304a9-a392-43b0-abc2-40a85f8efd4b
06/01/2024 01:56:34;1704502594;32768;-0,423181;0,19015;Agent;Medium;37a247a3-cedb-4101-83e7-71e012ce012f
06/01/2024 01:56:34;1704502594;32779;0,5471852;1,069886;Agent;Large;f3a1c6b3-28fc-40c1-a43d-da7e992bbdc5
06/01/2024 01:56:34;1704502594;32779;-0,4201222;-0,3135243;Agent;Large;0ba2659b-df6d-448b-bbc0-f6c8d3a53ef0
06/01/2024 01:56:34;1704502594;32779;0,606639;0,6468481;Agent;Medium;f3a1c6b3-28fc-40c1-a43d-da7e992bbdc5
06/01/2024 01:56:34;1704502594;32779;0,606639;0,6468481;Agent;Medium;f3a1c6b3-28fc-40c1-a43d-da7e992bbdc5
06/01/2024 01:56:34;1704502594;32779;-0,4420823;0,1054977;Agent;Medium;0ba2659b-df6d-448b-bbc0-f6c8d3a53ef0
06/01/2024 01:56:34;1704502594;32779;-0,4420823;0,1054977;Agent;Medium;0ba2659b-df6d-448b-bbc0-f6c8d3a53ef0
06/01/2024 01:56:34;1704502594;32790;0,2460789;0,9875025;Agent;Large;e13c2990-9dac-464b-b111-ecee42a3d0a7
06/01/2024 01:56:34;1704502594;32790;0,2460789;0,9875025;Agent;Medium;e13c2990-9dac-464b-b111-ecee42a3d0a7
06/01/2024 01:56:34;1704502594;32790;0,2460789;0,9875025;Agent;Medium;e13c2990-9dac-464b-b111-ecee42a3d0a7
06/01/2024 01:56:34;1704502594;32790;0,2460789;0,9875025;Agent;Medium;e13c2990-9dac-464b-b111-ecee42a3d0a7
06/01/2024 01:56:34;1704502594;32790;-0,2680909;-0,07494675;Agent;Medium;229d5665-9690-408b-9b60-de23ab70659b
06/01/2024 01:56:34;1704502594;32790;-0,2680909;-0,07494675;Agent;Medium;229d5665-9690-408b-9b60-de23ab70659b
06/01/2024 01:56:34;1704502594;32790;-0,2680909;-0,07494675;Agent;Medium;229d5665-9690-408b-9b60-de23ab70659b
06/01/2024 01:56:34;1704502594;32790;0,2780316;0,530556;Agent;Small;e13c2990-9dac-464b-b111-ecee42a3d0a7
06/01/2024 01:56:34;1704502594;32790;0,2780316;0,530556;Agent;Small;e13c2990-9dac-464b-b111-ecee42a3d0a7
06/01/2024 01:56:34;1704502594;32790;0,2780316;0,530556;Agent;Small;e13c2990-9dac-464b-b111-ecee42a3d0a7
06/01/2024 01:56:34;1704502594;32790;0,2780316;0,530556;Agent;Small;e13c2990-9dac-464b-b111-ecee42a3d0a7
06/01/2024 01:56:34;1704502594;32790;-0,3324085;0,3826981;Agent;Small;229d5665-9690-408b-9b60-de23ab70659b
06/01/2024 01:56:34;1704502594;32790;-0,3324085;0,3826981;Agent;Small;229d5665-9690-408b-9b60-de23ab70659b
06/01/2024 01:56:34;1704502594;32790;-0,3324085;0,3826981;Agent;Small;229d5665-9690-408b-9b60-de23ab70659b
06/01/2024 01:56:35;1704502595;32801;0,7600785;0,9819958;Agent;Large;78099d87-d288-4de6-bfdf-1b93554b4eec
06/01/2024 01:56:35;1704502595;32801;0,7600785;0,9819958;Agent;Large;78099d87-d288-4de6-bfdf-1b93554b4eec
06/01/2024 01:56:35;1704502595;32801;-0,3550044;-0,04376586;Agent;Large;ef625fd9-5fcf-4666-ab80-687a570010c9
06/01/2024 01:56:35;1704502595;32811;0,3622623;0,7163819;Agent;Medium;be0b4169-5660-4469-a2a0-1a06d8c8115b
06/01/2024 01:56:35;1704502595;32811;0,3622623;0,7163819;Agent;Medium;be0b4169-5660-4469-a2a0-1a06d8c8115b
06/01/2024 01:56:35;1704502595;32811;-0,6209822;-0,02744949;Agent;Large;7eccca43-710e-44b3-a1d4-bc9907754006
06/01/2024 01:56:35;1704502595;32811;-0,6209822;-0,02744949;Agent;Medium;7eccca43-710e-44b3-a1d4-bc9907754006
06/01/2024 01:56:35;1704502595;32823;0,4129401;0,8308517;Agent;Medium;7f4faae5-bcff-406f-acac-e629d37792e8
06/01/2024 01:56:35;1704502595;32823;0,4129401;0,8308517;Agent;Medium;7f4faae5-bcff-406f-acac-e629d37792e8
06/01/2024 01:56:35;1704502595;32823;-0,3922009;-0,08646114;Agent;Medium;dafa8106-7ee1-4f5a-b2e4-6ece656947a6
06/01/2024 01:56:35;1704502595;32823;-0,3922009;-0,08646114;Agent;Medium;dafa8106-7ee1-4f5a-b2e4-6ece656947a6
06/01/2024 01:56:35;1704502595;32823;0,4680259;0,3822147;Agent;Medium;7f4faae5-bcff-406f-acac-e629d37792e8
06/01/2024 01:56:35;1704502595;32833;0,2117393;0,7072612;Agent;Large;35f06e17-e036-4bb9-ba17-4fe102af1e86
06/01/2024 01:56:35;1704502595;32833;0,2117393;0,7072612;Agent;Large;35f06e17-e036-4bb9-ba17-4fe102af1e86
06/01/2024 01:56:35;1704502595;32833;-0,4812822;-0,7195368;Agent;Large;fa8f08b0-c6e7-4050-a6c1-c187076a3007
06/01/2024 01:56:35;1704502595;32833;0,2362705;0,2391773;Agent;Medium;35f06e17-e036-4bb9-ba17-4fe102af1e86
06/01/2024 01:56:35;1704502595;32833;0,2362705;0,2391773;Agent;Small;35f06e17-e036-4bb9-ba17-4fe102af1e86
06/01/2024 01:56:35;1704502595;32833;0,2362705;0,2391773;Agent;Small;35f06e17-e036-4bb9-ba17-4fe102af1e86
06/01/2024 01:56:35;1704502595;32833;-0,4812822;-0,2707176;Agent;Medium;fa8f08b0-c6e7-4050-a6c1-c187076a3007
06/01/2024 01:56:35;1704502595;32833;-0,4812822;-0,2707176;Agent;Small;fa8f08b0-c6e7-4050-a6c1-c187076a3007
06/01/2024 01:56:35;1704502595;32833;-0,4812822;-0,2707176;Agent;Medium;fa8f08b0-c6e7-4050-a6c1-c187076a3007
06/01/2024 01:56:35;1704502595;32844;0,3068032;0,4784658;Agent;Large;2d6eba1c-1422-4ca4-a0d5-9afe05ed830c
06/01/2024 01:56:35;1704502595;32844;0,3068032;0,4784658;Agent;Large;2d6eba1c-1422-4ca4-a0d5-9afe05ed830c
06/01/2024 01:56:35;1704502595;32844;-0,4802734;-0,9224156;Agent;Large;b81ae0bd-563c-49c7-8dd3-de9eb8f59e1f
06/01/2024 01:56:35;1704502595;32844;-0,4802734;-0,9224156;Agent;Large;b81ae0bd-563c-49c7-8dd3-de9eb8f59e1f
06/01/2024 01:56:35;1704502595;32844;0,437374;0,05138746;Agent;Medium;2d6eba1c-1422-4ca4-a0d5-9afe05ed830c
06/01/2024 01:56:35;1704502595;32844;0,437374;0,05138746;Agent;Medium;2d6eba1c-1422-4ca4-a0d5-9afe05ed830c
06/01/2024 01:56:35;1704502595;32844;-0,5518205;-0,4706842;Agent;Medium;b81ae0bd-563c-49c7-8dd3-de9eb8f59e1f
06/01/2024 01:56:35;1704502595;32844;-0,5518205;-0,4706842;Agent;Medium;b81ae0bd-563c-49c7-8dd3-de9eb8f59e1f
06/01/2024 01:56:36;1704502596;32854;0,08615014;0,5641711;Agent;Large;6a6e255f-2306-4f03-ba26-9bfbe5bd555d
06/01/2024 01:56:36;1704502596;32854;0,08615014;0,5641711;Agent;Large;6a6e255f-2306-4f03-ba26-9bfbe5bd555d
06/01/2024 01:56:36;1704502596;32854;0,08615014;0,5641711;Agent;Large;6a6e255f-2306-4f03-ba26-9bfbe5bd555d
06/01/2024 01:56:36;1704502596;32854;-0,4876162;-0,8758757;Agent;Large;8c26f68d-b5c1-4ec3-9e4a-1542b21b1bf0
06/01/2024 01:56:36;1704502596;32854;-0,4876162;-0,8758757;Agent;Large;8c26f68d-b5c1-4ec3-9e4a-1542b21b1bf0
06/01/2024 01:56:36;1704502596;32855;0,09424615;0,1003486;Agent;Small;6a6e255f-2306-4f03-ba26-9bfbe5bd555d
06/01/2024 01:56:36;1704502596;32855;0,09424615;0,1003486;Agent;Small;6a6e255f-2306-4f03-ba26-9bfbe5bd555d
06/01/2024 01:56:36;1704502596;32855;0,09424615;0,1003486;Agent;Medium;6a6e255f-2306-4f03-ba26-9bfbe5bd555d
06/01/2024 01:56:36;1704502596;32855;-0,5793235;-0,4786486;Agent;Small;8c26f68d-b5c1-4ec3-9e4a-1542b21b1bf0
06/01/2024 01:56:36;1704502596;32855;-0,5793235;-0,4786486;Agent;Small;8c26f68d-b5c1-4ec3-9e4a-1542b21b1bf0
06/01/2024 01:56:36;1704502596;32866;0,3726473;0,447706;Agent;Medium;827903f9-ee2a-4b60-83ac-933bbd816f99
06/01/2024 01:56:36;1704502596;32866;0,3726473;0,447706;Agent;Medium;827903f9-ee2a-4b60-83ac-933bbd816f99
06/01/2024 01:56:36;1704502596;32866;0,3726473;0,447706;Agent;Medium;827903f9-ee2a-4b60-83ac-933bbd816f99
06/01/2024 01:56:36;1704502596;32866;-0,3254669;-0,4261442;Agent;Medium;9310cdab-37fe-4070-a430-af6e9d60ad89
06/01/2024 01:56:36;1704502596;32866;-0,3254669;-0,4261442;Agent;Medium;9310cdab-37fe-4070-a430-af6e9d60ad89
06/01/2024 01:56:36;1704502596;32877;0,6214708;0,841797;Agent;Large;182214cc-7a14-4b1f-8f9f-cdf4f83ab56d
06/01/2024 01:56:36;1704502596;32877;0,6214708;0,841797;Agent;Medium;182214cc-7a14-4b1f-8f9f-cdf4f83ab56d
06/01/2024 01:56:36;1704502596;32877;-0,4282846;0,1911337;Agent;Medium;d688e05c-bafd-4d7b-910a-18fdf776ddda
06/01/2024 01:56:36;1704502596;32877;-0,4282846;0,1911337;Agent;Medium;d688e05c-bafd-4d7b-910a-18fdf776ddda
06/01/2024 01:56:36;1704502596;32888;0,4157757;0,5225894;Agent;Large;0859894b-b074-4d4b-a1e8-773fa4aefc55
06/01/2024 01:56:36;1704502596;32888;0,4157757;0,5225894;Agent;Medium;0859894b-b074-4d4b-a1e8-773fa4aefc55
06/01/2024 01:56:36;1704502596;32888;-0,09054223;-0,6817143;Agent;Large;62b74b71-1aed-4f45-a145-6c039d530723
06/01/2024 01:56:36;1704502596;32888;-0,09054223;-0,6817143;Agent;Medium;62b74b71-1aed-4f45-a145-6c039d530723
06/01/2024 01:56:36;1704502596;32888;-0,09054223;-0,6817143;Agent;Large;62b74b71-1aed-4f45-a145-6c039d530723
06/01/2024 01:56:36;1704502596;32888;0,4978589;0,05707198;Agent;Small;0859894b-b074-4d4b-a1e8-773fa4aefc55
06/01/2024 01:56:36;1704502596;32888;0,4978589;0,05707198;Agent;Small;0859894b-b074-4d4b-a1e8-773fa4aefc55
06/01/2024 01:56:36;1704502596;32888;0,4978589;0,05707198;Agent;Small;0859894b-b074-4d4b-a1e8-773fa4aefc55
06/01/2024 01:56:36;1704502596;32888;-0,2000651;-0,2424424;Agent;Small;62b74b71-1aed-4f45-a145-6c039d530723
06/01/2024 01:56:36;1704502596;32888;-0,2000651;-0,2424424;Agent;Small;62b74b71-1aed-4f45-a145-6c039d530723
06/01/2024 01:56:36;1704502596;32888;-0,2000651;-0,2424424;Agent;Small;62b74b71-1aed-4f45-a145-6c039d530723
06/01/2024 01:56:36;1704502596;32898;0,5077521;0,3692425;Agent;Medium;1ae72cea-3df4-4dc8-89c4-102b74cfbef5
06/01/2024 01:56:36;1704502596;32898;0,5077521;0,3692425;Agent;Medium;1ae72cea-3df4-4dc8-89c4-102b74cfbef5
06/01/2024 01:56:36;1704502596;32898;-0,4736857;-0,2386129;Agent;Medium;39f68050-4650-45f2-8e19-6b367bb34cda
06/01/2024 01:56:36;1704502596;32898;-0,4736857;-0,2386129;Agent;Medium;39f68050-4650-45f2-8e19-6b367bb34cda
06/01/2024 01:56:36;1704502596;32908;0,2814178;1,210085;Agent;Large;76e50849-96e2-43d2-88b8-25361e7f8b24
06/01/2024 01:56:36;1704502596;32908;-0,295684;-0,3778741;Agent;Large;eaaf05f4-81d9-469b-8f2f-07e790b72bd6
06/01/2024 01:56:36;1704502596;32908;0,3553171;0,7909818;Agent;Medium;76e50849-96e2-43d2-88b8-25361e7f8b24
06/01/2024 01:56:36;1704502596;32908;0,3553171;0,7909818;Agent;Medium;76e50849-96e2-43d2-88b8-25361e7f8b24
06/01/2024 01:56:36;1704502596;32908;0,3553171;0,7909818;Agent;Medium;76e50849-96e2-43d2-88b8-25361e7f8b24
06/01/2024 01:56:36;1704502596;32908;-0,3114442;0,07344331;Agent;Medium;eaaf05f4-81d9-469b-8f2f-07e790b72bd6
06/01/2024 01:56:36;1704502596;32908;-0,3114442;0,07344331;Agent;Medium;eaaf05f4-81d9-469b-8f2f-07e790b72bd6
06/01/2024 01:56:36;1704502596;32908;-0,3114442;0,07344331;Agent;Medium;eaaf05f4-81d9-469b-8f2f-07e790b72bd6
06/01/2024 01:56:37;1704502597;32919;0,4268569;0,8711079;Agent;Large;fdf4cd76-cc08-4cbf-99d2-26261ae06365
06/01/2024 01:56:37;1704502597;32919;0,4268569;0,8711079;Agent;Large;fdf4cd76-cc08-4cbf-99d2-26261ae06365
06/01/2024 01:56:37;1704502597;32919;-0,3344527;-0,2057955;Agent;Large;f389f3b0-ec6b-4c55-bfb9-1dada8b583c9
06/01/2024 01:56:37;1704502597;32919;-0,3344527;-0,2057955;Agent;Large;f389f3b0-ec6b-4c55-bfb9-1dada8b583c9
06/01/2024 01:56:37;1704502597;32919;0,4740052;0,4225237;Agent;Medium;fdf4cd76-cc08-4cbf-99d2-26261ae06365
06/01/2024 01:56:37;1704502597;32919;0,4740052;0,4225237;Agent;Medium;fdf4cd76-cc08-4cbf-99d2-26261ae06365
06/01/2024 01:56:37;1704502597;32919;-0,4525481;0,2349428;Agent;Medium;f389f3b0-ec6b-4c55-bfb9-1dada8b583c9
06/01/2024 01:56:37;1704502597;32930;0,4059879;0,925852;Agent;Medium;cd62a736-9fdf-402c-8c25-5db6543d70e3
06/01/2024 01:56:37;1704502597;32930;0,4059879;0,925852;Agent;Medium;cd62a736-9fdf-402c-8c25-5db6543d70e3
06/01/2024 01:56:37;1704502597;32930;-0,385178;0,1024341;Agent;Large;dd31ff44-9c5d-45ab-955e-5e40b3d07327
06/01/2024 01:56:37;1704502597;32930;-0,385178;0,1024341;Agent;Medium;dd31ff44-9c5d-45ab-955e-5e40b3d07327
06/01/2024 01:56:37;1704502597;32930;-0,385178;0,1024341;Agent;Medium;dd31ff44-9c5d-45ab-955e-5e40b3d07327
06/01/2024 01:56:37;1704502597;32941;0,3927328;0,8061484;Agent;Large;113ba2ca-6143-452d-b429-4c34fcadf3cc
06/01/2024 01:56:37;1704502597;32941;0,3927328;0,8061484;Agent;Large;113ba2ca-6143-452d-b429-4c34fcadf3cc
06/01/2024 01:56:37;1704502597;32941;-0,8596697;-0,1830692;Agent;Large;7cd2ad2b-70fc-49c0-920e-b7cbf47a12d1
06/01/2024 01:56:37;1704502597;32951;0,2012515;0,88296;Agent;Large;2ec5825b-85a8-4bae-8da3-56d783513d0a
06/01/2024 01:56:37;1704502597;32951;0,2012515;0,88296;Agent;Large;2ec5825b-85a8-4bae-8da3-56d783513d0a
06/01/2024 01:56:37;1704502597;32951;0,2012515;0,88296;Agent;Large;2ec5825b-85a8-4bae-8da3-56d783513d0a
06/01/2024 01:56:37;1704502597;32951;0,2012515;0,88296;Agent;Large;2ec5825b-85a8-4bae-8da3-56d783513d0a
06/01/2024 01:56:37;1704502597;32951;-0,258041;-0,5244454;Agent;Large;0cc3b9d3-c17f-4278-9461-486661a3648c
06/01/2024 01:56:37;1704502597;32951;-0,258041;-0,5244454;Agent;Large;0cc3b9d3-c17f-4278-9461-486661a3648c
06/01/2024 01:56:37;1704502597;32952;0,209772;0,3948265;Agent;Small;2ec5825b-85a8-4bae-8da3-56d783513d0a
06/01/2024 01:56:37;1704502597;32952;0,209772;0,3948265;Agent;Small;2ec5825b-85a8-4bae-8da3-56d783513d0a
06/01/2024 01:56:37;1704502597;32952;0,209772;0,3948265;Agent;Small;2ec5825b-85a8-4bae-8da3-56d783513d0a
06/01/2024 01:56:37;1704502597;32952;0,209772;0,3948265;Agent;Small;2ec5825b-85a8-4bae-8da3-56d783513d0a
06/01/2024 01:56:37;1704502597;32952;-0,3578125;-0,09228791;Agent;Small;0cc3b9d3-c17f-4278-9461-486661a3648c
06/01/2024 01:56:37;1704502597;32952;-0,3578125;-0,09228791;Agent;Small;0cc3b9d3-c17f-4278-9461-486661a3648c
06/01/2024 01:56:37;1704502597;32952;-0,3578125;-0,09228791;Agent;Small;0cc3b9d3-c17f-4278-9461-486661a3648c
06/01/2024 01:56:37;1704502597;32952;-0,3578125;-0,09228791;Agent;Small;0cc3b9d3-c17f-4278-9461-486661a3648c
06/01/2024 01:56:37;1704502597;32962;0,07608443;0,4235027;Agent;Medium;e64a3f46-0cc3-458b-ad49-ed08dc1e6dfc
06/01/2024 01:56:37;1704502597;32962;0,07608443;0,4235027;Agent;Medium;e64a3f46-0cc3-458b-ad49-ed08dc1e6dfc
06/01/2024 01:56:37;1704502597;32962;0,07608443;0,4235027;Agent;Medium;e64a3f46-0cc3-458b-ad49-ed08dc1e6dfc
06/01/2024 01:56:37;1704502597;32962;-0,3456088;-0,4966493;Agent;Medium;427c87e8-c6f6-48c6-99e8-6582bc18535a
06/01/2024 01:56:37;1704502597;32962;-0,3456088;-0,4966493;Agent;Medium;427c87e8-c6f6-48c6-99e8-6582bc18535a
06/01/2024 01:56:37;1704502597;32962;-0,3456088;-0,4966493;Agent;Medium;427c87e8-c6f6-48c6-99e8-6582bc18535a
06/01/2024 01:56:37;1704502597;32962;0,2071736;-0,005270287;Agent;Small;e64a3f46-0cc3-458b-ad49-ed08dc1e6dfc
06/01/2024 01:56:37;1704502597;32962;0,2071736;-0,005270287;Agent;Small;e64a3f46-0cc3-458b-ad49-ed08dc1e6dfc
06/01/2024 01:56:37;1704502597;32962;-0,5291282;-0,06430498;Agent;Small;427c87e8-c6f6-48c6-99e8-6582bc18535a
06/01/2024 01:56:38;1704502598;32972;0,4754956;0,7179331;Agent;Large;445554e8-6b74-488a-a8b0-b3d0f177ed65
06/01/2024 01:56:38;1704502598;32972;0,4754956;0,7179331;Agent;Large;445554e8-6b74-488a-a8b0-b3d0f177ed65
06/01/2024 01:56:38;1704502598;32972;-0,3751936;-0,4805724;Agent;Large;7ad7271e-3a98-476e-89d6-8b6adfc10920
06/01/2024 01:56:38;1704502598;32972;-0,3751936;-0,4805724;Agent;Large;7ad7271e-3a98-476e-89d6-8b6adfc10920
06/01/2024 01:56:38;1704502598;32973;0,6010445;0,3072813;Agent;Medium;445554e8-6b74-488a-a8b0-b3d0f177ed65
06/01/2024 01:56:38;1704502598;32973;-0,4863068;-0,0658935;Agent;Medium;7ad7271e-3a98-476e-89d6-8b6adfc10920
06/01/2024 01:56:38;1704502598;32983;0,6865021;0,5568652;Agent;Large;2087dd4c-fe4e-4c3a-a98a-11caafc4fba3
06/01/2024 01:56:38;1704502598;32983;-0,4762651;-0,06546801;Agent;Large;6be1398c-ce36-43c6-91e3-f068c40fb52a
06/01/2024 01:56:38;1704502598;32994;0,2446529;1,031088;Agent;Medium;ede460ae-5724-49cb-bced-a204314d4fde
06/01/2024 01:56:38;1704502598;32994;0,2446529;1,031088;Agent;Medium;ede460ae-5724-49cb-bced-a204314d4fde
06/01/2024 01:56:38;1704502598;32994;0,2446529;1,031088;Agent;Medium;ede460ae-5724-49cb-bced-a204314d4fde
06/01/2024 01:56:38;1704502598;32994;-0,4295963;0,2775786;Agent;Medium;6219e06b-6740-458e-9c4e-77af697994c8
06/01/2024 01:56:38;1704502598;32994;-0,4295963;0,2775786;Agent;Medium;6219e06b-6740-458e-9c4e-77af697994c8
06/01/2024 01:56:38;1704502598;32994;-0,4295963;0,2775786;Agent;Medium;6219e06b-6740-458e-9c4e-77af697994c8
06/01/2024 01:56:38;1704502598;33005;0,3749967;0,7144008;Agent;Medium;c79ea5e5-360e-46bd-a371-0d6275727d93
06/01/2024 01:56:38;1704502598;33005;0,3749967;0,7144008;Agent;Medium;c79ea5e5-360e-46bd-a371-0d6275727d93
06/01/2024 01:56:38;1704502598;33005;-0,302936;-0,2142369;Agent;Medium;82526441-ec0a-4f38-a359-f0ca0fa8f05a
06/01/2024 01:56:38;1704502598;33005;-0,302936;-0,2142369;Agent;Medium;82526441-ec0a-4f38-a359-f0ca0fa8f05a
06/01/2024 01:56:38;1704502598;33005;-0,302936;-0,2142369;Agent;Medium;82526441-ec0a-4f38-a359-f0ca0fa8f05a
06/01/2024 01:56:38;1704502598;33005;0,4496815;0,2908431;Agent;Medium;c79ea5e5-360e-46bd-a371-0d6275727d93
06/01/2024 01:56:38;1704502598;33016;0,3039591;0,8671879;Agent;Large;7523194e-e37b-4060-a42f-075fda40f68d
06/01/2024 01:56:38;1704502598;33016;0,3039591;0,8671879;Agent;Medium;7523194e-e37b-4060-a42f-075fda40f68d
06/01/2024 01:56:38;1704502598;33016;-0,6082339;0,0005277544;Agent;Medium;7a42ebda-8495-4752-9f21-cb101559c007
06/01/2024 01:56:39;1704502599;33026;0,340003;1,071246;Agent;Large;d3072612-a487-4f72-bb50-40fc9447faa1
06/01/2024 01:56:39;1704502599;33026;-0,2903005;-0,5033874;Agent;Large;9f7c0d2a-f348-41ff-8cfe-8c9eaa7244ef
06/01/2024 01:56:39;1704502599;33026;0,4060479;0,6013103;Agent;Medium;d3072612-a487-4f72-bb50-40fc9447faa1
06/01/2024 01:56:39;1704502599;33026;0,4060479;0,6013103;Agent;Medium;d3072612-a487-4f72-bb50-40fc9447faa1
06/01/2024 01:56:39;1704502599;33026;-0,4025759;-0,05307479;Agent;Medium;9f7c0d2a-f348-41ff-8cfe-8c9eaa7244ef
06/01/2024 01:56:39;1704502599;33026;-0,4025759;-0,05307479;Agent;Medium;9f7c0d2a-f348-41ff-8cfe-8c9eaa7244ef
06/01/2024 01:56:39;1704502599;33036;0,4826056;0,7206414;Agent;Large;2e0aaba7-6d44-4170-a343-0131ea31b215
06/01/2024 01:56:39;1704502599;33036;0,4826056;0,7206414;Agent;Large;2e0aaba7-6d44-4170-a343-0131ea31b215
06/01/2024 01:56:39;1704502599;33036;-0,4426686;-0,4845083;Agent;Large;e1722330-2af0-40c0-ae0e-9b6855f96d16
06/01/2024 01:56:39;1704502599;33036;-0,4426686;-0,4845083;Agent;Large;e1722330-2af0-40c0-ae0e-9b6855f96d16
06/01/2024 01:56:39;1704502599;33037;0,6075929;0,3118271;Agent;Medium;2e0aaba7-6d44-4170-a343-0131ea31b215
06/01/2024 01:56:39;1704502599;33037;-0,488516;-0,04830104;Agent;Medium;e1722330-2af0-40c0-ae0e-9b6855f96d16
06/01/2024 01:56:39;1704502599;33037;-0,488516;-0,04830104;Agent;Medium;e1722330-2af0-40c0-ae0e-9b6855f96d16
06/01/2024 01:56:39;1704502599;33047;0,3484379;0,8327724;Agent;Medium;291dd648-c2b1-46cd-8852-e99d6c2b1fcc
06/01/2024 01:56:39;1704502599;33047;0,3484379;0,8327724;Agent;Medium;291dd648-c2b1-46cd-8852-e99d6c2b1fcc
06/01/2024 01:56:39;1704502599;33047;-0,3285799;-0,1217951;Agent;Medium;5406ef68-80f7-47a5-8fcf-3067d4a2bccf
06/01/2024 01:56:39;1704502599;33047;-0,3285799;-0,1217951;Agent;Medium;5406ef68-80f7-47a5-8fcf-3067d4a2bccf
06/01/2024 01:56:39;1704502599;33047;-0,3285799;-0,1217951;Agent;Medium;5406ef68-80f7-47a5-8fcf-3067d4a2bccf
06/01/2024 01:56:39;1704502599;33048;0,4535376;0,3775364;Agent;Medium;291dd648-c2b1-46cd-8852-e99d6c2b1fcc
06/01/2024 01:56:39;1704502599;33057;0,2552433;0,7922957;Agent;Large;c6a400e5-b71a-423b-82e3-797d9f5353c0
06/01/2024 01:56:39;1704502599;33057;0,2552433;0,7922957;Agent;Large;c6a400e5-b71a-423b-82e3-797d9f5353c0
06/01/2024 01:56:39;1704502599;33057;0,2552433;0,7922957;Agent;Large;c6a400e5-b71a-423b-82e3-797d9f5353c0
06/01/2024 01:56:39;1704502599;33057;-0,4056579;-0,4384116;Agent;Large;88ea9a78-ec06-46c9-a3a9-de7d564188ae
06/01/2024 01:56:39;1704502599;33057;-0,4056579;-0,4384116;Agent;Large;88ea9a78-ec06-46c9-a3a9-de7d564188ae
06/01/2024 01:56:39;1704502599;33058;0,3183458;0,3432975;Agent;Medium;c6a400e5-b71a-423b-82e3-797d9f5353c0
06/01/2024 01:56:39;1704502599;33058;0,3183458;0,3432975;Agent;Medium;c6a400e5-b71a-423b-82e3-797d9f5353c0
06/01/2024 01:56:39;1704502599;33058;-0,5219764;-0,004305974;Agent;Medium;88ea9a78-ec06-46c9-a3a9-de7d564188ae
06/01/2024 01:56:39;1704502599;33058;-0,5219764;-0,004305974;Agent;Small;88ea9a78-ec06-46c9-a3a9-de7d564188ae
06/01/2024 01:56:39;1704502599;33069;0,3468212;0,8836997;Agent;Large;41c74ba6-24bf-4e61-bfe6-7f41ce187a74
06/01/2024 01:56:39;1704502599;33069;0,3468212;0,8836997;Agent;Medium;41c74ba6-24bf-4e61-bfe6-7f41ce187a74
06/01/2024 01:56:39;1704502599;33069;-0,4857867;0,005814195;Agent;Medium;96af05cf-a40c-43bf-816e-a58e3402e8f0
06/01/2024 01:56:39;1704502599;33069;-0,4857867;0,005814195;Agent;Large;96af05cf-a40c-43bf-816e-a58e3402e8f0
06/01/2024 01:56:39;1704502599;33079;0,4034511;1,13948;Agent;Large;bdbd8fac-9aa3-4ace-a34e-8083cf276e73
06/01/2024 01:56:39;1704502599;33079;0,4034511;1,13948;Agent;Large;bdbd8fac-9aa3-4ace-a34e-8083cf276e73
06/01/2024 01:56:39;1704502599;33079;0,4034511;1,13948;Agent;Large;bdbd8fac-9aa3-4ace-a34e-8083cf276e73
06/01/2024 01:56:39;1704502599;33079;-0,2645987;-0,1099668;Agent;Large;08759502-4b6f-48c2-bc1d-49f2191c7ae0
06/01/2024 01:56:39;1704502599;33079;-0,2645987;-0,1099668;Agent;Large;08759502-4b6f-48c2-bc1d-49f2191c7ae0
06/01/2024 01:56:40;1704502600;33080;0,4428836;0,6887657;Agent;Medium;bdbd8fac-9aa3-4ace-a34e-8083cf276e73
06/01/2024 01:56:40;1704502600;33080;0,4428836;0,6887657;Agent;Medium;bdbd8fac-9aa3-4ace-a34e-8083cf276e73
06/01/2024 01:56:40;1704502600;33080;-0,4162722;0,3305251;Agent;Medium;08759502-4b6f-48c2-bc1d-49f2191c7ae0
06/01/2024 01:56:40;1704502600;33090;0,2286428;0,5882915;Agent;Large;b57ed149-507d-4bbd-9630-5a7c9a1e3538
06/01/2024 01:56:40;1704502600;33090;0,2286428;0,5882915;Agent;Large;b57ed149-507d-4bbd-9630-5a7c9a1e3538
06/01/2024 01:56:40;1704502600;33090;0,2286428;0,5882915;Agent;Large;b57ed149-507d-4bbd-9630-5a7c9a1e3538
06/01/2024 01:56:40;1704502600;33090;-0,4238943;-0,6571912;Agent;Large;794f33ee-8a0c-4401-9c8e-8247d9891c7b
06/01/2024 01:56:40;1704502600;33090;-0,4238943;-0,6571912;Agent;Large;794f33ee-8a0c-4401-9c8e-8247d9891c7b
06/01/2024 01:56:40;1704502600;33091;0,3161968;0,1378655;Agent;Small;b57ed149-507d-4bbd-9630-5a7c9a1e3538
06/01/2024 01:56:40;1704502600;33091;0,3161968;0,1378655;Agent;Small;b57ed149-507d-4bbd-9630-5a7c9a1e3538
06/01/2024 01:56:40;1704502600;33091;0,3161968;0,1378655;Agent;Small;b57ed149-507d-4bbd-9630-5a7c9a1e3538
06/01/2024 01:56:40;1704502600;33091;-0,4548689;-0,2142318;Agent;Medium;794f33ee-8a0c-4401-9c8e-8247d9891c7b
06/01/2024 01:56:40;1704502600;33091;-0,4548689;-0,2142318;Agent;Small;794f33ee-8a0c-4401-9c8e-8247d9891c7b
06/01/2024 01:56:40;1704502600;33091;-0,4548689;-0,2142318;Agent;Small;794f33ee-8a0c-4401-9c8e-8247d9891c7b
06/01/2024 01:56:40;1704502600;33101;0,2673483;0,7275558;Agent;Large;424bef1f-5562-464a-a62c-a5c9e66a253b
06/01/2024 01:56:40;1704502600;33101;0,2673483;0,7275558;Agent;Large;424bef1f-5562-464a-a62c-a5c9e66a253b
06/01/2024 01:56:40;1704502600;33101;0,2673483;0,7275558;Agent;Large;424bef1f-5562-464a-a62c-a5c9e66a253b
06/01/2024 01:56:40;1704502600;33101;-0,303803;-0,5647184;Agent;Large;b87ca15a-9942-4e44-8100-e2d89835db87
06/01/2024 01:56:40;1704502600;33101;-0,303803;-0,5647184;Agent;Large;b87ca15a-9942-4e44-8100-e2d89835db87
06/01/2024 01:56:40;1704502600;33101;-0,303803;-0,5647184;Agent;Large;b87ca15a-9942-4e44-8100-e2d89835db87
06/01/2024 01:56:40;1704502600;33101;0,358703;0,2977657;Agent;Small;424bef1f-5562-464a-a62c-a5c9e66a253b
06/01/2024 01:56:40;1704502600;33101;0,358703;0,2977657;Agent;Small;424bef1f-5562-464a-a62c-a5c9e66a253b
06/01/2024 01:56:40;1704502600;33101;0,358703;0,2977657;Agent;Small;424bef1f-5562-464a-a62c-a5c9e66a253b
06/01/2024 01:56:40;1704502600;33101;0,358703;0,2977657;Agent;Small;424bef1f-5562-464a-a62c-a5c9e66a253b
06/01/2024 01:56:40;1704502600;33101;-0,3282889;-0,09749722;Agent;Small;b87ca15a-9942-4e44-8100-e2d89835db87
06/01/2024 01:56:40;1704502600;33101;-0,3282889;-0,09749722;Agent;Small;b87ca15a-9942-4e44-8100-e2d89835db87
06/01/2024 01:56:40;1704502600;33101;-0,3282889;-0,09749722;Agent;Medium;b87ca15a-9942-4e44-8100-e2d89835db87
06/01/2024 01:56:40;1704502600;33112;0,5388827;1,023655;Agent;Large;89708f04-2965-4b1d-9ff8-65ca2e713d73
06/01/2024 01:56:40;1704502600;33112;0,5388827;1,023655;Agent;Large;89708f04-2965-4b1d-9ff8-65ca2e713d73
06/01/2024 01:56:40;1704502600;33112;-0,435913;0,09240001;Agent;Large;dd948638-854f-4a3f-bd0d-38e634803daa
06/01/2024 01:56:40;1704502600;33112;0,5760009;0,5993964;Agent;Medium;89708f04-2965-4b1d-9ff8-65ca2e713d73
06/01/2024 01:56:40;1704502600;33112;-0,4515055;0,53891;Agent;Medium;dd948638-854f-4a3f-bd0d-38e634803daa
06/01/2024 01:56:40;1704502600;33123;0,2881255;1,298932;Agent;Large;afce4cc5-b499-41bc-a01a-9438febdb3c2
06/01/2024 01:56:40;1704502600;33123;0,2881255;1,298932;Agent;Large;afce4cc5-b499-41bc-a01a-9438febdb3c2
06/01/2024 01:56:40;1704502600;33123;-0,2798682;-0,1376805;Agent;Large;ffd43334-268d-4693-8720-e37c5d1beba2
06/01/2024 01:56:40;1704502600;33123;-0,2798682;-0,1376805;Agent;Large;ffd43334-268d-4693-8720-e37c5d1beba2
06/01/2024 01:56:40;1704502600;33123;-0,2798682;-0,1376805;Agent;Large;ffd43334-268d-4693-8720-e37c5d1beba2
06/01/2024 01:56:40;1704502600;33123;0,4218403;0,8873996;Agent;Medium;afce4cc5-b499-41bc-a01a-9438febdb3c2
06/01/2024 01:56:40;1704502600;33123;0,4218403;0,8873996;Agent;Medium;afce4cc5-b499-41bc-a01a-9438febdb3c2
06/01/2024 01:56:40;1704502600;33123;-0,4190391;0,290644;Agent;Medium;ffd43334-268d-4693-8720-e37c5d1beba2
06/01/2024 01:56:40;1704502600;33123;-0,4190391;0,290644;Agent;Medium;ffd43334-268d-4693-8720-e37c5d1beba2
06/01/2024 01:56:40;1704502600;33135;0,3055381;0,6646868;Agent;Large;4a5884af-7779-4269-9154-7357e638b6cd
06/01/2024 01:56:40;1704502600;33135;0,3055381;0,6646868;Agent;Large;4a5884af-7779-4269-9154-7357e638b6cd
06/01/2024 01:56:40;1704502600;33135;-0,5694228;-0,6639816;Agent;Large;403de2c1-136e-47b8-811f-e3b307078476
06/01/2024 01:56:40;1704502600;33135;0,3674256;0,2243354;Agent;Medium;4a5884af-7779-4269-9154-7357e638b6cd
06/01/2024 01:56:40;1704502600;33135;0,3674256;0,2243354;Agent;Medium;4a5884af-7779-4269-9154-7357e638b6cd
06/01/2024 01:56:40;1704502600;33135;-0,6436234;-0,2431674;Agent;Medium;403de2c1-136e-47b8-811f-e3b307078476
06/01/2024 01:56:40;1704502600;33135;-0,6436234;-0,2431674;Agent;Medium;403de2c1-136e-47b8-811f-e3b307078476
06/01/2024 01:56:41;1704502601;33146;0,3351738;1,210683;Agent;Large;e85ddc54-a54c-4fee-bc59-26e1a8d90c99
06/01/2024 01:56:41;1704502601;33146;0,3351738;1,210683;Agent;Large;e85ddc54-a54c-4fee-bc59-26e1a8d90c99
06/01/2024 01:56:41;1704502601;33146;-0,4424962;-0,1335511;Agent;Large;9346f1df-cf43-4a9e-ac88-a09e6c230dc5
06/01/2024 01:56:41;1704502601;33146;-0,4424962;-0,1335511;Agent;Large;9346f1df-cf43-4a9e-ac88-a09e6c230dc5
06/01/2024 01:56:41;1704502601;33146;0,3700649;0,8118783;Agent;Medium;e85ddc54-a54c-4fee-bc59-26e1a8d90c99
06/01/2024 01:56:41;1704502601;33146;0,3700649;0,8118783;Agent;Medium;e85ddc54-a54c-4fee-bc59-26e1a8d90c99
06/01/2024 01:56:41;1704502601;33146;-0,5044047;0,3069502;Agent;Medium;9346f1df-cf43-4a9e-ac88-a09e6c230dc5
06/01/2024 01:56:41;1704502601;33146;-0,5044047;0,3069502;Agent;Medium;9346f1df-cf43-4a9e-ac88-a09e6c230dc5
06/01/2024 01:56:41;1704502601;33146;-0,5044047;0,3069502;Agent;Medium;9346f1df-cf43-4a9e-ac88-a09e6c230dc5
06/01/2024 01:56:41;1704502601;33158;0,4379647;1,082238;Agent;Large;3f1037c6-6dc3-4e8c-a74f-9e9b836c7946
06/01/2024 01:56:41;1704502601;33158;0,4379647;1,082238;Agent;Large;3f1037c6-6dc3-4e8c-a74f-9e9b836c7946
06/01/2024 01:56:41;1704502601;33158;-0,6555983;0,1885983;Agent;Large;9f4508aa-48c4-421c-adaf-38e653e01233
06/01/2024 01:56:41;1704502601;33158;-0,6555983;0,1885983;Agent;Large;9f4508aa-48c4-421c-adaf-38e653e01233
06/01/2024 01:56:41;1704502601;33169;0,1614853;0,5906019;Agent;Medium;bb186c2c-70f7-4dbb-99f0-fc8719873c15
06/01/2024 01:56:41;1704502601;33169;0,1614853;0,5906019;Agent;Medium;bb186c2c-70f7-4dbb-99f0-fc8719873c15
06/01/2024 01:56:41;1704502601;33169;0,1614853;0,5906019;Agent;Medium;bb186c2c-70f7-4dbb-99f0-fc8719873c15
06/01/2024 01:56:41;1704502601;33169;0,1614853;0,5906019;Agent;Medium;bb186c2c-70f7-4dbb-99f0-fc8719873c15
06/01/2024 01:56:41;1704502601;33169;-0,1914644;-0,2802967;Agent;Medium;2660a039-d6fa-429d-87f8-374cbc461d93
06/01/2024 01:56:41;1704502601;33169;-0,1914644;-0,2802967;Agent;Medium;2660a039-d6fa-429d-87f8-374cbc461d93
06/01/2024 01:56:41;1704502601;33169;-0,1914644;-0,2802967;Agent;Medium;2660a039-d6fa-429d-87f8-374cbc461d93
06/01/2024 01:56:41;1704502601;33169;-0,1914644;-0,2802967;Agent;Medium;2660a039-d6fa-429d-87f8-374cbc461d93
06/01/2024 01:56:41;1704502601;33169;0,2881471;0,1975573;Agent;Small;bb186c2c-70f7-4dbb-99f0-fc8719873c15
06/01/2024 01:56:41;1704502601;33169;0,2881471;0,1975573;Agent;Small;bb186c2c-70f7-4dbb-99f0-fc8719873c15
06/01/2024 01:56:41;1704502601;33169;0,2881471;0,1975573;Agent;Small;bb186c2c-70f7-4dbb-99f0-fc8719873c15
06/01/2024 01:56:41;1704502601;33169;-0,3179796;0,09288174;Agent;Small;2660a039-d6fa-429d-87f8-374cbc461d93
06/01/2024 01:56:41;1704502601;33169;-0,3179796;0,09288174;Agent;Small;2660a039-d6fa-429d-87f8-374cbc461d93
06/01/2024 01:56:41;1704502601;33180;0,529452;1,026751;Agent;Large;fb184c95-43cb-42c3-ae37-22b2b81aa82e
06/01/2024 01:56:41;1704502601;33180;0,529452;1,026751;Agent;Large;fb184c95-43cb-42c3-ae37-22b2b81aa82e
06/01/2024 01:56:41;1704502601;33180;-0,2661707;-0,3668671;Agent;Large;aae7288e-0fac-491a-8965-7d1824cb7c03
06/01/2024 01:56:41;1704502601;33180;0,537318;0,5761272;Agent;Medium;fb184c95-43cb-42c3-ae37-22b2b81aa82e
06/01/2024 01:56:41;1704502601;33180;0,537318;0,5761272;Agent;Medium;fb184c95-43cb-42c3-ae37-22b2b81aa82e
06/01/2024 01:56:41;1704502601;33180;-0,3286509;0,07770459;Agent;Medium;aae7288e-0fac-491a-8965-7d1824cb7c03
06/01/2024 01:56:41;1704502601;33180;-0,3286509;0,07770459;Agent;Medium;aae7288e-0fac-491a-8965-7d1824cb7c03
06/01/2024 01:56:41;1704502601;33180;-0,3286509;0,07770459;Agent;Medium;aae7288e-0fac-491a-8965-7d1824cb7c03
06/01/2024 01:56:41;1704502601;33191;0,450452;0,1931137;Agent;Medium;a5df94b3-43f7-4562-a5b1-97b749054f85
06/01/2024 01:56:41;1704502601;33191;0,450452;0,1931137;Agent;Medium;a5df94b3-43f7-4562-a5b1-97b749054f85
06/01/2024 01:56:41;1704502601;33191;-0,2304199;-0,7065271;Agent;Medium;1bc99402-8672-444d-a196-aab8a37148da
06/01/2024 01:56:41;1704502601;33191;-0,2304199;-0,7065271;Agent;Medium;1bc99402-8672-444d-a196-aab8a37148da
06/01/2024 01:56:41;1704502601;33191;-0,2304199;-0,7065271;Agent;Medium;1bc99402-8672-444d-a196-aab8a37148da
06/01/2024 01:56:42;1704502602;33201;-0,07916661;0,9309728;Agent;Large;6fd4c621-3c11-4028-a8ea-c1193f982a40
06/01/2024 01:56:42;1704502602;33201;-0,07916661;0,9309728;Agent;Large;6fd4c621-3c11-4028-a8ea-c1193f982a40
06/01/2024 01:56:42;1704502602;33201;-0,07916661;0,9309728;Agent;Large;6fd4c621-3c11-4028-a8ea-c1193f982a40
06/01/2024 01:56:42;1704502602;33201;-0,07916661;0,9309728;Agent;Large;6fd4c621-3c11-4028-a8ea-c1193f982a40
06/01/2024 01:56:42;1704502602;33201;-0,4080222;-0,5858879;Agent;Large;f63b74a2-e577-4143-b210-f504d6d72a26
06/01/2024 01:56:42;1704502602;33201;-0,4080222;-0,5858879;Agent;Large;f63b74a2-e577-4143-b210-f504d6d72a26
06/01/2024 01:56:42;1704502602;33201;-0,4080222;-0,5858879;Agent;Large;f63b74a2-e577-4143-b210-f504d6d72a26
06/01/2024 01:56:42;1704502602;33202;-0,06342831;0,4802848;Agent;Small;6fd4c621-3c11-4028-a8ea-c1193f982a40
06/01/2024 01:56:42;1704502602;33202;-0,06342831;0,4802848;Agent;Small;6fd4c621-3c11-4028-a8ea-c1193f982a40
06/01/2024 01:56:42;1704502602;33202;-0,06342831;0,4802848;Agent;Small;6fd4c621-3c11-4028-a8ea-c1193f982a40
06/01/2024 01:56:42;1704502602;33202;-0,06342831;0,4802848;Agent;Small;6fd4c621-3c11-4028-a8ea-c1193f982a40
06/01/2024 01:56:42;1704502602;33202;-0,06342831;0,4802848;Agent;Small;6fd4c621-3c11-4028-a8ea-c1193f982a40
06/01/2024 01:56:42;1704502602;33202;-0,480828;-0,1262083;Agent;Small;f63b74a2-e577-4143-b210-f504d6d72a26
06/01/2024 01:56:42;1704502602;33202;-0,480828;-0,1262083;Agent;Small;f63b74a2-e577-4143-b210-f504d6d72a26
06/01/2024 01:56:42;1704502602;33202;-0,480828;-0,1262083;Agent;Small;f63b74a2-e577-4143-b210-f504d6d72a26
06/01/2024 01:56:42;1704502602;33202;-0,480828;-0,1262083;Agent;Small;f63b74a2-e577-4143-b210-f504d6d72a26
06/01/2024 01:56:42;1704502602;33212;0,3932104;0,4831893;Agent;Large;d6ca1cf3-b27a-4972-afb6-01bed1b42677
06/01/2024 01:56:42;1704502602;33212;0,3932104;0,4831893;Agent;Large;d6ca1cf3-b27a-4972-afb6-01bed1b42677
06/01/2024 01:56:42;1704502602;33212;-0,1839427;-0,8818223;Agent;Large;a830d344-86ce-4a5c-9981-56c6faefed19
06/01/2024 01:56:42;1704502602;33212;-0,1839427;-0,8818223;Agent;Large;a830d344-86ce-4a5c-9981-56c6faefed19
06/01/2024 01:56:42;1704502602;33212;0,5152777;0,02762731;Agent;Medium;d6ca1cf3-b27a-4972-afb6-01bed1b42677
06/01/2024 01:56:42;1704502602;33212;0,5152777;0,02762731;Agent;Medium;d6ca1cf3-b27a-4972-afb6-01bed1b42677
06/01/2024 01:56:42;1704502602;33212;-0,2827846;-0,4536908;Agent;Medium;a830d344-86ce-4a5c-9981-56c6faefed19
06/01/2024 01:56:42;1704502602;33212;-0,2827846;-0,4536908;Agent;Medium;a830d344-86ce-4a5c-9981-56c6faefed19
06/01/2024 01:56:42;1704502602;33223;0,4481195;0,3299078;Agent;Medium;95f3f9a7-8adf-47b4-a25b-c0c7ecdbe562
06/01/2024 01:56:42;1704502602;33223;0,4481195;0,3299078;Agent;Medium;95f3f9a7-8adf-47b4-a25b-c0c7ecdbe562
06/01/2024 01:56:42;1704502602;33223;0,4481195;0,3299078;Agent;Medium;95f3f9a7-8adf-47b4-a25b-c0c7ecdbe562
06/01/2024 01:56:42;1704502602;33223;-0,3806772;-0,462808;Agent;Medium;7ca98648-1b79-4d14-bd27-53d9422241d2
06/01/2024 01:56:42;1704502602;33223;-0,3806772;-0,462808;Agent;Medium;7ca98648-1b79-4d14-bd27-53d9422241d2
06/01/2024 01:56:42;1704502602;33234;0,3440722;0,8570266;Agent;Large;6f5c28d2-5f41-41ee-817e-0713b9a82900
06/01/2024 01:56:42;1704502602;33234;0,3440722;0,8570266;Agent;Large;6f5c28d2-5f41-41ee-817e-0713b9a82900
06/01/2024 01:56:42;1704502602;33234;0,3440722;0,8570266;Agent;Large;6f5c28d2-5f41-41ee-817e-0713b9a82900
06/01/2024 01:56:42;1704502602;33234;0,3440722;0,8570266;Agent;Large;6f5c28d2-5f41-41ee-817e-0713b9a82900
06/01/2024 01:56:42;1704502602;33234;-0,07997064;-0,5885741;Agent;Large;da1d6a4b-fd22-4ac7-8edd-f19e8763768b
06/01/2024 01:56:42;1704502602;33234;-0,07997064;-0,5885741;Agent;Large;da1d6a4b-fd22-4ac7-8edd-f19e8763768b
06/01/2024 01:56:42;1704502602;33234;-0,07997064;-0,5885741;Agent;Large;da1d6a4b-fd22-4ac7-8edd-f19e8763768b
06/01/2024 01:56:42;1704502602;33234;0,3520356;0,4008104;Agent;Small;6f5c28d2-5f41-41ee-817e-0713b9a82900
06/01/2024 01:56:42;1704502602;33234;0,3520356;0,4008104;Agent;Small;6f5c28d2-5f41-41ee-817e-0713b9a82900
06/01/2024 01:56:42;1704502602;33234;0,3520356;0,4008104;Agent;Small;6f5c28d2-5f41-41ee-817e-0713b9a82900
06/01/2024 01:56:42;1704502602;33234;0,3520356;0,4008104;Agent;Small;6f5c28d2-5f41-41ee-817e-0713b9a82900
06/01/2024 01:56:42;1704502602;33234;-0,1051244;-0,1086116;Agent;Small;da1d6a4b-fd22-4ac7-8edd-f19e8763768b
06/01/2024 01:56:42;1704502602;33234;-0,1051244;-0,1086116;Agent;Small;da1d6a4b-fd22-4ac7-8edd-f19e8763768b
06/01/2024 01:56:42;1704502602;33234;-0,1051244;-0,1086116;Agent;Small;da1d6a4b-fd22-4ac7-8edd-f19e8763768b
06/01/2024 01:56:42;1704502602;33234;-0,1051244;-0,1086116;Agent;Small;da1d6a4b-fd22-4ac7-8edd-f19e8763768b
06/01/2024 01:56:42;1704502602;33234;-0,1051244;-0,1086116;Agent;Small;da1d6a4b-fd22-4ac7-8edd-f19e8763768b
06/01/2024 01:56:42;1704502602;33244;0,4180237;1,456022;Agent;Large;24e3b244-44d6-445c-990f-5382f35b5754
06/01/2024 01:56:42;1704502602;33244;0,4180237;1,456022;Agent;Large;24e3b244-44d6-445c-990f-5382f35b5754
06/01/2024 01:56:42;1704502602;33244;-0,6909323;0,5230067;Agent;Large;644a9546-f94e-4178-8235-577baaef7bd0
06/01/2024 01:56:42;1704502602;33244;-0,6909323;0,5230067;Agent;Large;644a9546-f94e-4178-8235-577baaef7bd0
06/01/2024 01:56:43;1704502603;33255;0,8023704;0,9515977;Agent;Large;f37842cf-079e-4056-a5a5-73205af39e85
06/01/2024 01:56:43;1704502603;33266;0,4019503;0,9257034;Agent;Large;1a1bc6a5-74f0-49f0-8738-92f6b0e31739
06/01/2024 01:56:43;1704502603;33266;-0,2672436;-0,5757312;Agent;Large;de205173-99b6-4700-a713-a8048b93f26e
06/01/2024 01:56:43;1704502603;33267;0,5364529;0,4857657;Agent;Medium;1a1bc6a5-74f0-49f0-8738-92f6b0e31739
06/01/2024 01:56:43;1704502603;33267;0,5364529;0,4857657;Agent;Medium;1a1bc6a5-74f0-49f0-8738-92f6b0e31739
06/01/2024 01:56:43;1704502603;33267;-0,3055594;-0,1377824;Agent;Medium;de205173-99b6-4700-a713-a8048b93f26e
06/01/2024 01:56:43;1704502603;33267;-0,3055594;-0,1377824;Agent;Medium;de205173-99b6-4700-a713-a8048b93f26e
06/01/2024 01:56:43;1704502603;33277;0,2260891;0,5398066;Agent;Medium;f0716cc3-acbf-459c-8c09-13c5cccf0def
06/01/2024 01:56:43;1704502603;33277;0,2260891;0,5398066;Agent;Medium;f0716cc3-acbf-459c-8c09-13c5cccf0def
06/01/2024 01:56:43;1704502603;33277;-0,3126452;-0,4432662;Agent;Medium;1e1daf89-5081-432e-bbf2-ae1bcad23f16
06/01/2024 01:56:43;1704502603;33277;-0,3126452;-0,4432662;Agent;Medium;1e1daf89-5081-432e-bbf2-ae1bcad23f16
06/01/2024 01:56:43;1704502603;33277;-0,3126452;-0,4432662;Agent;Medium;1e1daf89-5081-432e-bbf2-ae1bcad23f16
06/01/2024 01:56:43;1704502603;33277;0,3705502;0,1202608;Agent;Medium;f0716cc3-acbf-459c-8c09-13c5cccf0def
06/01/2024 01:56:43;1704502603;33277;0,3705502;0,1202608;Agent;Small;f0716cc3-acbf-459c-8c09-13c5cccf0def
06/01/2024 01:56:43;1704502603;33277;-0,4631886;-0,02965176;Agent;Medium;1e1daf89-5081-432e-bbf2-ae1bcad23f16
06/01/2024 01:56:43;1704502603;33277;-0,4631886;-0,02965176;Agent;Small;1e1daf89-5081-432e-bbf2-ae1bcad23f16
06/01/2024 01:56:43;1704502603;33288;0,5104067;0,6387548;Agent;Medium;ab22f385-afc6-4617-9cfe-4db4f29dd156
06/01/2024 01:56:43;1704502603;33288;0,5104067;0,6387548;Agent;Large;ab22f385-afc6-4617-9cfe-4db4f29dd156
06/01/2024 01:56:43;1704502603;33288;-0,3544948;-0,3021727;Agent;Medium;a61e1070-17e5-4746-94a9-be64df710270
06/01/2024 01:56:43;1704502603;33288;-0,3544948;-0,3021727;Agent;Large;a61e1070-17e5-4746-94a9-be64df710270
06/01/2024 01:56:43;1704502603;33298;0,2508207;0,74989;Agent;Medium;25491c17-9b19-4fee-b76a-c827fd7cb1ca
06/01/2024 01:56:43;1704502603;33298;0,2508207;0,74989;Agent;Medium;25491c17-9b19-4fee-b76a-c827fd7cb1ca
06/01/2024 01:56:43;1704502603;33298;0,2508207;0,74989;Agent;Medium;25491c17-9b19-4fee-b76a-c827fd7cb1ca
06/01/2024 01:56:43;1704502603;33298;0,2508207;0,74989;Agent;Medium;25491c17-9b19-4fee-b76a-c827fd7cb1ca
06/01/2024 01:56:44;1704502604;33298;-0,03449645;-0,2377248;Agent;Medium;ec502e6b-ba99-43d6-ab48-b4da309d6411
06/01/2024 01:56:44;1704502604;33298;-0,03449645;-0,2377248;Agent;Medium;ec502e6b-ba99-43d6-ab48-b4da309d6411
06/01/2024 01:56:44;1704502604;33298;-0,03449645;-0,2377248;Agent;Medium;ec502e6b-ba99-43d6-ab48-b4da309d6411
06/01/2024 01:56:44;1704502604;33298;-0,03449645;-0,2377248;Agent;Medium;ec502e6b-ba99-43d6-ab48-b4da309d6411
06/01/2024 01:56:44;1704502604;33298;0,3978206;0,3737157;Agent;Small;25491c17-9b19-4fee-b76a-c827fd7cb1ca
06/01/2024 01:56:44;1704502604;33298;0,3978206;0,3737157;Agent;Small;25491c17-9b19-4fee-b76a-c827fd7cb1ca
06/01/2024 01:56:44;1704502604;33298;0,3978206;0,3737157;Agent;Small;25491c17-9b19-4fee-b76a-c827fd7cb1ca
06/01/2024 01:56:44;1704502604;33298;-0,1459815;0,1549742;Agent;Small;ec502e6b-ba99-43d6-ab48-b4da309d6411
06/01/2024 01:56:44;1704502604;33298;-0,1459815;0,1549742;Agent;Small;ec502e6b-ba99-43d6-ab48-b4da309d6411
06/01/2024 01:56:44;1704502604;33298;-0,1459815;0,1549742;Agent;Small;ec502e6b-ba99-43d6-ab48-b4da309d6411
06/01/2024 01:56:44;1704502604;33298;-0,1459815;0,1549742;Agent;Small;ec502e6b-ba99-43d6-ab48-b4da309d6411
06/01/2024 01:56:44;1704502604;33309;0,266886;0,538151;Agent;Medium;6f3a2170-ef65-4c2d-b86d-37a91b3c191b
06/01/2024 01:56:44;1704502604;33309;0,266886;0,538151;Agent;Medium;6f3a2170-ef65-4c2d-b86d-37a91b3c191b
06/01/2024 01:56:44;1704502604;33309;-0,3973674;-0,2568597;Agent;Medium;0fdf6c33-d620-45e1-9671-4cba5cd3ebf7
06/01/2024 01:56:44;1704502604;33309;-0,3973674;-0,2568597;Agent;Medium;0fdf6c33-d620-45e1-9671-4cba5cd3ebf7
06/01/2024 01:56:44;1704502604;33319;-0,4191751;-0,2573184;Agent;Large;15730915-7091-4758-99b4-1e338e3b2e53
06/01/2024 01:56:44;1704502604;33330;0,4304151;0,2000304;Agent;Medium;601a490d-fa08-4138-a2e2-3c8d03a7089e
06/01/2024 01:56:44;1704502604;33330;0,4304151;0,2000304;Agent;Medium;601a490d-fa08-4138-a2e2-3c8d03a7089e
06/01/2024 01:56:44;1704502604;33330;-0,1829922;-0,5653161;Agent;Medium;172829fe-b09a-4419-97b2-9fac41ddd401
06/01/2024 01:56:44;1704502604;33330;-0,1829922;-0,5653161;Agent;Medium;172829fe-b09a-4419-97b2-9fac41ddd401
06/01/2024 01:56:44;1704502604;33330;-0,1829922;-0,5653161;Agent;Medium;172829fe-b09a-4419-97b2-9fac41ddd401
06/01/2024 01:56:44;1704502604;33340;0,3938532;0,3151699;Agent;Large;a10608ab-86ff-491f-a300-5fa035a3f1ae
06/01/2024 01:56:44;1704502604;33340;0,3938532;0,3151699;Agent;Large;a10608ab-86ff-491f-a300-5fa035a3f1ae
06/01/2024 01:56:44;1704502604;33340;-0,2458273;-0,8663727;Agent;Large;c8d21086-72fe-46c8-a585-a692f81bbae5
06/01/2024 01:56:44;1704502604;33340;-0,2458273;-0,8663727;Agent;Large;c8d21086-72fe-46c8-a585-a692f81bbae5
06/01/2024 01:56:44;1704502604;33340;-0,2458273;-0,8663727;Agent;Large;c8d21086-72fe-46c8-a585-a692f81bbae5
06/01/2024 01:56:44;1704502604;33340;0,4894788;-0,1767808;Agent;Medium;a10608ab-86ff-491f-a300-5fa035a3f1ae
06/01/2024 01:56:44;1704502604;33340;0,4894788;-0,1767808;Agent;Small;a10608ab-86ff-491f-a300-5fa035a3f1ae
06/01/2024 01:56:44;1704502604;33340;0,4894788;-0,1767808;Agent;Small;a10608ab-86ff-491f-a300-5fa035a3f1ae
06/01/2024 01:56:44;1704502604;33340;-0,3332995;-0,4163678;Agent;Medium;c8d21086-72fe-46c8-a585-a692f81bbae5
06/01/2024 01:56:44;1704502604;33340;-0,3332995;-0,4163678;Agent;Small;c8d21086-72fe-46c8-a585-a692f81bbae5
06/01/2024 01:56:44;1704502604;33340;-0,3332995;-0,4163678;Agent;Small;c8d21086-72fe-46c8-a585-a692f81bbae5
06/01/2024 01:56:44;1704502604;33350;0,2355646;0,6639379;Agent;Large;01b28c5b-4f6d-4bb3-8097-787d587d3040
06/01/2024 01:56:44;1704502604;33350;-0,1233497;-1,002132;Agent;Large;c94700a1-41e3-4492-8d5b-e71e8c15808a
06/01/2024 01:56:44;1704502604;33351;0,3554348;0,2459016;Agent;Medium;01b28c5b-4f6d-4bb3-8097-787d587d3040
06/01/2024 01:56:44;1704502604;33351;0,3554348;0,2459016;Agent;Medium;01b28c5b-4f6d-4bb3-8097-787d587d3040
06/01/2024 01:56:44;1704502604;33351;0,3554348;0,2459016;Agent;Medium;01b28c5b-4f6d-4bb3-8097-787d587d3040
06/01/2024 01:56:44;1704502604;33351;-0,1649699;-0,6061416;Agent;Medium;c94700a1-41e3-4492-8d5b-e71e8c15808a
06/01/2024 01:56:44;1704502604;33351;-0,1649699;-0,6061416;Agent;Medium;c94700a1-41e3-4492-8d5b-e71e8c15808a
06/01/2024 01:56:44;1704502604;33351;-0,1649699;-0,6061416;Agent;Medium;c94700a1-41e3-4492-8d5b-e71e8c15808a
06/01/2024 01:56:45;1704502605;33361;0,1647027;0,4641884;Agent;Large;333bc7be-0bcc-49ef-946d-795f127f8c29
06/01/2024 01:56:45;1704502605;33361;0,1647027;0,4641884;Agent;Large;333bc7be-0bcc-49ef-946d-795f127f8c29
06/01/2024 01:56:45;1704502605;33361;-0,4839837;-0,6865995;Agent;Large;038eded5-c469-42f5-9824-496f0ce37b77
06/01/2024 01:56:45;1704502605;33361;-0,4839837;-0,6865995;Agent;Large;038eded5-c469-42f5-9824-496f0ce37b77
06/01/2024 01:56:45;1704502605;33362;0,2384288;-0,001299262;Agent;Small;333bc7be-0bcc-49ef-946d-795f127f8c29
06/01/2024 01:56:45;1704502605;33362;0,2384288;-0,001299262;Agent;Small;333bc7be-0bcc-49ef-946d-795f127f8c29
06/01/2024 01:56:45;1704502605;33362;0,2384288;-0,001299262;Agent;Small;333bc7be-0bcc-49ef-946d-795f127f8c29
06/01/2024 01:56:45;1704502605;33362;-0,5499919;-0,2698423;Agent;Small;038eded5-c469-42f5-9824-496f0ce37b77
06/01/2024 01:56:45;1704502605;33362;-0,5499919;-0,2698423;Agent;Small;038eded5-c469-42f5-9824-496f0ce37b77
06/01/2024 01:56:45;1704502605;33362;-0,5499919;-0,2698423;Agent;Small;038eded5-c469-42f5-9824-496f0ce37b77
06/01/2024 01:56:45;1704502605;33372;0,5097086;0,7838044;Agent;Large;3d5bdf56-9ca6-4c4b-8689-df2c6e6d32b5
06/01/2024 01:56:45;1704502605;33372;-0,405709;-0,6059232;Agent;Large;bfa0a148-f367-4cd5-82ed-812283546701
06/01/2024 01:56:45;1704502605;33372;0,6982948;0,3602335;Agent;Medium;3d5bdf56-9ca6-4c4b-8689-df2c6e6d32b5
06/01/2024 01:56:45;1704502605;33372;-0,4614833;-0,1516795;Agent;Medium;bfa0a148-f367-4cd5-82ed-812283546701
06/01/2024 01:56:45;1704502605;33383;0,4733646;1,00736;Agent;Large;2c13342e-b0c1-48c8-8f58-5124a0fa2e18
06/01/2024 01:56:45;1704502605;33383;0,4733646;1,00736;Agent;Large;2c13342e-b0c1-48c8-8f58-5124a0fa2e18
06/01/2024 01:56:45;1704502605;33383;-0,4282479;-0,136848;Agent;Large;709d61da-c022-41d8-a38f-fdf86f6e17e6
06/01/2024 01:56:45;1704502605;33383;-0,4282479;-0,136848;Agent;Large;709d61da-c022-41d8-a38f-fdf86f6e17e6
06/01/2024 01:56:45;1704502605;33383;0,535238;0,5671062;Agent;Medium;2c13342e-b0c1-48c8-8f58-5124a0fa2e18
06/01/2024 01:56:45;1704502605;33383;-0,5657421;0,3128749;Agent;Medium;709d61da-c022-41d8-a38f-fdf86f6e17e6
06/01/2024 01:56:45;1704502605;33393;0,3924837;0,7205412;Agent;Large;f01681e0-313a-4b54-a1d9-4664f89e78b9
06/01/2024 01:56:45;1704502605;33393;-0,3819115;-0,6883402;Agent;Large;cfc195a5-865a-447b-bc99-a75b6870768a
06/01/2024 01:56:45;1704502605;33393;-0,3819115;-0,6883402;Agent;Large;cfc195a5-865a-447b-bc99-a75b6870768a
06/01/2024 01:56:45;1704502605;33394;0,4578089;0,2557299;Agent;Medium;f01681e0-313a-4b54-a1d9-4664f89e78b9
06/01/2024 01:56:45;1704502605;33394;0,4578089;0,2557299;Agent;Medium;f01681e0-313a-4b54-a1d9-4664f89e78b9
06/01/2024 01:56:45;1704502605;33394;0,4578089;0,2557299;Agent;Medium;f01681e0-313a-4b54-a1d9-4664f89e78b9
06/01/2024 01:56:45;1704502605;33394;-0,4588292;-0,2521191;Agent;Medium;cfc195a5-865a-447b-bc99-a75b6870768a
06/01/2024 01:56:45;1704502605;33394;-0,4588292;-0,2521191;Agent;Medium;cfc195a5-865a-447b-bc99-a75b6870768a
06/01/2024 01:56:45;1704502605;33404;0,3799561;0,6306503;Agent;Large;fbd422d1-4165-41f3-b1ec-bfcfc189e72e
06/01/2024 01:56:45;1704502605;33404;0,3799561;0,6306503;Agent;Large;fbd422d1-4165-41f3-b1ec-bfcfc189e72e
06/01/2024 01:56:45;1704502605;33404;-0,2896974;-0,696753;Agent;Large;a3168b79-fdb4-48f7-a19b-4eb6922bc15b
06/01/2024 01:56:45;1704502605;33404;-0,2896974;-0,696753;Agent;Large;a3168b79-fdb4-48f7-a19b-4eb6922bc15b
06/01/2024 01:56:45;1704502605;33404;-0,2896974;-0,696753;Agent;Large;a3168b79-fdb4-48f7-a19b-4eb6922bc15b
06/01/2024 01:56:45;1704502605;33404;0,4958472;0,165836;Agent;Medium;fbd422d1-4165-41f3-b1ec-bfcfc189e72e
06/01/2024 01:56:45;1704502605;33404;0,4958472;0,165836;Agent;Medium;fbd422d1-4165-41f3-b1ec-bfcfc189e72e
06/01/2024 01:56:45;1704502605;33404;-0,3836074;-0,2549422;Agent;Medium;a3168b79-fdb4-48f7-a19b-4eb6922bc15b
06/01/2024 01:56:45;1704502605;33404;-0,3836074;-0,2549422;Agent;Medium;a3168b79-fdb4-48f7-a19b-4eb6922bc15b
06/01/2024 01:56:46;1704502606;33415;0,809879;-0,01952155;Agent;Medium;46b59f34-6dd8-4176-a33a-a9e1cfb4577b
06/01/2024 01:56:46;1704502606;33415;-0,3641209;-0,5817615;Agent;Large;60065b7b-f0c1-43a4-b00b-1315dd100807
06/01/2024 01:56:46;1704502606;33425;0,2776572;0,7781224;Agent;Large;c136d840-b756-4762-8d84-d9464729c25e
06/01/2024 01:56:46;1704502606;33425;0,2776572;0,7781224;Agent;Large;c136d840-b756-4762-8d84-d9464729c25e
06/01/2024 01:56:46;1704502606;33425;0,2776572;0,7781224;Agent;Large;c136d840-b756-4762-8d84-d9464729c25e
06/01/2024 01:56:46;1704502606;33425;-0,1872151;-0,4741416;Agent;Large;0b6f946b-38ae-4e17-a312-0ab9b3c70acc
06/01/2024 01:56:46;1704502606;33425;-0,1872151;-0,4741416;Agent;Large;0b6f946b-38ae-4e17-a312-0ab9b3c70acc
06/01/2024 01:56:46;1704502606;33425;-0,1872151;-0,4741416;Agent;Large;0b6f946b-38ae-4e17-a312-0ab9b3c70acc
06/01/2024 01:56:46;1704502606;33426;0,366926;0,3188753;Agent;Small;c136d840-b756-4762-8d84-d9464729c25e
06/01/2024 01:56:46;1704502606;33426;0,366926;0,3188753;Agent;Small;c136d840-b756-4762-8d84-d9464729c25e
06/01/2024 01:56:46;1704502606;33426;0,366926;0,3188753;Agent;Small;c136d840-b756-4762-8d84-d9464729c25e
06/01/2024 01:56:46;1704502606;33426;0,366926;0,3188753;Agent;Small;c136d840-b756-4762-8d84-d9464729c25e
06/01/2024 01:56:46;1704502606;33426;-0,2425784;-0,02324438;Agent;Small;0b6f946b-38ae-4e17-a312-0ab9b3c70acc
06/01/2024 01:56:46;1704502606;33426;-0,2425784;-0,02324438;Agent;Small;0b6f946b-38ae-4e17-a312-0ab9b3c70acc
06/01/2024 01:56:46;1704502606;33426;-0,2425784;-0,02324438;Agent;Small;0b6f946b-38ae-4e17-a312-0ab9b3c70acc
06/01/2024 01:56:46;1704502606;33426;-0,2425784;-0,02324438;Agent;Small;0b6f946b-38ae-4e17-a312-0ab9b3c70acc
06/01/2024 01:56:46;1704502606;33436;0,1733025;1,274423;Agent;Large;d91d9ae6-e8ad-48de-b5a9-8ba9ced28fbf
06/01/2024 01:56:46;1704502606;33436;0,1733025;1,274423;Agent;Large;d91d9ae6-e8ad-48de-b5a9-8ba9ced28fbf
06/01/2024 01:56:46;1704502606;33436;0,1733025;1,274423;Agent;Large;d91d9ae6-e8ad-48de-b5a9-8ba9ced28fbf
06/01/2024 01:56:46;1704502606;33436;-0,1980876;-0,2142199;Agent;Large;84b6a378-f8fc-4a38-b3f1-1d2ecfa34898
06/01/2024 01:56:46;1704502606;33436;-0,1980876;-0,2142199;Agent;Large;84b6a378-f8fc-4a38-b3f1-1d2ecfa34898
06/01/2024 01:56:46;1704502606;33436;-0,1980876;-0,2142199;Agent;Large;84b6a378-f8fc-4a38-b3f1-1d2ecfa34898
06/01/2024 01:56:46;1704502606;33436;-0,1980876;-0,2142199;Agent;Large;84b6a378-f8fc-4a38-b3f1-1d2ecfa34898
06/01/2024 01:56:46;1704502606;33436;0,2022867;0,8599292;Agent;Medium;d91d9ae6-e8ad-48de-b5a9-8ba9ced28fbf
06/01/2024 01:56:46;1704502606;33436;0,2022867;0,8599292;Agent;Small;d91d9ae6-e8ad-48de-b5a9-8ba9ced28fbf
06/01/2024 01:56:46;1704502606;33436;0,2022867;0,8599292;Agent;Small;d91d9ae6-e8ad-48de-b5a9-8ba9ced28fbf
06/01/2024 01:56:46;1704502606;33436;0,2022867;0,8599292;Agent;Small;d91d9ae6-e8ad-48de-b5a9-8ba9ced28fbf
06/01/2024 01:56:46;1704502606;33436;-0,2844139;0,22989;Agent;Small;84b6a378-f8fc-4a38-b3f1-1d2ecfa34898
06/01/2024 01:56:46;1704502606;33436;-0,2844139;0,22989;Agent;Small;84b6a378-f8fc-4a38-b3f1-1d2ecfa34898
06/01/2024 01:56:46;1704502606;33436;-0,2844139;0,22989;Agent;Small;84b6a378-f8fc-4a38-b3f1-1d2ecfa34898
06/01/2024 01:56:46;1704502606;33436;-0,2844139;0,22989;Agent;Medium;84b6a378-f8fc-4a38-b3f1-1d2ecfa34898
06/01/2024 01:56:46;1704502606;33447;0,1095857;0,6463997;Agent;Medium;226fcf6e-c2c9-42e5-acef-8609c6ad008b
06/01/2024 01:56:46;1704502606;33447;0,1095857;0,6463997;Agent;Medium;226fcf6e-c2c9-42e5-acef-8609c6ad008b
06/01/2024 01:56:46;1704502606;33447;0,1095857;0,6463997;Agent;Medium;226fcf6e-c2c9-42e5-acef-8609c6ad008b
06/01/2024 01:56:46;1704502606;33447;0,1095857;0,6463997;Agent;Medium;226fcf6e-c2c9-42e5-acef-8609c6ad008b
06/01/2024 01:56:46;1704502606;33447;-0,3001602;-0,2136847;Agent;Medium;61070462-835f-4144-bd4e-33b2106de947
06/01/2024 01:56:46;1704502606;33447;-0,3001602;-0,2136847;Agent;Medium;61070462-835f-4144-bd4e-33b2106de947
06/01/2024 01:56:46;1704502606;33447;-0,3001602;-0,2136847;Agent;Medium;61070462-835f-4144-bd4e-33b2106de947
06/01/2024 01:56:46;1704502606;33447;-0,3001602;-0,2136847;Agent;Medium;61070462-835f-4144-bd4e-33b2106de947
06/01/2024 01:56:46;1704502606;33447;0,2431412;0,2095594;Agent;Small;226fcf6e-c2c9-42e5-acef-8609c6ad008b
06/01/2024 01:56:46;1704502606;33447;-0,395139;0,2331553;Agent;Small;61070462-835f-4144-bd4e-33b2106de947
06/01/2024 01:56:46;1704502606;33447;-0,395139;0,2331553;Agent;Small;61070462-835f-4144-bd4e-33b2106de947
06/01/2024 01:56:46;1704502606;33457;0,2216512;1,105688;Agent;Large;77cc4a3a-0175-4cf9-af4f-8108c96e9fbf
06/01/2024 01:56:46;1704502606;33457;-0,5569535;-0,3822286;Agent;Large;98c80114-9e88-4b98-a2ae-c8e3d1b05cb2
06/01/2024 01:56:46;1704502606;33457;0,2473121;0,6160501;Agent;Medium;77cc4a3a-0175-4cf9-af4f-8108c96e9fbf
06/01/2024 01:56:46;1704502606;33457;0,2473121;0,6160501;Agent;Medium;77cc4a3a-0175-4cf9-af4f-8108c96e9fbf
06/01/2024 01:56:46;1704502606;33457;-0,7274499;0,06192864;Agent;Medium;98c80114-9e88-4b98-a2ae-c8e3d1b05cb2
06/01/2024 01:56:46;1704502606;33457;-0,7274499;0,06192864;Agent;Medium;98c80114-9e88-4b98-a2ae-c8e3d1b05cb2
06/01/2024 01:56:47;1704502607;33467;0,5125108;1,089426;Agent;Large;fce9c962-f7bc-45b9-bae6-b9fee124df33
06/01/2024 01:56:47;1704502607;33467;0,5125108;1,089426;Agent;Medium;fce9c962-f7bc-45b9-bae6-b9fee124df33
06/01/2024 01:56:47;1704502607;33467;-0,5598252;0,40589;Agent;Medium;8306c71f-0ede-42fe-a9cc-67654c8ecfde
06/01/2024 01:56:47;1704502607;33478;0,1058048;1,10427;Agent;Large;d9360446-527a-4edf-b954-84b94467d248
06/01/2024 01:56:47;1704502607;33478;0,1058048;1,10427;Agent;Large;d9360446-527a-4edf-b954-84b94467d248
06/01/2024 01:56:47;1704502607;33478;0,1058048;1,10427;Agent;Large;d9360446-527a-4edf-b954-84b94467d248
06/01/2024 01:56:47;1704502607;33478;0,1058048;1,10427;Agent;Large;d9360446-527a-4edf-b954-84b94467d248
06/01/2024 01:56:47;1704502607;33478;-0,2479095;-0,4243133;Agent;Large;9f830eec-08d3-4c1e-a682-ac9a40bd3bb8
06/01/2024 01:56:47;1704502607;33478;-0,2479095;-0,4243133;Agent;Large;9f830eec-08d3-4c1e-a682-ac9a40bd3bb8
06/01/2024 01:56:47;1704502607;33478;-0,2479095;-0,4243133;Agent;Large;9f830eec-08d3-4c1e-a682-ac9a40bd3bb8
06/01/2024 01:56:47;1704502607;33478;-0,2479095;-0,4243133;Agent;Large;9f830eec-08d3-4c1e-a682-ac9a40bd3bb8
06/01/2024 01:56:47;1704502607;33478;-0,2479095;-0,4243133;Agent;Large;9f830eec-08d3-4c1e-a682-ac9a40bd3bb8
06/01/2024 01:56:47;1704502607;33478;-0,2479095;-0,4243133;Agent;Large;9f830eec-08d3-4c1e-a682-ac9a40bd3bb8
06/01/2024 01:56:47;1704502607;33478;0,1588025;0,6726372;Agent;Small;d9360446-527a-4edf-b954-84b94467d248
06/01/2024 01:56:47;1704502607;33478;0,1588025;0,6726372;Agent;Small;d9360446-527a-4edf-b954-84b94467d248
06/01/2024 01:56:47;1704502607;33478;0,1588025;0,6726372;Agent;Small;d9360446-527a-4edf-b954-84b94467d248
06/01/2024 01:56:47;1704502607;33478;-0,3375252;0,03671816;Agent;Small;9f830eec-08d3-4c1e-a682-ac9a40bd3bb8
06/01/2024 01:56:47;1704502607;33478;-0,3375252;0,03671816;Agent;Small;9f830eec-08d3-4c1e-a682-ac9a40bd3bb8
06/01/2024 01:56:47;1704502607;33478;-0,3375252;0,03671816;Agent;Small;9f830eec-08d3-4c1e-a682-ac9a40bd3bb8
06/01/2024 01:56:47;1704502607;33478;-0,3375252;0,03671816;Agent;Medium;9f830eec-08d3-4c1e-a682-ac9a40bd3bb8
06/01/2024 01:56:47;1704502607;33489;0,3666893;0,7661133;Agent;Large;7284b34a-ddd8-4f2e-babc-1c39266041c8
06/01/2024 01:56:47;1704502607;33489;0,3666893;0,7661133;Agent;Large;7284b34a-ddd8-4f2e-babc-1c39266041c8
06/01/2024 01:56:47;1704502607;33489;0,3666893;0,7661133;Agent;Large;7284b34a-ddd8-4f2e-babc-1c39266041c8
06/01/2024 01:56:47;1704502607;33489;-0,1535999;-0,4614648;Agent;Large;5b6b32af-c383-4ce0-952b-50e75d28f82a
06/01/2024 01:56:47;1704502607;33489;-0,1535999;-0,4614648;Agent;Large;5b6b32af-c383-4ce0-952b-50e75d28f82a
06/01/2024 01:56:47;1704502607;33489;-0,1535999;-0,4614648;Agent;Large;5b6b32af-c383-4ce0-952b-50e75d28f82a
06/01/2024 01:56:47;1704502607;33489;-0,1535999;-0,4614648;Agent;Large;5b6b32af-c383-4ce0-952b-50e75d28f82a
06/01/2024 01:56:47;1704502607;33489;0,4721216;0,3094359;Agent;Small;7284b34a-ddd8-4f2e-babc-1c39266041c8
06/01/2024 01:56:47;1704502607;33489;0,4721216;0,3094359;Agent;Small;7284b34a-ddd8-4f2e-babc-1c39266041c8
06/01/2024 01:56:47;1704502607;33489;0,4721216;0,3094359;Agent;Small;7284b34a-ddd8-4f2e-babc-1c39266041c8
06/01/2024 01:56:47;1704502607;33489;-0,2235188;-0,02001333;Agent;Small;5b6b32af-c383-4ce0-952b-50e75d28f82a
06/01/2024 01:56:47;1704502607;33489;-0,2235188;-0,02001333;Agent;Small;5b6b32af-c383-4ce0-952b-50e75d28f82a
06/01/2024 01:56:47;1704502607;33489;-0,2235188;-0,02001333;Agent;Small;5b6b32af-c383-4ce0-952b-50e75d28f82a
06/01/2024 01:56:47;1704502607;33489;-0,2235188;-0,02001333;Agent;Small;5b6b32af-c383-4ce0-952b-50e75d28f82a
06/01/2024 01:56:47;1704502607;33499;0,291462;0,5343482;Agent;Large;76cb5939-4c16-40ac-958e-791aae17253a
06/01/2024 01:56:47;1704502607;33499;0,291462;0,5343482;Agent;Large;76cb5939-4c16-40ac-958e-791aae17253a
06/01/2024 01:56:47;1704502607;33499;0,291462;0,5343482;Agent;Large;76cb5939-4c16-40ac-958e-791aae17253a
06/01/2024 01:56:47;1704502607;33499;-0,3201595;-0,7168152;Agent;Large;f1668bb7-211d-4905-90ae-9e236832a50b
06/01/2024 01:56:47;1704502607;33499;-0,3201595;-0,7168152;Agent;Large;f1668bb7-211d-4905-90ae-9e236832a50b
06/01/2024 01:56:47;1704502607;33499;-0,3201595;-0,7168152;Agent;Large;f1668bb7-211d-4905-90ae-9e236832a50b
06/01/2024 01:56:47;1704502607;33499;0,4274316;0,08961116;Agent;Medium;76cb5939-4c16-40ac-958e-791aae17253a
06/01/2024 01:56:47;1704502607;33499;0,4274316;0,08961116;Agent;Medium;76cb5939-4c16-40ac-958e-791aae17253a
06/01/2024 01:56:47;1704502607;33499;-0,4200798;-0,2840122;Agent;Medium;f1668bb7-211d-4905-90ae-9e236832a50b
06/01/2024 01:56:47;1704502607;33499;-0,4200798;-0,2840122;Agent;Medium;f1668bb7-211d-4905-90ae-9e236832a50b
06/01/2024 01:56:47;1704502607;33510;0,3128619;0,8053056;Agent;Large;a1810d58-7622-4ea9-a290-47464822af4c
06/01/2024 01:56:47;1704502607;33510;0,3128619;0,8053056;Agent;Large;a1810d58-7622-4ea9-a290-47464822af4c
06/01/2024 01:56:47;1704502607;33510;-0,2920534;-0,4777785;Agent;Large;eb7acafd-068e-4422-90c4-595048b808b3
06/01/2024 01:56:47;1704502607;33510;-0,2920534;-0,4777785;Agent;Large;eb7acafd-068e-4422-90c4-595048b808b3
06/01/2024 01:56:47;1704502607;33510;-0,2920534;-0,4777785;Agent;Large;eb7acafd-068e-4422-90c4-595048b808b3
06/01/2024 01:56:47;1704502607;33510;0,4238763;0,4181521;Agent;Small;a1810d58-7622-4ea9-a290-47464822af4c
06/01/2024 01:56:47;1704502607;33510;0,4238763;0,4181521;Agent;Small;a1810d58-7622-4ea9-a290-47464822af4c
06/01/2024 01:56:47;1704502607;33510;-0,3066218;-0,06059083;Agent;Medium;eb7acafd-068e-4422-90c4-595048b808b3
06/01/2024 01:56:47;1704502607;33510;-0,3066218;-0,06059083;Agent;Small;eb7acafd-068e-4422-90c4-595048b808b3
06/01/2024 01:56:47;1704502607;33510;-0,3066218;-0,06059083;Agent;Small;eb7acafd-068e-4422-90c4-595048b808b3
06/01/2024 01:56:48;1704502608;33521;0,2217935;1,026263;Agent;Medium;5d9101a3-f2b2-4d88-b986-60e3d85d95ba
06/01/2024 01:56:48;1704502608;33521;0,2217935;1,026263;Agent;Medium;5d9101a3-f2b2-4d88-b986-60e3d85d95ba
06/01/2024 01:56:48;1704502608;33521;-0,6403844;0,1145838;Agent;Medium;dcd78b40-da9e-475e-80b3-5ccc1544ea4c
06/01/2024 01:56:48;1704502608;33521;-0,6403844;0,1145838;Agent;Medium;dcd78b40-da9e-475e-80b3-5ccc1544ea4c
06/01/2024 01:56:48;1704502608;33532;0,2084375;1,327797;Agent;Large;135ddcca-ec98-48b9-9d6e-96ccae5f9e2f
06/01/2024 01:56:48;1704502608;33532;0,2084375;1,327797;Agent;Large;135ddcca-ec98-48b9-9d6e-96ccae5f9e2f
06/01/2024 01:56:48;1704502608;33532;-0,5726265;0,1436743;Agent;Large;174df9c4-5ac8-470b-9f99-33d30d3c9902
06/01/2024 01:56:48;1704502608;33532;-0,5726265;0,1436743;Agent;Large;174df9c4-5ac8-470b-9f99-33d30d3c9902
06/01/2024 01:56:48;1704502608;33533;0,3155114;0,9281928;Agent;Medium;135ddcca-ec98-48b9-9d6e-96ccae5f9e2f
06/01/2024 01:56:48;1704502608;33533;-0,7647933;0,5752878;Agent;Medium;174df9c4-5ac8-470b-9f99-33d30d3c9902
06/01/2024 01:56:48;1704502608;33544;0,2822317;0,8122284;Agent;Medium;e8b93a22-36f5-448f-8f7f-dc3909120564
06/01/2024 01:56:48;1704502608;33544;0,2822317;0,8122284;Agent;Medium;e8b93a22-36f5-448f-8f7f-dc3909120564
06/01/2024 01:56:48;1704502608;33544;0,2822317;0,8122284;Agent;Medium;e8b93a22-36f5-448f-8f7f-dc3909120564
06/01/2024 01:56:48;1704502608;33544;-0,2452815;-0,05187806;Agent;Medium;fcbcbd09-f708-465c-8815-9d63ee14d023
06/01/2024 01:56:48;1704502608;33544;-0,2452815;-0,05187806;Agent;Medium;fcbcbd09-f708-465c-8815-9d63ee14d023
06/01/2024 01:56:48;1704502608;33544;-0,2452815;-0,05187806;Agent;Medium;fcbcbd09-f708-465c-8815-9d63ee14d023
06/01/2024 01:56:48;1704502608;33544;0,3921133;0,3715164;Agent;Small;e8b93a22-36f5-448f-8f7f-dc3909120564
06/01/2024 01:56:48;1704502608;33544;-0,3434459;0,4099483;Agent;Small;fcbcbd09-f708-465c-8815-9d63ee14d023
06/01/2024 01:56:48;1704502608;33554;0,4534646;0,496921;Agent;Large;87525d6e-4e18-4818-af5c-a6fb355cc09c
06/01/2024 01:56:48;1704502608;33555;0,4448516;0,003479451;Agent;Medium;87525d6e-4e18-4818-af5c-a6fb355cc09c
06/01/2024 01:56:48;1704502608;33555;0,4448516;0,003479451;Agent;Medium;87525d6e-4e18-4818-af5c-a6fb355cc09c
06/01/2024 01:56:48;1704502608;33555;-0,3140853;-0,6285586;Agent;Medium;85773bdd-578d-4583-91e5-95c7e724968b
06/01/2024 01:56:48;1704502608;33555;-0,3140853;-0,6285586;Agent;Medium;85773bdd-578d-4583-91e5-95c7e724968b
06/01/2024 01:56:48;1704502608;33555;-0,3140853;-0,6285586;Agent;Medium;85773bdd-578d-4583-91e5-95c7e724968b
06/01/2024 01:56:48;1704502608;33566;0,5495869;0,2871519;Agent;Large;34de710c-b4c1-420f-94c8-dfbb3d0784ef
06/01/2024 01:56:48;1704502608;33566;-0,2615567;-1,000291;Agent;Large;8195480a-e6a4-4cbc-b155-81488d5b6b8c
06/01/2024 01:56:48;1704502608;33566;-0,2615567;-1,000291;Agent;Large;8195480a-e6a4-4cbc-b155-81488d5b6b8c
06/01/2024 01:56:48;1704502608;33566;-0,2615567;-1,000291;Agent;Large;8195480a-e6a4-4cbc-b155-81488d5b6b8c
06/01/2024 01:56:48;1704502608;33566;0,6673582;-0,1523766;Agent;Medium;34de710c-b4c1-420f-94c8-dfbb3d0784ef
06/01/2024 01:56:48;1704502608;33566;0,6673582;-0,1523766;Agent;Medium;34de710c-b4c1-420f-94c8-dfbb3d0784ef
06/01/2024 01:56:48;1704502608;33566;-0,3347993;-0,5849133;Agent;Medium;8195480a-e6a4-4cbc-b155-81488d5b6b8c
06/01/2024 01:56:48;1704502608;33566;-0,3347993;-0,5849133;Agent;Medium;8195480a-e6a4-4cbc-b155-81488d5b6b8c
