07/01/2024 22:20:35;1704662435;33
07/01/2024 22:20:36;1704662436;15
07/01/2024 22:20:36;1704662436;16
07/01/2024 22:20:36;1704662436;17
07/01/2024 22:20:36;1704662436;14
07/01/2024 22:20:36;1704662436;15
07/01/2024 22:20:37;1704662437;14
07/01/2024 22:20:37;1704662437;14
07/01/2024 22:20:37;1704662437;18
07/01/2024 22:20:37;1704662437;15
07/01/2024 22:20:37;1704662437;14
07/01/2024 22:20:38;1704662438;14
07/01/2024 22:20:38;1704662438;14
07/01/2024 22:20:38;1704662438;16
07/01/2024 22:20:38;1704662438;17
07/01/2024 22:20:39;1704662439;14
07/01/2024 22:20:39;1704662439;18
07/01/2024 22:20:39;1704662439;15
07/01/2024 22:20:39;1704662439;18
07/01/2024 22:20:39;1704662439;17
07/01/2024 22:20:40;1704662440;18
07/01/2024 22:20:40;1704662440;14
07/01/2024 22:20:40;1704662440;15
07/01/2024 22:20:40;1704662440;15
07/01/2024 22:20:41;1704662441;15
07/01/2024 22:20:41;1704662441;14
07/01/2024 22:20:41;1704662441;15
07/01/2024 22:20:41;1704662441;16
07/01/2024 22:20:41;1704662441;13
07/01/2024 22:20:42;1704662442;15
07/01/2024 22:20:42;1704662442;14
07/01/2024 22:20:42;1704662442;18
07/01/2024 22:20:42;1704662442;15
07/01/2024 22:20:42;1704662442;15
07/01/2024 22:20:43;1704662443;15
07/01/2024 22:20:43;1704662443;16
07/01/2024 22:20:43;1704662443;14
07/01/2024 22:20:43;1704662443;18
07/01/2024 22:20:43;1704662443;15
07/01/2024 22:20:44;1704662444;16
07/01/2024 22:20:44;1704662444;15
07/01/2024 22:20:44;1704662444;15
07/01/2024 22:20:44;1704662444;15
07/01/2024 22:20:45;1704662445;15
07/01/2024 22:20:45;1704662445;15
07/01/2024 22:20:45;1704662445;15
07/01/2024 22:20:45;1704662445;15
07/01/2024 22:20:45;1704662445;15
07/01/2024 22:20:46;1704662446;14
07/01/2024 22:20:46;1704662446;16
07/01/2024 22:20:46;1704662446;14
07/01/2024 22:20:46;1704662446;15
07/01/2024 22:20:46;1704662446;16
07/01/2024 22:20:47;1704662447;16
07/01/2024 22:20:47;1704662447;19
07/01/2024 22:20:47;1704662447;14
07/01/2024 22:20:47;1704662447;15
07/01/2024 22:20:47;1704662447;15
07/01/2024 22:20:48;1704662448;16
07/01/2024 22:20:48;1704662448;14
07/01/2024 22:20:48;1704662448;16
07/01/2024 22:20:48;1704662448;15
07/01/2024 22:20:49;1704662449;14
07/01/2024 22:20:49;1704662449;14
07/01/2024 22:20:49;1704662449;15
07/01/2024 22:20:49;1704662449;16
07/01/2024 22:20:49;1704662449;16
07/01/2024 22:20:50;1704662450;15
07/01/2024 22:20:50;1704662450;16
07/01/2024 22:20:50;1704662450;14
07/01/2024 22:20:50;1704662450;15
07/01/2024 22:20:50;1704662450;15
07/01/2024 22:20:51;1704662451;18
07/01/2024 22:20:51;1704662451;15
07/01/2024 22:20:51;1704662451;17
07/01/2024 22:20:51;1704662451;16
07/01/2024 22:20:52;1704662452;15
07/01/2024 22:20:52;1704662452;17
07/01/2024 22:20:52;1704662452;15
07/01/2024 22:20:52;1704662452;16
07/01/2024 22:20:52;1704662452;15
07/01/2024 22:20:53;1704662453;14
07/01/2024 22:20:53;1704662453;14
07/01/2024 22:20:53;1704662453;20
07/01/2024 22:20:53;1704662453;17
07/01/2024 22:20:53;1704662453;14
07/01/2024 22:20:54;1704662454;15
07/01/2024 22:20:54;1704662454;15
07/01/2024 22:20:54;1704662454;16
07/01/2024 22:20:54;1704662454;15
07/01/2024 22:20:54;1704662454;15
07/01/2024 22:20:55;1704662455;14
07/01/2024 22:20:55;1704662455;18
07/01/2024 22:20:55;1704662455;17
07/01/2024 22:20:55;1704662455;17
07/01/2024 22:20:56;1704662456;14
07/01/2024 22:20:56;1704662456;15
07/01/2024 22:20:56;1704662456;21
07/01/2024 22:20:56;1704662456;16
07/01/2024 22:20:57;1704662457;15
