{
    "name": "root",
    "gauges": {
        "Pedone.Policy.Entropy.mean": {
            "value": 1.419905662536621,
            "min": 1.0173826217651367,
            "max": 1.4506875276565552,
            "count": 1202
        },
        "Pedone.Policy.Entropy.sum": {
            "value": 258.4228210449219,
            "min": 40.36585998535156,
            "max": 3636.1630859375,
            "count": 1202
        },
        "Pedone.Environment.EpisodeLength.mean": {
            "value": 54.5,
            "min": 7.402061855670103,
            "max": 1163.0,
            "count": 1177
        },
        "Pedone.Environment.EpisodeLength.sum": {
            "value": 436.0,
            "min": 27.0,
            "max": 12329.0,
            "count": 1177
        },
        "Pedone.Policy.ExtrinsicValueEstimate.mean": {
            "value": 3.6829464435577393,
            "min": -35.61227798461914,
            "max": 5.106690406799316,
            "count": 1203
        },
        "Pedone.Policy.ExtrinsicValueEstimate.sum": {
            "value": 73.65892791748047,
            "min": -564.8346557617188,
            "max": 354.366455078125,
            "count": 1203
        },
        "Pedone.Environment.CumulativeReward.mean": {
            "value": 3.281619636217753,
            "min": -594.6994817256927,
            "max": 13.971200823783875,
            "count": 1176
        },
        "Pedone.Environment.CumulativeReward.sum": {
            "value": 49.224294543266296,
            "min": -7133.596800088882,
            "max": 153.02919387817383,
            "count": 1176
        },
        "Pedone.Policy.ExtrinsicReward.mean": {
            "value": 3.281619636217753,
            "min": -594.6994817256927,
            "max": 13.971200823783875,
            "count": 1176
        },
        "Pedone.Policy.ExtrinsicReward.sum": {
            "value": 49.224294543266296,
            "min": -7133.596800088882,
            "max": 153.02919387817383,
            "count": 1176
        },
        "Pedone.IsTraining.mean": {
            "value": 1.0,
            "min": 1.0,
            "max": 1.0,
            "count": 1203
        },
        "Pedone.IsTraining.sum": {
            "value": 1.0,
            "min": 1.0,
            "max": 1.0,
            "count": 1203
        },
        "Pedone.Losses.PolicyLoss.mean": {
            "value": 0.03943941000228127,
            "min": 0.02160137442406267,
            "max": 0.059434464853256944,
            "count": 232
        },
        "Pedone.Losses.PolicyLoss.sum": {
            "value": 0.03943941000228127,
            "min": 0.02160137442406267,
            "max": 0.059434464853256944,
            "count": 232
        },
        "Pedone.Losses.ValueLoss.mean": {
            "value": 1.661872128645579,
            "min": 0.3789530376593272,
            "max": 40.40758934020996,
            "count": 232
        },
        "Pedone.Losses.ValueLoss.sum": {
            "value": 1.661872128645579,
            "min": 0.3789530376593272,
            "max": 40.40758934020996,
            "count": 232
        },
        "Pedone.Policy.LearningRate.mean": {
            "value": 0.003000000000000001,
            "min": 0.003000000000000001,
            "max": 0.003000000000000001,
            "count": 232
        },
        "Pedone.Policy.LearningRate.sum": {
            "value": 0.003000000000000001,
            "min": 0.003000000000000001,
            "max": 0.003000000000000001,
            "count": 232
        },
        "Pedone.Policy.Epsilon.mean": {
            "value": 0.20000000000000007,
            "min": 0.20000000000000007,
            "max": 0.20000000000000007,
            "count": 232
        },
        "Pedone.Policy.Epsilon.sum": {
            "value": 0.20000000000000007,
            "min": 0.20000000000000007,
            "max": 0.20000000000000007,
            "count": 232
        },
        "Pedone.Policy.Beta.mean": {
            "value": 0.005000000000000001,
            "min": 0.005000000000000001,
            "max": 0.005000000000000001,
            "count": 232
        },
        "Pedone.Policy.Beta.sum": {
            "value": 0.005000000000000001,
            "min": 0.005000000000000001,
            "max": 0.005000000000000001,
            "count": 232
        }
    },
    "metadata": {
        "timer_format_version": "0.1.0",
        "start_time_seconds": "1704562745",
        "python_version": "3.8.2rc2 (tags/v3.8.2rc2:777ba07, Feb 18 2020, 09:11:15) [MSC v.1916 64 bit (AMD64)]",
        "command_line_arguments": "C:\\Users\\chicc\\Documents\\Python env\\mlagents-25\\Scripts\\mlagents-learn TrainerConfig/trainer_config.yaml --run-id=CV_BASE_NORETRAIN",
        "mlagents_version": "0.25.0",
        "mlagents_envs_version": "0.25.0",
        "communication_protocol_version": "1.5.0",
        "pytorch_version": "1.7.1+cpu",
        "numpy_version": "1.19.5",
        "end_time_seconds": "1704564985"
    },
    "total": 2240.0904647,
    "count": 1,
    "self": 0.009096799999952054,
    "children": {
        "run_training.setup": {
            "total": 0.1833304,
            "count": 1,
            "self": 0.1833304
        },
        "TrainerController.start_learning": {
            "total": 2239.8980375,
            "count": 1,
            "self": 1.928214300018226,
            "children": {
                "TrainerController._reset_env": {
                    "total": 15.707175300000001,
                    "count": 1,
                    "self": 15.707175300000001
                },
                "TrainerController.advance": {
                    "total": 2222.139518199982,
                    "count": 60113,
                    "self": 1.0267275999767662,
                    "children": {
                        "env_step": {
                            "total": 2221.112790600005,
                            "count": 60113,
                            "self": 2007.096425400032,
                            "children": {
                                "SubprocessEnvManager._take_step": {
                                    "total": 212.89255559999043,
                                    "count": 60113,
                                    "self": 4.428679799963987,
                                    "children": {
                                        "TorchPolicy.evaluate": {
                                            "total": 208.46387580002644,
                                            "count": 46087,
                                            "self": 26.284912000028044,
                                            "children": {
                                                "TorchPolicy.sample_actions": {
                                                    "total": 182.1789637999984,
                                                    "count": 46087,
                                                    "self": 182.1789637999984
                                                }
                                            }
                                        }
                                    }
                                },
                                "workers": {
                                    "total": 1.1238095999826072,
                                    "count": 60112,
                                    "self": 0.0,
                                    "children": {
                                        "worker_root": {
                                            "total": 2221.8034579999985,
                                            "count": 60112,
                                            "is_parallel": true,
                                            "self": 480.26674259999754,
                                            "children": {
                                                "steps_from_proto": {
                                                    "total": 0.002782700000000915,
                                                    "count": 1,
                                                    "is_parallel": true,
                                                    "self": 0.0001306000000003138,
                                                    "children": {
                                                        "_process_rank_one_or_two_observation": {
                                                            "total": 0.002652100000000601,
                                                            "count": 2,
                                                            "is_parallel": true,
                                                            "self": 0.002652100000000601
                                                        }
                                                    }
                                                },
                                                "UnityEnvironment.step": {
                                                    "total": 1741.533932700001,
                                                    "count": 60112,
                                                    "is_parallel": true,
                                                    "self": 43.28641059998267,
                                                    "children": {
                                                        "UnityEnvironment._generate_step_input": {
                                                            "total": 28.638570099997555,
                                                            "count": 60112,
                                                            "is_parallel": true,
                                                            "self": 28.638570099997555
                                                        },
                                                        "communicator.exchange": {
                                                            "total": 1379.4115620000218,
                                                            "count": 60112,
                                                            "is_parallel": true,
                                                            "self": 1379.4115620000218
                                                        },
                                                        "steps_from_proto": {
                                                            "total": 290.19738999999896,
                                                            "count": 60112,
                                                            "is_parallel": true,
                                                            "self": 11.391250499969885,
                                                            "children": {
                                                                "_process_rank_one_or_two_observation": {
                                                                    "total": 278.8061395000291,
                                                                    "count": 120224,
                                                                    "is_parallel": true,
                                                                    "self": 278.8061395000291
                                                                }
                                                            }
                                                        }
                                                    }
                                                }
                                            }
                                        }
                                    }
                                }
                            }
                        }
                    }
                },
                "trainer_threads": {
                    "total": 5.7899999774235766e-05,
                    "count": 1,
                    "self": 5.7899999774235766e-05,
                    "children": {
                        "thread_root": {
                            "total": 0.0,
                            "count": 0,
                            "is_parallel": true,
                            "self": 0.0,
                            "children": {
                                "trainer_advance": {
                                    "total": 2221.887451599964,
                                    "count": 120211,
                                    "is_parallel": true,
                                    "self": 6.325681099972371,
                                    "children": {
                                        "process_trajectory": {
                                            "total": 1702.371382599991,
                                            "count": 120211,
                                            "is_parallel": true,
                                            "self": 1701.061449599991,
                                            "children": {
                                                "RLTrainer._checkpoint": {
                                                    "total": 1.309932999999944,
                                                    "count": 12,
                                                    "is_parallel": true,
                                                    "self": 1.309932999999944
                                                }
                                            }
                                        },
                                        "_update_policy": {
                                            "total": 513.1903879000007,
                                            "count": 232,
                                            "is_parallel": true,
                                            "self": 276.62209680000103,
                                            "children": {
                                                "TorchPPOOptimizer.update": {
                                                    "total": 236.56829109999967,
                                                    "count": 6960,
                                                    "is_parallel": true,
                                                    "self": 236.56829109999967
                                                }
                                            }
                                        }
                                    }
                                }
                            }
                        }
                    }
                },
                "TrainerController._save_models": {
                    "total": 0.1230718000001616,
                    "count": 1,
                    "self": 0.04135949999999866,
                    "children": {
                        "RLTrainer._checkpoint": {
                            "total": 0.08171230000016294,
                            "count": 1,
                            "self": 0.08171230000016294
                        }
                    }
                }
            }
        }
    }
}