06/01/2024 01:40:06;1704501606;33031;8;-0,0953908
06/01/2024 01:40:06;1704501606;33046;1;6,995
06/01/2024 01:40:06;1704501606;33063;1;4,994501
06/01/2024 01:40:06;1704501606;33077;1;6,9951
06/01/2024 01:40:07;1704501607;33095;1;6,9942
06/01/2024 01:40:07;1704501607;33109;1;6,9953
06/01/2024 01:40:07;1704501607;33123;1;6,9952
06/01/2024 01:40:07;1704501607;33141;1;6,9942
06/01/2024 01:40:08;1704501608;33159;1;6,994
06/01/2024 01:40:08;1704501608;33172;1;6,9954
06/01/2024 01:40:08;1704501608;33187;1;6,9952
06/01/2024 01:40:08;1704501608;33201;1;6,9953
06/01/2024 01:40:08;1704501608;33215;1;6,9954
06/01/2024 01:40:09;1704501609;33230;1;5,9949
06/01/2024 01:40:09;1704501609;33249;1;6,9938
06/01/2024 01:40:09;1704501609;33263;1;6,4952
06/01/2024 01:40:09;1704501609;33281;1;6,4942
06/01/2024 01:40:10;1704501610;33298;1;6,9941
06/01/2024 01:40:10;1704501610;33312;1;6,9955
06/01/2024 01:40:10;1704501610;33326;1;6,9953
06/01/2024 01:40:10;1704501610;33340;1;6,9953
06/01/2024 01:40:10;1704501610;33354;1;6,9954
06/01/2024 01:40:11;1704501611;33368;1;6,9952
06/01/2024 01:40:11;1704501611;33388;1;-0,5068069
06/01/2024 01:40:11;1704501611;33407;1;-1,506105
06/01/2024 01:40:11;1704501611;33422;1;6,9948
06/01/2024 01:40:12;1704501612;33439;1;6,9946
06/01/2024 01:40:12;1704501612;33457;1;6,9939
06/01/2024 01:40:12;1704501612;33472;1;6,995
06/01/2024 01:40:12;1704501612;33486;1;5,495199
06/01/2024 01:40:13;1704501613;33500;1;6,9955
06/01/2024 01:40:13;1704501613;33516;1;5,994699
06/01/2024 01:40:13;1704501613;33529;1;6,9955
06/01/2024 01:40:13;1704501613;33547;1;6,994
06/01/2024 01:40:13;1704501613;33562;1;6,9952
06/01/2024 01:40:14;1704501614;33576;1;6,9953
06/01/2024 01:40:14;1704501614;33589;1;6,9956
06/01/2024 01:40:14;1704501614;33604;1;6,995
06/01/2024 01:40:14;1704501614;33618;1;6,9954
06/01/2024 01:40:14;1704501614;33633;1;6,995
06/01/2024 01:40:15;1704501615;33647;1;6,9952
06/01/2024 01:40:15;1704501615;33661;1;6,9954
06/01/2024 01:40:15;1704501615;33680;1;-1,006507
06/01/2024 01:40:15;1704501615;33695;1;6,495
06/01/2024 01:40:15;1704501615;33711;1;6,9947
06/01/2024 01:40:16;1704501616;33728;1;6,9945
06/01/2024 01:40:16;1704501616;33741;1;6,9956
06/01/2024 01:40:16;1704501616;33756;1;6,995
06/01/2024 01:40:16;1704501616;33771;1;6,9949
06/01/2024 01:40:17;1704501617;33787;1;6,9949
06/01/2024 01:40:17;1704501617;33800;1;6,9955
06/01/2024 01:40:17;1704501617;33815;1;6,9949
06/01/2024 01:40:17;1704501617;33829;1;6,9954
06/01/2024 01:40:17;1704501617;33844;1;6,9951
06/01/2024 01:40:18;1704501618;33858;1;6,9954
06/01/2024 01:40:18;1704501618;33872;1;6,9951
06/01/2024 01:40:18;1704501618;33886;1;6,9954
06/01/2024 01:40:18;1704501618;33900;1;6,9952
06/01/2024 01:40:18;1704501618;33918;1;6,994
06/01/2024 01:40:19;1704501619;33933;1;6,9951
06/01/2024 01:40:19;1704501619;33948;1;6,4951
06/01/2024 01:40:19;1704501619;33965;1;6,9943
06/01/2024 01:40:19;1704501619;33979;1;6,9954
06/01/2024 01:40:19;1704501619;33992;1;6,9957
06/01/2024 01:40:20;1704501620;34008;1;6,9946
06/01/2024 01:40:20;1704501620;34024;1;6,4947
06/01/2024 01:40:20;1704501620;34038;1;6,9954
06/01/2024 01:40:20;1704501620;34055;1;6,4941
06/01/2024 01:40:21;1704501621;34069;1;6,9954
06/01/2024 01:40:21;1704501621;34083;1;6,9955
06/01/2024 01:40:21;1704501621;34097;1;6,9953
06/01/2024 01:40:21;1704501621;34111;1;6,9952
06/01/2024 01:40:21;1704501621;34128;1;6,9944
06/01/2024 01:40:22;1704501622;34142;1;6,4953
06/01/2024 01:40:22;1704501622;34156;1;6,9955
06/01/2024 01:40:22;1704501622;34176;1;1,493294
06/01/2024 01:40:22;1704501622;34189;1;6,9957
06/01/2024 01:40:22;1704501622;34203;1;6,9953
06/01/2024 01:40:23;1704501623;34218;1;6,9949
06/01/2024 01:40:23;1704501623;34232;1;6,4953
06/01/2024 01:40:23;1704501623;34247;1;6,4949
06/01/2024 01:40:23;1704501623;34261;1;6,9955
06/01/2024 01:40:23;1704501623;34276;1;6,995
06/01/2024 01:40:24;1704501624;34292;1;6,9946
06/01/2024 01:40:24;1704501624;34308;1;6,4948
06/01/2024 01:40:24;1704501624;34323;1;6,995
06/01/2024 01:40:24;1704501624;34338;1;6,9948
06/01/2024 01:40:24;1704501624;34354;1;6,9948
06/01/2024 01:40:25;1704501625;34370;1;6,9946
06/01/2024 01:40:25;1704501625;34383;1;6,9956
06/01/2024 01:40:25;1704501625;34396;1;6,9956
06/01/2024 01:40:25;1704501625;34412;1;6,9948
06/01/2024 01:40:26;1704501626;34427;1;6,9951
06/01/2024 01:40:26;1704501626;34442;1;6,995
06/01/2024 01:40:26;1704501626;34456;1;6,9952
06/01/2024 01:40:26;1704501626;34473;1;6,4944
06/01/2024 01:40:26;1704501626;34487;1;6,9952
06/01/2024 01:40:27;1704501627;34501;1;6,9954
06/01/2024 01:40:27;1704501627;34516;1;6,995
06/01/2024 01:40:27;1704501627;34530;1;6,9953
