07/01/2024 19:08:11;1704650891;32
07/01/2024 19:08:17;1704650897;300
07/01/2024 19:08:19;1704650899;86
07/01/2024 19:08:20;1704650900;81
07/01/2024 19:08:22;1704650902;80
07/01/2024 19:08:24;1704650904;79
07/01/2024 19:08:26;1704650906;80
07/01/2024 19:08:31;1704650911;299
07/01/2024 19:08:33;1704650913;82
07/01/2024 19:08:35;1704650915;83
07/01/2024 19:08:36;1704650916;82
07/01/2024 19:08:38;1704650918;77
07/01/2024 19:08:40;1704650920;85
07/01/2024 19:08:41;1704650921;75
07/01/2024 19:08:43;1704650923;80
07/01/2024 19:08:45;1704650925;85
07/01/2024 19:08:47;1704650927;83
07/01/2024 19:08:48;1704650928;76
07/01/2024 19:08:50;1704650930;82
07/01/2024 19:08:52;1704650932;86
07/01/2024 19:08:54;1704650934;80
07/01/2024 19:08:56;1704650936;80
07/01/2024 19:08:58;1704650938;87
07/01/2024 19:09:00;1704650940;82
07/01/2024 19:09:02;1704650942;82
07/01/2024 19:09:03;1704650943;79
07/01/2024 19:09:05;1704650945;80
07/01/2024 19:09:07;1704650947;81
07/01/2024 19:09:09;1704650949;81
07/01/2024 19:09:10;1704650950;81
07/01/2024 19:09:12;1704650952;84
07/01/2024 19:09:14;1704650954;82
07/01/2024 19:09:16;1704650956;79
07/01/2024 19:09:17;1704650957;78
07/01/2024 19:09:19;1704650959;79
07/01/2024 19:09:21;1704650961;85
07/01/2024 19:09:23;1704650963;83
07/01/2024 19:09:25;1704650965;86
07/01/2024 19:09:26;1704650966;83
07/01/2024 19:09:28;1704650968;85
07/01/2024 19:09:30;1704650970;80
07/01/2024 19:09:32;1704650972;79
07/01/2024 19:09:33;1704650973;79
07/01/2024 19:09:35;1704650975;89
07/01/2024 19:09:37;1704650977;81
07/01/2024 19:09:39;1704650979;80
07/01/2024 19:09:41;1704650981;81
07/01/2024 19:09:42;1704650982;78
07/01/2024 19:09:44;1704650984;82
07/01/2024 19:09:46;1704650986;85
07/01/2024 19:09:48;1704650988;83
07/01/2024 19:09:50;1704650990;79
07/01/2024 19:09:51;1704650991;84
07/01/2024 19:09:54;1704650994;85
07/01/2024 19:09:55;1704650995;85
07/01/2024 19:09:57;1704650997;85
07/01/2024 19:09:59;1704650999;81
07/01/2024 19:10:01;1704651001;80
07/01/2024 19:10:02;1704651002;83
07/01/2024 19:10:04;1704651004;88
07/01/2024 19:10:06;1704651006;82
07/01/2024 19:10:08;1704651008;85
07/01/2024 19:10:10;1704651010;82
07/01/2024 19:10:11;1704651011;84
07/01/2024 19:10:13;1704651013;77
07/01/2024 19:10:15;1704651015;76
07/01/2024 19:10:17;1704651017;76
07/01/2024 19:10:22;1704651022;299
07/01/2024 19:10:24;1704651024;78
07/01/2024 19:10:26;1704651026;81
07/01/2024 19:10:27;1704651027;82
07/01/2024 19:10:29;1704651029;83
07/01/2024 19:10:31;1704651031;81
07/01/2024 19:10:32;1704651032;74
07/01/2024 19:10:34;1704651034;75
07/01/2024 19:10:36;1704651036;76
07/01/2024 19:10:37;1704651037;80
07/01/2024 19:10:39;1704651039;90
07/01/2024 19:10:41;1704651041;85
07/01/2024 19:10:43;1704651043;76
07/01/2024 19:10:45;1704651045;79
07/01/2024 19:10:47;1704651047;84
07/01/2024 19:10:48;1704651048;79
07/01/2024 19:10:50;1704651050;83
07/01/2024 19:10:52;1704651052;80
07/01/2024 19:10:54;1704651054;75
07/01/2024 19:10:55;1704651055;76
07/01/2024 19:10:57;1704651057;77
07/01/2024 19:10:59;1704651059;80
07/01/2024 19:11:01;1704651061;80
07/01/2024 19:11:02;1704651062;85
07/01/2024 19:11:04;1704651064;82
07/01/2024 19:11:06;1704651066;78
07/01/2024 19:11:08;1704651068;99
07/01/2024 19:11:09;1704651069;79
07/01/2024 19:11:11;1704651071;86
07/01/2024 19:11:13;1704651073;78
07/01/2024 19:11:15;1704651075;81
07/01/2024 19:11:17;1704651077;87
07/01/2024 19:11:22;1704651082;299
