06/01/2024 16:20:20;1704554420;18
06/01/2024 16:20:21;1704554421;14
06/01/2024 16:20:21;1704554421;14
06/01/2024 16:20:21;1704554421;13
06/01/2024 16:20:21;1704554421;12
06/01/2024 16:20:21;1704554421;13
06/01/2024 16:20:22;1704554422;14
06/01/2024 16:20:22;1704554422;13
06/01/2024 16:20:22;1704554422;12
06/01/2024 16:20:22;1704554422;13
06/01/2024 16:20:23;1704554423;13
06/01/2024 16:20:23;1704554423;14
06/01/2024 16:20:23;1704554423;13
06/01/2024 16:20:23;1704554423;14
06/01/2024 16:20:24;1704554424;12
06/01/2024 16:20:24;1704554424;13
06/01/2024 16:20:24;1704554424;14
06/01/2024 16:20:24;1704554424;11
06/01/2024 16:20:24;1704554424;12
06/01/2024 16:20:25;1704554425;13
06/01/2024 16:20:25;1704554425;13
06/01/2024 16:20:25;1704554425;15
06/01/2024 16:20:25;1704554425;13
06/01/2024 16:20:26;1704554426;13
06/01/2024 16:20:26;1704554426;13
06/01/2024 16:20:26;1704554426;14
06/01/2024 16:20:26;1704554426;13
06/01/2024 16:20:26;1704554426;13
06/01/2024 16:20:27;1704554427;13
06/01/2024 16:20:27;1704554427;15
06/01/2024 16:20:27;1704554427;11
06/01/2024 16:20:27;1704554427;13
06/01/2024 16:20:28;1704554428;15
06/01/2024 16:20:28;1704554428;13
06/01/2024 16:20:28;1704554428;16
06/01/2024 16:20:28;1704554428;12
06/01/2024 16:20:29;1704554429;14
06/01/2024 16:20:29;1704554429;15
06/01/2024 16:20:29;1704554429;14
06/01/2024 16:20:30;1704554430;21
06/01/2024 16:20:30;1704554430;14
06/01/2024 16:20:30;1704554430;14
06/01/2024 16:20:30;1704554430;13
06/01/2024 16:20:31;1704554431;14
06/01/2024 16:20:31;1704554431;12
06/01/2024 16:20:31;1704554431;13
06/01/2024 16:20:31;1704554431;12
06/01/2024 16:20:31;1704554431;13
06/01/2024 16:20:32;1704554432;15
06/01/2024 16:20:32;1704554432;14
06/01/2024 16:20:32;1704554432;14
06/01/2024 16:20:32;1704554432;12
06/01/2024 16:20:33;1704554433;14
06/01/2024 16:20:33;1704554433;12
06/01/2024 16:20:33;1704554433;15
06/01/2024 16:20:33;1704554433;15
06/01/2024 16:20:34;1704554434;15
06/01/2024 16:20:34;1704554434;13
06/01/2024 16:20:34;1704554434;13
06/01/2024 16:20:34;1704554434;14
06/01/2024 16:20:35;1704554435;14
06/01/2024 16:20:35;1704554435;16
06/01/2024 16:20:35;1704554435;15
06/01/2024 16:20:35;1704554435;15
06/01/2024 16:20:36;1704554436;14
06/01/2024 16:20:36;1704554436;13
06/01/2024 16:20:36;1704554436;13
06/01/2024 16:20:36;1704554436;15
06/01/2024 16:20:36;1704554436;15
06/01/2024 16:20:37;1704554437;12
06/01/2024 16:20:37;1704554437;12
06/01/2024 16:20:37;1704554437;12
06/01/2024 16:20:37;1704554437;14
06/01/2024 16:20:38;1704554438;12
06/01/2024 16:20:38;1704554438;13
06/01/2024 16:20:38;1704554438;13
06/01/2024 16:20:38;1704554438;13
06/01/2024 16:20:38;1704554438;14
06/01/2024 16:20:39;1704554439;13
06/01/2024 16:20:39;1704554439;12
06/01/2024 16:20:39;1704554439;14
06/01/2024 16:20:39;1704554439;13
06/01/2024 16:20:40;1704554440;15
06/01/2024 16:20:40;1704554440;16
06/01/2024 16:20:40;1704554440;13
06/01/2024 16:20:40;1704554440;14
06/01/2024 16:20:41;1704554441;13
06/01/2024 16:20:41;1704554441;15
06/01/2024 16:20:41;1704554441;13
06/01/2024 16:20:41;1704554441;14
06/01/2024 16:20:41;1704554441;15
06/01/2024 16:20:42;1704554442;14
06/01/2024 16:20:42;1704554442;15
06/01/2024 16:20:42;1704554442;12
06/01/2024 16:20:42;1704554442;14
06/01/2024 16:20:43;1704554443;13
06/01/2024 16:20:43;1704554443;13
06/01/2024 16:20:43;1704554443;12
06/01/2024 16:20:43;1704554443;12
06/01/2024 16:20:44;1704554444;13
