07/01/2024 23:24:37;1704666277;0;Second
07/01/2024 23:24:37;1704666277;0;First
07/01/2024 23:24:37;1704666277;11;First
07/01/2024 23:24:37;1704666277;12;Second
07/01/2024 23:24:37;1704666277;10;Second
07/01/2024 23:24:37;1704666277;11;First
07/01/2024 23:24:38;1704666278;11;First
07/01/2024 23:24:38;1704666278;11;Second
07/01/2024 23:24:38;1704666278;10;First
07/01/2024 23:24:38;1704666278;11;Second
07/01/2024 23:24:38;1704666278;10;Second
07/01/2024 23:24:38;1704666278;11;First
07/01/2024 23:24:38;1704666278;11;First
07/01/2024 23:24:38;1704666278;11;Second
07/01/2024 23:24:39;1704666279;11;Second
07/01/2024 23:24:39;1704666279;11;First
07/01/2024 23:24:39;1704666279;11;First
07/01/2024 23:24:39;1704666279;11;Second
07/01/2024 23:24:39;1704666279;10;First
07/01/2024 23:24:39;1704666279;11;Second
07/01/2024 23:24:39;1704666279;10;First
07/01/2024 23:24:39;1704666279;11;Second
07/01/2024 23:24:39;1704666279;10;First
07/01/2024 23:24:39;1704666279;11;Second
07/01/2024 23:24:40;1704666280;10;Second
07/01/2024 23:24:40;1704666280;11;First
07/01/2024 23:24:40;1704666280;10;Second
07/01/2024 23:24:40;1704666280;10;First
07/01/2024 23:24:40;1704666280;10;First
07/01/2024 23:24:40;1704666280;11;Second
07/01/2024 23:24:40;1704666280;10;First
07/01/2024 23:24:40;1704666280;11;Second
07/01/2024 23:24:40;1704666280;11;Second
07/01/2024 23:24:40;1704666280;11;First
07/01/2024 23:24:41;1704666281;10;First
07/01/2024 23:24:41;1704666281;11;Second
07/01/2024 23:24:41;1704666281;10;First
07/01/2024 23:24:41;1704666281;11;Second
07/01/2024 23:24:41;1704666281;10;First
07/01/2024 23:24:41;1704666281;11;Second
07/01/2024 23:24:41;1704666281;10;First
07/01/2024 23:24:41;1704666281;10;Second
07/01/2024 23:24:41;1704666281;11;First
07/01/2024 23:24:41;1704666281;11;Second
07/01/2024 23:24:42;1704666282;11;Second
07/01/2024 23:24:42;1704666282;11;First
07/01/2024 23:24:42;1704666282;11;Second
07/01/2024 23:24:42;1704666282;12;First
07/01/2024 23:24:42;1704666282;10;Second
07/01/2024 23:24:42;1704666282;10;First
07/01/2024 23:24:42;1704666282;11;First
07/01/2024 23:24:42;1704666282;11;Second
07/01/2024 23:24:43;1704666283;10;First
07/01/2024 23:24:43;1704666283;11;Second
07/01/2024 23:24:43;1704666283;11;First
07/01/2024 23:24:43;1704666283;11;Second
07/01/2024 23:24:43;1704666283;9;First
07/01/2024 23:24:43;1704666283;11;Second
07/01/2024 23:24:43;1704666283;10;Second
07/01/2024 23:24:43;1704666283;11;First
07/01/2024 23:24:43;1704666283;11;Second
07/01/2024 23:24:43;1704666283;12;First
07/01/2024 23:24:44;1704666284;11;Second
07/01/2024 23:24:44;1704666284;11;First
07/01/2024 23:24:44;1704666284;11;First
07/01/2024 23:24:44;1704666284;11;Second
07/01/2024 23:24:44;1704666284;11;First
07/01/2024 23:24:44;1704666284;11;Second
07/01/2024 23:24:44;1704666284;11;First
07/01/2024 23:24:44;1704666284;12;Second
07/01/2024 23:24:44;1704666284;11;First
07/01/2024 23:24:44;1704666284;11;Second
07/01/2024 23:24:45;1704666285;10;Second
07/01/2024 23:24:45;1704666285;11;First
07/01/2024 23:24:45;1704666285;10;First
07/01/2024 23:24:45;1704666285;11;Second
07/01/2024 23:24:45;1704666285;10;First
07/01/2024 23:24:45;1704666285;11;Second
07/01/2024 23:24:45;1704666285;10;Second
07/01/2024 23:24:45;1704666285;10;First
07/01/2024 23:24:45;1704666285;11;Second
07/01/2024 23:24:45;1704666285;12;First
07/01/2024 23:24:46;1704666286;10;First
07/01/2024 23:24:46;1704666286;11;Second
07/01/2024 23:24:46;1704666286;10;First
07/01/2024 23:24:46;1704666286;11;Second
07/01/2024 23:24:46;1704666286;10;First
07/01/2024 23:24:46;1704666286;11;Second
07/01/2024 23:24:46;1704666286;10;First
07/01/2024 23:24:46;1704666286;11;Second
07/01/2024 23:24:47;1704666287;10;First
07/01/2024 23:24:47;1704666287;11;Second
07/01/2024 23:24:47;1704666287;10;First
07/01/2024 23:24:47;1704666287;10;Second
07/01/2024 23:24:47;1704666287;11;Second
07/01/2024 23:24:47;1704666287;11;First
07/01/2024 23:24:47;1704666287;10;First
07/01/2024 23:24:47;1704666287;11;Second
07/01/2024 23:24:47;1704666287;11;Second
07/01/2024 23:24:47;1704666287;11;First
07/01/2024 23:24:48;1704666288;10;Second
07/01/2024 23:24:48;1704666288;11;First
07/01/2024 23:24:48;1704666288;11;Second
07/01/2024 23:24:48;1704666288;12;First
07/01/2024 23:24:48;1704666288;10;First
07/01/2024 23:24:48;1704666288;11;Second
07/01/2024 23:24:48;1704666288;10;First
07/01/2024 23:24:48;1704666288;11;Second
07/01/2024 23:24:49;1704666289;10;Second
07/01/2024 23:24:49;1704666289;11;First
07/01/2024 23:24:49;1704666289;10;First
07/01/2024 23:24:49;1704666289;11;Second
07/01/2024 23:24:49;1704666289;10;First
07/01/2024 23:24:49;1704666289;11;Second
07/01/2024 23:24:49;1704666289;11;Second
07/01/2024 23:24:49;1704666289;11;First
07/01/2024 23:24:50;1704666290;10;Second
07/01/2024 23:24:50;1704666290;10;First
07/01/2024 23:24:50;1704666290;10;Second
07/01/2024 23:24:50;1704666290;11;First
07/01/2024 23:24:50;1704666290;10;First
07/01/2024 23:24:50;1704666290;10;Second
07/01/2024 23:24:50;1704666290;11;First
07/01/2024 23:24:50;1704666290;11;Second
07/01/2024 23:24:50;1704666290;10;First
07/01/2024 23:24:50;1704666290;12;Second
07/01/2024 23:24:51;1704666291;10;First
07/01/2024 23:24:51;1704666291;11;Second
07/01/2024 23:24:51;1704666291;10;First
07/01/2024 23:24:51;1704666291;11;Second
07/01/2024 23:24:51;1704666291;10;First
07/01/2024 23:24:51;1704666291;10;Second
07/01/2024 23:24:51;1704666291;10;First
07/01/2024 23:24:51;1704666291;12;Second
07/01/2024 23:24:52;1704666292;10;First
07/01/2024 23:24:52;1704666292;10;Second
07/01/2024 23:24:52;1704666292;11;First
07/01/2024 23:24:52;1704666292;12;Second
07/01/2024 23:24:52;1704666292;10;First
07/01/2024 23:24:52;1704666292;10;Second
07/01/2024 23:24:52;1704666292;10;Second
07/01/2024 23:24:52;1704666292;12;First
07/01/2024 23:24:53;1704666293;11;Second
07/01/2024 23:24:53;1704666293;12;First
07/01/2024 23:24:53;1704666293;10;Second
07/01/2024 23:24:53;1704666293;10;First
07/01/2024 23:24:53;1704666293;11;First
07/01/2024 23:24:53;1704666293;11;Second
07/01/2024 23:24:53;1704666293;10;First
07/01/2024 23:24:53;1704666293;11;Second
07/01/2024 23:24:54;1704666294;11;First
07/01/2024 23:24:54;1704666294;11;Second
07/01/2024 23:24:54;1704666294;11;First
07/01/2024 23:24:54;1704666294;11;Second
07/01/2024 23:24:54;1704666294;11;First
07/01/2024 23:24:54;1704666294;11;Second
07/01/2024 23:24:54;1704666294;10;Second
07/01/2024 23:24:54;1704666294;10;First
07/01/2024 23:24:54;1704666294;11;Second
07/01/2024 23:24:54;1704666294;12;First
07/01/2024 23:24:55;1704666295;11;First
07/01/2024 23:24:55;1704666295;11;Second
07/01/2024 23:24:55;1704666295;11;First
07/01/2024 23:24:55;1704666295;13;Second
07/01/2024 23:24:55;1704666295;10;First
07/01/2024 23:24:55;1704666295;11;Second
07/01/2024 23:24:55;1704666295;10;First
07/01/2024 23:24:55;1704666295;10;Second
07/01/2024 23:24:56;1704666296;11;Second
07/01/2024 23:24:56;1704666296;11;First
07/01/2024 23:24:56;1704666296;11;Second
07/01/2024 23:24:56;1704666296;11;First
07/01/2024 23:24:56;1704666296;10;Second
07/01/2024 23:24:56;1704666296;12;First
07/01/2024 23:24:56;1704666296;11;Second
07/01/2024 23:24:56;1704666296;11;First
07/01/2024 23:24:57;1704666297;10;First
07/01/2024 23:24:57;1704666297;11;Second
07/01/2024 23:24:57;1704666297;10;First
07/01/2024 23:24:57;1704666297;12;Second
07/01/2024 23:24:57;1704666297;10;First
07/01/2024 23:24:57;1704666297;10;Second
07/01/2024 23:24:57;1704666297;10;Second
07/01/2024 23:24:57;1704666297;10;First
07/01/2024 23:24:58;1704666298;11;First
07/01/2024 23:24:58;1704666298;12;Second
07/01/2024 23:24:58;1704666298;11;First
07/01/2024 23:24:58;1704666298;11;Second
07/01/2024 23:24:58;1704666298;11;Second
07/01/2024 23:24:58;1704666298;11;First
07/01/2024 23:24:58;1704666298;10;Second
07/01/2024 23:24:58;1704666298;10;First
07/01/2024 23:24:58;1704666298;11;First
07/01/2024 23:24:58;1704666298;11;Second
07/01/2024 23:24:59;1704666299;10;First
07/01/2024 23:24:59;1704666299;10;Second
07/01/2024 23:24:59;1704666299;11;Second
07/01/2024 23:24:59;1704666299;12;First
07/01/2024 23:24:59;1704666299;11;First
07/01/2024 23:24:59;1704666299;11;Second
07/01/2024 23:25:00;1704666300;11;Second
07/01/2024 23:25:00;1704666300;11;First
