07/01/2024 21:57:48;1704661068;13
07/01/2024 21:57:49;1704661069;17
07/01/2024 21:57:49;1704661069;20
07/01/2024 21:57:50;1704661070;21
07/01/2024 21:57:51;1704661071;19
07/01/2024 21:57:52;1704661072;20
07/01/2024 21:57:52;1704661072;18
07/01/2024 21:57:53;1704661073;19
07/01/2024 21:57:53;1704661073;18
07/01/2024 21:57:54;1704661074;16
07/01/2024 21:57:55;1704661075;20
07/01/2024 21:57:55;1704661075;20
07/01/2024 21:57:56;1704661076;19
07/01/2024 21:57:56;1704661076;15
07/01/2024 21:57:57;1704661077;19
07/01/2024 21:57:57;1704661077;19
07/01/2024 21:57:58;1704661078;18
07/01/2024 21:57:59;1704661079;22
07/01/2024 21:57:59;1704661079;17
07/01/2024 21:58:00;1704661080;20
07/01/2024 21:58:00;1704661080;19
07/01/2024 21:58:01;1704661081;19
07/01/2024 21:58:02;1704661082;20
07/01/2024 21:58:02;1704661082;18
07/01/2024 21:58:03;1704661083;18
07/01/2024 21:58:03;1704661083;16
07/01/2024 21:58:04;1704661084;20
07/01/2024 21:58:05;1704661085;20
07/01/2024 21:58:05;1704661085;18
07/01/2024 21:58:06;1704661086;16
07/01/2024 21:58:06;1704661086;17
07/01/2024 21:58:07;1704661087;23
07/01/2024 21:58:08;1704661088;21
07/01/2024 21:58:08;1704661088;18
07/01/2024 21:58:09;1704661089;17
07/01/2024 21:58:10;1704661090;17
07/01/2024 21:58:10;1704661090;19
07/01/2024 21:58:11;1704661091;16
07/01/2024 21:58:11;1704661091;19
07/01/2024 21:58:12;1704661092;19
07/01/2024 21:58:13;1704661093;19
07/01/2024 21:58:13;1704661093;20
07/01/2024 21:58:14;1704661094;18
07/01/2024 21:58:14;1704661094;20
07/01/2024 21:58:15;1704661095;19
07/01/2024 21:58:16;1704661096;20
07/01/2024 21:58:16;1704661096;20
07/01/2024 21:58:17;1704661097;19
07/01/2024 21:58:17;1704661097;18
07/01/2024 21:58:18;1704661098;20
07/01/2024 21:58:19;1704661099;18
07/01/2024 21:58:19;1704661099;18
07/01/2024 21:58:20;1704661100;20
07/01/2024 21:58:20;1704661100;20
07/01/2024 21:58:21;1704661101;20
07/01/2024 21:58:22;1704661102;16
07/01/2024 21:58:23;1704661103;19
07/01/2024 21:58:23;1704661103;22
07/01/2024 21:58:24;1704661104;18
07/01/2024 21:58:25;1704661105;16
07/01/2024 21:58:26;1704661106;19
07/01/2024 21:58:26;1704661106;21
07/01/2024 21:58:27;1704661107;17
07/01/2024 21:58:27;1704661107;17
07/01/2024 21:58:28;1704661108;24
07/01/2024 21:58:29;1704661109;16
07/01/2024 21:58:29;1704661109;17
07/01/2024 21:58:30;1704661110;21
07/01/2024 21:58:30;1704661110;20
07/01/2024 21:58:31;1704661111;19
07/01/2024 21:58:32;1704661112;19
07/01/2024 21:58:32;1704661112;22
07/01/2024 21:58:33;1704661113;19
07/01/2024 21:58:33;1704661113;19
07/01/2024 21:58:34;1704661114;21
07/01/2024 21:58:35;1704661115;19
07/01/2024 21:58:35;1704661115;17
07/01/2024 21:58:36;1704661116;17
07/01/2024 21:58:37;1704661117;20
07/01/2024 21:58:37;1704661117;21
07/01/2024 21:58:38;1704661118;18
07/01/2024 21:58:38;1704661118;17
07/01/2024 21:58:39;1704661119;22
07/01/2024 21:58:39;1704661119;17
07/01/2024 21:58:40;1704661120;21
07/01/2024 21:58:41;1704661121;19
07/01/2024 21:58:41;1704661121;19
07/01/2024 21:58:42;1704661122;19
07/01/2024 21:58:42;1704661122;18
07/01/2024 21:58:43;1704661123;17
07/01/2024 21:58:44;1704661124;17
07/01/2024 21:58:44;1704661124;19
07/01/2024 21:58:45;1704661125;18
07/01/2024 21:58:45;1704661125;18
07/01/2024 21:58:46;1704661126;21
07/01/2024 21:58:47;1704661127;21
07/01/2024 21:58:47;1704661127;17
07/01/2024 21:58:48;1704661128;19
07/01/2024 21:58:49;1704661129;18
07/01/2024 21:58:49;1704661129;18
