07/01/2024 19:43:25;1704653005;19
07/01/2024 19:43:25;1704653005;44
07/01/2024 19:43:26;1704653006;43
07/01/2024 19:43:27;1704653007;43
07/01/2024 19:43:27;1704653007;45
07/01/2024 19:43:28;1704653008;43
07/01/2024 19:43:28;1704653008;46
07/01/2024 19:43:29;1704653009;41
07/01/2024 19:43:30;1704653010;45
07/01/2024 19:43:30;1704653010;42
07/01/2024 19:43:31;1704653011;45
07/01/2024 19:43:31;1704653011;46
07/01/2024 19:43:32;1704653012;43
07/01/2024 19:43:33;1704653013;45
07/01/2024 19:43:33;1704653013;48
07/01/2024 19:43:34;1704653014;45
07/01/2024 19:43:35;1704653015;45
07/01/2024 19:43:35;1704653015;41
07/01/2024 19:43:36;1704653016;42
07/01/2024 19:43:36;1704653016;43
07/01/2024 19:43:37;1704653017;42
07/01/2024 19:43:38;1704653018;45
07/01/2024 19:43:38;1704653018;48
07/01/2024 19:43:39;1704653019;46
07/01/2024 19:43:39;1704653019;47
07/01/2024 19:43:40;1704653020;45
07/01/2024 19:43:41;1704653021;47
07/01/2024 19:43:41;1704653021;45
07/01/2024 19:43:42;1704653022;42
07/01/2024 19:43:42;1704653022;44
07/01/2024 19:43:43;1704653023;44
07/01/2024 19:43:44;1704653024;41
07/01/2024 19:43:44;1704653024;45
07/01/2024 19:43:45;1704653025;44
07/01/2024 19:43:45;1704653025;46
07/01/2024 19:43:46;1704653026;44
07/01/2024 19:43:47;1704653027;46
07/01/2024 19:43:47;1704653027;46
07/01/2024 19:43:48;1704653028;42
07/01/2024 19:43:48;1704653028;44
07/01/2024 19:43:49;1704653029;44
07/01/2024 19:43:50;1704653030;44
07/01/2024 19:43:50;1704653030;44
07/01/2024 19:43:51;1704653031;43
07/01/2024 19:43:51;1704653031;42
07/01/2024 19:43:52;1704653032;43
07/01/2024 19:43:53;1704653033;43
07/01/2024 19:43:53;1704653033;45
07/01/2024 19:43:54;1704653034;44
07/01/2024 19:43:54;1704653034;46
07/01/2024 19:43:55;1704653035;44
07/01/2024 19:43:56;1704653036;44
07/01/2024 19:43:56;1704653036;47
07/01/2024 19:43:57;1704653037;44
07/01/2024 19:43:57;1704653037;46
07/01/2024 19:43:58;1704653038;42
07/01/2024 19:43:59;1704653039;49
07/01/2024 19:43:59;1704653039;43
07/01/2024 19:44:00;1704653040;42
07/01/2024 19:44:01;1704653041;45
07/01/2024 19:44:01;1704653041;46
07/01/2024 19:44:02;1704653042;43
07/01/2024 19:44:02;1704653042;42
07/01/2024 19:44:03;1704653043;45
07/01/2024 19:44:03;1704653043;47
07/01/2024 19:44:04;1704653044;43
07/01/2024 19:44:05;1704653045;44
07/01/2024 19:44:05;1704653045;43
07/01/2024 19:44:06;1704653046;44
07/01/2024 19:44:07;1704653047;43
07/01/2024 19:44:07;1704653047;45
07/01/2024 19:44:08;1704653048;44
07/01/2024 19:44:08;1704653048;46
07/01/2024 19:44:09;1704653049;45
07/01/2024 19:44:10;1704653050;46
07/01/2024 19:44:10;1704653050;46
07/01/2024 19:44:11;1704653051;46
07/01/2024 19:44:11;1704653051;43
07/01/2024 19:44:12;1704653052;44
07/01/2024 19:44:13;1704653053;44
07/01/2024 19:44:13;1704653053;44
07/01/2024 19:44:14;1704653054;43
07/01/2024 19:44:14;1704653054;46
07/01/2024 19:44:15;1704653055;45
07/01/2024 19:44:16;1704653056;44
07/01/2024 19:44:16;1704653056;46
07/01/2024 19:44:17;1704653057;44
07/01/2024 19:44:17;1704653057;45
07/01/2024 19:44:18;1704653058;44
07/01/2024 19:44:19;1704653059;43
07/01/2024 19:44:19;1704653059;44
07/01/2024 19:44:20;1704653060;47
07/01/2024 19:44:20;1704653060;43
07/01/2024 19:44:21;1704653061;44
07/01/2024 19:44:21;1704653061;43
07/01/2024 19:44:22;1704653062;44
07/01/2024 19:44:23;1704653063;45
07/01/2024 19:44:24;1704653064;46
07/01/2024 19:44:24;1704653064;43
07/01/2024 19:44:25;1704653065;42
