07/01/2024 22:03:26;1704661406;23
07/01/2024 22:03:26;1704661406;22
07/01/2024 22:03:27;1704661407;24
07/01/2024 22:03:28;1704661408;24
07/01/2024 22:03:28;1704661408;22
07/01/2024 22:03:29;1704661409;25
07/01/2024 22:03:30;1704661410;24
07/01/2024 22:03:30;1704661410;23
07/01/2024 22:03:31;1704661411;24
07/01/2024 22:03:32;1704661412;23
07/01/2024 22:03:32;1704661412;22
07/01/2024 22:03:33;1704661413;22
07/01/2024 22:03:33;1704661413;23
07/01/2024 22:03:34;1704661414;21
07/01/2024 22:03:34;1704661414;19
07/01/2024 22:03:35;1704661415;22
07/01/2024 22:03:36;1704661416;23
07/01/2024 22:03:36;1704661416;23
07/01/2024 22:03:37;1704661417;20
07/01/2024 22:03:37;1704661417;23
07/01/2024 22:03:38;1704661418;22
07/01/2024 22:03:39;1704661419;23
07/01/2024 22:03:39;1704661419;22
07/01/2024 22:03:40;1704661420;21
07/01/2024 22:03:40;1704661420;22
07/01/2024 22:03:41;1704661421;24
07/01/2024 22:03:41;1704661421;22
07/01/2024 22:03:42;1704661422;23
07/01/2024 22:03:43;1704661423;23
07/01/2024 22:03:43;1704661423;21
07/01/2024 22:03:44;1704661424;22
07/01/2024 22:03:44;1704661424;23
07/01/2024 22:03:45;1704661425;22
07/01/2024 22:03:45;1704661425;24
07/01/2024 22:03:46;1704661426;22
07/01/2024 22:03:47;1704661427;22
07/01/2024 22:03:47;1704661427;23
07/01/2024 22:03:48;1704661428;23
07/01/2024 22:03:48;1704661428;22
07/01/2024 22:03:49;1704661429;21
07/01/2024 22:03:50;1704661430;21
07/01/2024 22:03:50;1704661430;20
07/01/2024 22:03:51;1704661431;21
07/01/2024 22:03:52;1704661432;21
07/01/2024 22:03:53;1704661433;21
07/01/2024 22:03:53;1704661433;22
07/01/2024 22:03:54;1704661434;23
07/01/2024 22:03:54;1704661434;22
07/01/2024 22:03:55;1704661435;22
07/01/2024 22:03:55;1704661435;22
07/01/2024 22:03:56;1704661436;22
07/01/2024 22:03:57;1704661437;22
07/01/2024 22:03:57;1704661437;22
07/01/2024 22:03:58;1704661438;21
07/01/2024 22:03:58;1704661438;21
07/01/2024 22:03:59;1704661439;21
07/01/2024 22:03:59;1704661439;22
07/01/2024 22:04:00;1704661440;21
07/01/2024 22:04:00;1704661440;23
07/01/2024 22:04:01;1704661441;21
07/01/2024 22:04:02;1704661442;21
07/01/2024 22:04:02;1704661442;28
07/01/2024 22:04:03;1704661443;22
07/01/2024 22:04:03;1704661443;21
07/01/2024 22:04:04;1704661444;22
07/01/2024 22:04:05;1704661445;24
07/01/2024 22:04:05;1704661445;23
07/01/2024 22:04:06;1704661446;23
07/01/2024 22:04:06;1704661446;21
07/01/2024 22:04:07;1704661447;22
07/01/2024 22:04:07;1704661447;21
07/01/2024 22:04:08;1704661448;21
07/01/2024 22:04:09;1704661449;22
07/01/2024 22:04:09;1704661449;22
07/01/2024 22:04:10;1704661450;22
07/01/2024 22:04:10;1704661450;22
07/01/2024 22:04:11;1704661451;21
07/01/2024 22:04:11;1704661451;22
07/01/2024 22:04:12;1704661452;22
07/01/2024 22:04:13;1704661453;24
07/01/2024 22:04:13;1704661453;22
07/01/2024 22:04:14;1704661454;22
07/01/2024 22:04:14;1704661454;22
07/01/2024 22:04:15;1704661455;23
07/01/2024 22:04:16;1704661456;20
07/01/2024 22:04:16;1704661456;21
07/01/2024 22:04:17;1704661457;21
07/01/2024 22:04:17;1704661457;21
07/01/2024 22:04:18;1704661458;22
07/01/2024 22:04:18;1704661458;21
07/01/2024 22:04:19;1704661459;20
07/01/2024 22:04:19;1704661459;24
07/01/2024 22:04:20;1704661460;24
07/01/2024 22:04:20;1704661460;21
07/01/2024 22:04:21;1704661461;22
07/01/2024 22:04:22;1704661462;21
07/01/2024 22:04:22;1704661462;21
07/01/2024 22:04:23;1704661463;21
07/01/2024 22:04:23;1704661463;21
