07/01/2024 21:43:12;1704660192;10443;1;7,987299
07/01/2024 21:43:15;1704660195;10567;3;-15,89387
07/01/2024 21:43:18;1704660198;10676;3;-9,578997
07/01/2024 21:43:20;1704660200;10767;3;4,972469
07/01/2024 21:43:23;1704660203;10867;3;0,792402
07/01/2024 21:43:26;1704660206;10983;3;-20,56317
07/01/2024 21:43:28;1704660208;11086;3;-2,706987
07/01/2024 21:43:31;1704660211;11196;3;-2,697517
07/01/2024 21:43:34;1704660214;11303;3;-4,726326
07/01/2024 21:43:37;1704660217;11418;3;-15,7239
07/01/2024 21:43:40;1704660220;11521;3;-2,202365
07/01/2024 21:43:43;1704660223;11616;3;-2,699503
07/01/2024 21:43:46;1704660226;11710;3;-2,202507
07/01/2024 21:43:50;1704660230;11914;3;-65,5704
07/01/2024 21:43:52;1704660232;12018;3;-5,699442
07/01/2024 21:43:55;1704660235;12113;3;3,803138
07/01/2024 21:43:59;1704660239;12317;3;-61,38322
07/01/2024 21:44:01;1704660241;12413;3;3,784572
07/01/2024 21:44:04;1704660244;12527;3;-16,73549
07/01/2024 21:44:06;1704660246;12622;3;0,9704323
07/01/2024 21:44:10;1704660250;12737;3;-28,73121
07/01/2024 21:44:12;1704660252;12837;3;-5,588537
07/01/2024 21:44:15;1704660255;12949;3;-19,54524
07/01/2024 21:44:18;1704660258;13080;3;-24,40952
07/01/2024 21:44:20;1704660260;13180;3;3,636838
07/01/2024 21:44:23;1704660263;13284;3;3,962204
07/01/2024 21:44:25;1704660265;13390;3;0,7903668
07/01/2024 21:44:30;1704660270;13565;3;-59,29613
07/01/2024 21:44:32;1704660272;13667;3;-9,58131
07/01/2024 21:44:35;1704660275;13769;3;0,2956057
07/01/2024 21:44:37;1704660277;13867;3;1,137032
07/01/2024 21:44:39;1704660279;13974;3;-9,034089
07/01/2024 21:44:42;1704660282;14071;3;-3,696594
07/01/2024 21:44:47;1704660287;14282;3;-60,39972
07/01/2024 21:44:49;1704660289;14387;3;-7,206851
07/01/2024 21:44:52;1704660292;14491;3;-3,720657
07/01/2024 21:44:54;1704660294;14587;3;4,13737
07/01/2024 21:44:57;1704660297;14696;3;-7,211045
07/01/2024 21:44:59;1704660299;14789;3;3,304774
07/01/2024 21:45:01;1704660301;14884;3;5,6342
07/01/2024 21:45:03;1704660303;14979;3;-0,8633266
07/01/2024 21:45:06;1704660306;15094;3;-8,388485
07/01/2024 21:45:09;1704660309;15194;3;-4,531988
07/01/2024 21:45:13;1704660313;15392;3;-69,23141
07/01/2024 21:45:16;1704660316;15507;3;-9,876245
07/01/2024 21:45:19;1704660319;15608;3;-18,19784
07/01/2024 21:45:21;1704660321;15713;3;2,802665
07/01/2024 21:45:24;1704660324;15813;3;-10,57825
07/01/2024 21:45:26;1704660326;15911;3;3,634266
07/01/2024 21:45:28;1704660328;16008;3;-4,743685
07/01/2024 21:45:31;1704660331;16115;3;-5,869352
07/01/2024 21:45:33;1704660333;16214;3;2,303535
07/01/2024 21:45:35;1704660335;16308;3;2,459671
07/01/2024 21:45:37;1704660337;16400;3;6,6368
07/01/2024 21:45:40;1704660340;16507;3;-11,53327
07/01/2024 21:45:43;1704660343;16614;3;-6,875032
07/01/2024 21:45:46;1704660346;16734;3;-18,0998
07/01/2024 21:45:48;1704660348;16841;3;-13,36999
07/01/2024 21:45:52;1704660352;16979;3;-36,05961
07/01/2024 21:45:55;1704660355;17076;3;-4,031436
07/01/2024 21:45:57;1704660357;17174;3;1,131674
07/01/2024 21:45:59;1704660359;17275;3;3,302965
07/01/2024 21:46:03;1704660363;17474;3;-60,38635
07/01/2024 21:46:05;1704660365;17569;3;-1,36214
07/01/2024 21:46:08;1704660368;17666;3;1,627329
07/01/2024 21:46:10;1704660370;17767;3;-9,031034
07/01/2024 21:46:13;1704660373;17870;3;-5,529659
07/01/2024 21:46:15;1704660375;17966;3;-4,871457
07/01/2024 21:46:17;1704660377;18061;3;-1,028469
07/01/2024 21:46:20;1704660380;18170;3;-4,405298
07/01/2024 21:46:22;1704660382;18267;3;-0,1975056
07/01/2024 21:46:25;1704660385;18370;3;-15,21108
07/01/2024 21:46:28;1704660388;18477;3;-22,06476
07/01/2024 21:46:30;1704660390;18582;3;-2,038634
07/01/2024 21:46:38;1704660398;18881;3;-207,9158
07/01/2024 21:46:40;1704660400;18977;3;0,79193
07/01/2024 21:46:43;1704660403;19073;3;-1,205873
07/01/2024 21:46:45;1704660405;19181;3;-13,54102
07/01/2024 21:46:48;1704660408;19290;3;-11,54242
07/01/2024 21:46:50;1704660410;19385;3;-1,366219
07/01/2024 21:46:52;1704660412;19477;3;1,137795
07/01/2024 21:46:55;1704660415;19587;3;-0,6984033
07/01/2024 21:46:57;1704660417;19689;3;0,6301327
07/01/2024 21:47:00;1704660420;19784;3;-5,707399
07/01/2024 21:47:02;1704660422;19899;3;-21,21634
07/01/2024 21:47:05;1704660425;20016;3;-19,41381
07/01/2024 21:47:08;1704660428;20127;3;-10,06935
07/01/2024 21:47:10;1704660430;20225;3;-2,208033
07/01/2024 21:47:13;1704660433;20327;3;-1,375035
07/01/2024 21:47:16;1704660436;20455;3;-27,91038
07/01/2024 21:47:19;1704660439;20547;3;-6,195048
07/01/2024 21:47:21;1704660441;20638;3;-1,195834
07/01/2024 21:47:24;1704660444;20735;3;-8,221301
07/01/2024 21:47:26;1704660446;20837;3;-5,202199
07/01/2024 21:47:28;1704660448;20938;3;-7,229362
07/01/2024 21:47:31;1704660451;21047;3;0,4583289
07/01/2024 21:47:33;1704660453;21145;3;-3,037235
07/01/2024 21:47:36;1704660456;21253;3;-5,537527
07/01/2024 21:47:38;1704660458;21346;3;0,3016289
07/01/2024 21:47:40;1704660460;21448;3;0,7903321
