05/01/2024 22:22:56;1704489776;1;First
05/01/2024 22:22:56;1704489776;1;Second
05/01/2024 22:22:57;1704489777;52;Second
05/01/2024 22:22:57;1704489777;54;First
05/01/2024 22:22:58;1704489778;49;Second
05/01/2024 22:22:58;1704489778;51;First
05/01/2024 22:23:00;1704489780;52;Second
05/01/2024 22:23:00;1704489780;53;First
05/01/2024 22:23:00;1704489780;49;Second
05/01/2024 22:23:00;1704489780;54;First
05/01/2024 22:23:01;1704489781;52;Second
05/01/2024 22:23:01;1704489781;54;First
05/01/2024 22:23:02;1704489782;45;Second
05/01/2024 22:23:02;1704489782;51;First
05/01/2024 22:23:03;1704489783;49;Second
05/01/2024 22:23:03;1704489783;53;First
05/01/2024 22:23:04;1704489784;53;First
05/01/2024 22:23:05;1704489785;88;Second
05/01/2024 22:23:06;1704489786;50;Second
05/01/2024 22:23:06;1704489786;52;First
05/01/2024 22:23:07;1704489787;49;Second
05/01/2024 22:23:07;1704489787;51;First
05/01/2024 22:23:08;1704489788;50;Second
05/01/2024 22:23:08;1704489788;52;First
05/01/2024 22:23:09;1704489789;50;Second
05/01/2024 22:23:09;1704489789;52;First
05/01/2024 22:23:10;1704489790;48;Second
05/01/2024 22:23:10;1704489790;50;First
05/01/2024 22:23:10;1704489790;47;Second
05/01/2024 22:23:11;1704489791;50;First
05/01/2024 22:23:11;1704489791;45;Second
05/01/2024 22:23:11;1704489791;50;First
05/01/2024 22:23:13;1704489793;50;Second
05/01/2024 22:23:13;1704489793;51;First
05/01/2024 22:23:13;1704489793;50;Second
05/01/2024 22:23:13;1704489793;53;First
05/01/2024 22:23:14;1704489794;48;Second
05/01/2024 22:23:14;1704489794;51;First
05/01/2024 22:23:15;1704489795;47;Second
05/01/2024 22:23:15;1704489795;53;First
05/01/2024 22:23:16;1704489796;51;Second
05/01/2024 22:23:16;1704489796;53;First
05/01/2024 22:23:17;1704489797;50;Second
05/01/2024 22:23:17;1704489797;51;First
05/01/2024 22:23:18;1704489798;50;Second
05/01/2024 22:23:18;1704489798;54;First
05/01/2024 22:23:19;1704489799;51;Second
05/01/2024 22:23:19;1704489799;55;First
05/01/2024 22:23:20;1704489800;49;Second
05/01/2024 22:23:20;1704489800;54;First
05/01/2024 22:23:21;1704489801;47;Second
05/01/2024 22:23:21;1704489801;53;First
05/01/2024 22:23:22;1704489802;49;Second
05/01/2024 22:23:22;1704489802;55;First
05/01/2024 22:23:23;1704489803;50;Second
05/01/2024 22:23:23;1704489803;51;First
05/01/2024 22:23:24;1704489804;49;Second
05/01/2024 22:23:24;1704489804;52;First
05/01/2024 22:23:25;1704489805;49;Second
05/01/2024 22:23:25;1704489805;52;First
05/01/2024 22:23:26;1704489806;49;Second
05/01/2024 22:23:26;1704489806;52;First
