07/01/2024 19:12:54;1704651174;17915;13;4,804754
07/01/2024 19:12:55;1704651175;17964;1;9,983807
07/01/2024 19:12:55;1704651175;18007;1;5,985699
07/01/2024 19:12:56;1704651176;18051;1;11,9852
07/01/2024 19:12:56;1704651176;18096;1;5,984899
07/01/2024 19:12:57;1704651177;18145;1;11,4839
07/01/2024 19:12:58;1704651178;18194;1;9,483609
07/01/2024 19:12:58;1704651178;18237;1;8,985502
07/01/2024 19:12:59;1704651179;18282;1;10,985
07/01/2024 19:13:00;1704651180;18326;1;7,485399
07/01/2024 19:13:00;1704651180;18370;1;11,4852
07/01/2024 19:13:01;1704651181;18418;1;10,9843
07/01/2024 19:13:02;1704651182;18463;1;9,484909
07/01/2024 19:13:02;1704651182;18507;1;9,485203
07/01/2024 19:13:03;1704651183;18557;1;9,983503
07/01/2024 19:13:03;1704651183;18601;1;10,9854
07/01/2024 19:13:04;1704651184;18650;1;10,48361
07/01/2024 19:13:05;1704651185;18697;1;9,984104
07/01/2024 19:13:05;1704651185;18742;1;6,485202
07/01/2024 19:13:06;1704651186;18785;1;10,98551
07/01/2024 19:13:07;1704651187;18829;1;10,48531
07/01/2024 19:13:07;1704651187;18875;1;9,484805
07/01/2024 19:13:08;1704651188;18918;1;9,485606
07/01/2024 19:13:09;1704651189;18964;1;7,984599
07/01/2024 19:13:09;1704651189;19011;1;9,484605
07/01/2024 19:13:10;1704651190;19052;1;11,4861
07/01/2024 19:13:10;1704651190;19097;1;8,485304
07/01/2024 19:13:11;1704651191;19144;1;8,9842
07/01/2024 19:13:12;1704651192;19190;1;7,984504
07/01/2024 19:13:12;1704651192;19235;1;11,4853
07/01/2024 19:13:13;1704651193;19279;1;11,4852
07/01/2024 19:13:14;1704651194;19323;1;9,485304
07/01/2024 19:13:14;1704651194;19369;1;9,484802
07/01/2024 19:13:15;1704651195;19414;1;9,485003
07/01/2024 19:13:15;1704651195;19458;1;8,985305
07/01/2024 19:13:16;1704651196;19500;1;11,4859
07/01/2024 19:13:17;1704651197;19546;1;9,484708
07/01/2024 19:13:17;1704651197;19592;1;11,4846
07/01/2024 19:13:18;1704651198;19639;1;11,4843
07/01/2024 19:13:19;1704651199;19683;1;10,48551
07/01/2024 19:13:19;1704651199;19730;1;10,48411
07/01/2024 19:13:20;1704651200;19776;1;10,48471
07/01/2024 19:13:20;1704651200;19822;1;9,484606
07/01/2024 19:13:21;1704651201;19867;1;9,985006
07/01/2024 19:13:22;1704651202;19912;1;9,985204
07/01/2024 19:13:22;1704651202;19956;1;10,4853
07/01/2024 19:13:23;1704651203;19999;1;10,4856
07/01/2024 19:13:24;1704651204;20046;1;9,984505
07/01/2024 19:13:24;1704651204;20092;1;8,984608
07/01/2024 19:13:25;1704651205;20138;1;9,984605
07/01/2024 19:13:25;1704651205;20183;1;10,98491
07/01/2024 19:13:26;1704651206;20226;1;9,985605
07/01/2024 19:13:27;1704651207;20270;1;10,48541
07/01/2024 19:13:27;1704651207;20314;1;10,4854
07/01/2024 19:13:28;1704651208;20358;1;10,9853
07/01/2024 19:13:28;1704651208;20402;1;11,4854
07/01/2024 19:13:29;1704651209;20449;1;9,484304
07/01/2024 19:13:30;1704651210;20494;1;11,4852
07/01/2024 19:13:30;1704651210;20536;1;9,986006
07/01/2024 19:13:31;1704651211;20579;1;11,4855
07/01/2024 19:13:32;1704651212;20625;1;10,9848
07/01/2024 19:13:32;1704651212;20672;1;8,984405
07/01/2024 19:13:33;1704651213;20715;1;9,485502
07/01/2024 19:13:34;1704651214;20759;1;11,4852
07/01/2024 19:13:34;1704651214;20805;1;9,984905
07/01/2024 19:13:35;1704651215;20850;1;10,4847
07/01/2024 19:13:35;1704651215;20895;1;9,985106
07/01/2024 19:13:36;1704651216;20940;1;10,48521
07/01/2024 19:13:37;1704651217;20987;1;11,4841
07/01/2024 19:13:37;1704651217;21031;1;11,4855
07/01/2024 19:13:38;1704651218;21080;1;7,983501
07/01/2024 19:13:39;1704651219;21124;1;11,4854
07/01/2024 19:13:39;1704651219;21169;1;10,9851
07/01/2024 19:13:40;1704651220;21218;1;9,483504
07/01/2024 19:13:41;1704651221;21266;1;10,48421
07/01/2024 19:13:41;1704651221;21309;1;8,9855
07/01/2024 19:13:42;1704651222;21353;1;10,48551
07/01/2024 19:13:42;1704651222;21402;1;9,483509
07/01/2024 19:13:43;1704651223;21446;1;10,4854
07/01/2024 19:13:44;1704651224;21492;1;9,484802
07/01/2024 19:13:44;1704651224;21539;1;9,984104
07/01/2024 19:13:45;1704651225;21586;1;11,4846
07/01/2024 19:13:46;1704651226;21629;1;9,985408
07/01/2024 19:13:46;1704651226;21673;1;10,48561
07/01/2024 19:13:47;1704651227;21716;1;8,9856
07/01/2024 19:13:48;1704651228;21760;1;10,48531
07/01/2024 19:13:48;1704651228;21802;1;9,985806
07/01/2024 19:13:49;1704651229;21848;1;10,4847
07/01/2024 19:13:49;1704651229;21893;1;9,485203
07/01/2024 19:13:50;1704651230;21937;1;11,4851
07/01/2024 19:13:51;1704651231;21983;1;9,485003
07/01/2024 19:13:51;1704651231;22028;1;8,985001
07/01/2024 19:13:52;1704651232;22072;1;10,9852
07/01/2024 19:13:53;1704651233;22119;1;9,984208
07/01/2024 19:13:53;1704651233;22165;1;11,4849
07/01/2024 19:13:54;1704651234;22211;1;10,98451
07/01/2024 19:13:54;1704651234;22256;1;9,485106
07/01/2024 19:13:55;1704651235;22302;1;10,98451
07/01/2024 19:13:56;1704651236;22350;1;6,484098
07/01/2024 19:13:56;1704651236;22393;1;6,985602
