05/01/2024 22:15:01;1704489301;51
05/01/2024 22:15:01;1704489301;13
05/01/2024 22:15:02;1704489302;15
05/01/2024 22:15:02;1704489302;13
05/01/2024 22:15:03;1704489303;22
05/01/2024 22:15:03;1704489303;14
05/01/2024 22:15:04;1704489304;15
05/01/2024 22:15:04;1704489304;14
05/01/2024 22:15:05;1704489305;13
05/01/2024 22:15:05;1704489305;14
05/01/2024 22:15:05;1704489305;14
05/01/2024 22:15:06;1704489306;13
05/01/2024 22:15:06;1704489306;14
05/01/2024 22:15:07;1704489307;13
05/01/2024 22:15:07;1704489307;16
05/01/2024 22:15:08;1704489308;13
05/01/2024 22:15:08;1704489308;14
05/01/2024 22:15:09;1704489309;12
05/01/2024 22:15:09;1704489309;13
05/01/2024 22:15:09;1704489309;13
05/01/2024 22:15:10;1704489310;13
05/01/2024 22:15:11;1704489311;19
05/01/2024 22:15:11;1704489311;15
05/01/2024 22:15:12;1704489312;18
05/01/2024 22:15:12;1704489312;13
05/01/2024 22:15:13;1704489313;14
05/01/2024 22:15:13;1704489313;15
05/01/2024 22:15:14;1704489314;15
05/01/2024 22:15:14;1704489314;14
05/01/2024 22:15:14;1704489314;14
