07/01/2024 20:52:53;1704657173;0;First
07/01/2024 20:52:53;1704657173;0;First
07/01/2024 20:52:53;1704657173;0;First
07/01/2024 20:52:53;1704657173;0;First
07/01/2024 20:52:53;1704657173;0;Second
07/01/2024 20:52:53;1704657173;0;Second
07/01/2024 20:52:53;1704657173;0;Second
07/01/2024 20:52:53;1704657173;0;Second
07/01/2024 20:52:55;1704657175;15;Second
07/01/2024 20:52:55;1704657175;16;First
07/01/2024 20:52:55;1704657175;16;First
07/01/2024 20:52:55;1704657175;18;Second
07/01/2024 20:52:55;1704657175;18;First
07/01/2024 20:52:55;1704657175;18;Second
07/01/2024 20:52:55;1704657175;20;Second
07/01/2024 20:52:55;1704657175;21;First
07/01/2024 20:52:56;1704657176;15;Second
07/01/2024 20:52:56;1704657176;17;First
07/01/2024 20:52:56;1704657176;17;Second
07/01/2024 20:52:56;1704657176;18;First
07/01/2024 20:52:56;1704657176;18;Second
07/01/2024 20:52:56;1704657176;20;First
07/01/2024 20:52:56;1704657176;23;Second
07/01/2024 20:52:56;1704657176;24;First
07/01/2024 20:52:58;1704657178;16;Second
07/01/2024 20:52:58;1704657178;17;First
07/01/2024 20:52:58;1704657178;18;First
07/01/2024 20:52:58;1704657178;19;Second
07/01/2024 20:52:58;1704657178;20;First
07/01/2024 20:52:58;1704657178;21;Second
07/01/2024 20:52:58;1704657178;22;Second
07/01/2024 20:52:58;1704657178;23;First
07/01/2024 20:53:01;1704657181;20;First
07/01/2024 20:53:01;1704657181;21;First
07/01/2024 20:53:01;1704657181;23;Second
07/01/2024 20:53:02;1704657182;28;First
07/01/2024 20:53:02;1704657182;29;Second
07/01/2024 20:53:02;1704657182;30;Second
07/01/2024 20:53:02;1704657182;32;Second
07/01/2024 20:53:08;1704657188;300;First
07/01/2024 20:53:09;1704657189;16;Second
07/01/2024 20:53:09;1704657189;17;First
07/01/2024 20:53:09;1704657189;19;First
07/01/2024 20:53:09;1704657189;20;Second
07/01/2024 20:53:09;1704657189;21;First
07/01/2024 20:53:09;1704657189;22;Second
07/01/2024 20:53:09;1704657189;24;First
07/01/2024 20:53:09;1704657189;25;Second
07/01/2024 20:53:10;1704657190;15;Second
07/01/2024 20:53:10;1704657190;16;First
07/01/2024 20:53:11;1704657191;17;First
07/01/2024 20:53:11;1704657191;18;Second
07/01/2024 20:53:11;1704657191;19;First
07/01/2024 20:53:11;1704657191;19;Second
07/01/2024 20:53:11;1704657191;21;Second
07/01/2024 20:53:11;1704657191;21;First
07/01/2024 20:53:12;1704657192;18;Second
07/01/2024 20:53:12;1704657192;19;First
07/01/2024 20:53:12;1704657192;20;Second
07/01/2024 20:53:12;1704657192;21;First
07/01/2024 20:53:12;1704657192;21;Second
07/01/2024 20:53:13;1704657193;24;First
07/01/2024 20:53:13;1704657193;25;Second
07/01/2024 20:53:13;1704657193;25;First
07/01/2024 20:53:14;1704657194;17;Second
07/01/2024 20:53:15;1704657195;20;Second
07/01/2024 20:53:15;1704657195;24;Second
07/01/2024 20:53:15;1704657195;26;First
07/01/2024 20:53:15;1704657195;27;First
07/01/2024 20:53:15;1704657195;28;First
07/01/2024 20:53:15;1704657195;29;First
07/01/2024 20:53:15;1704657195;30;Second
07/01/2024 20:53:17;1704657197;16;First
07/01/2024 20:53:17;1704657197;16;First
07/01/2024 20:53:17;1704657197;17;Second
07/01/2024 20:53:17;1704657197;20;Second
07/01/2024 20:53:17;1704657197;20;First
07/01/2024 20:53:17;1704657197;21;Second
07/01/2024 20:53:17;1704657197;22;First
07/01/2024 20:53:17;1704657197;22;Second
07/01/2024 20:53:19;1704657199;18;First
07/01/2024 20:53:19;1704657199;20;First
07/01/2024 20:53:19;1704657199;21;Second
07/01/2024 20:53:19;1704657199;21;First
07/01/2024 20:53:20;1704657200;34;Second
07/01/2024 20:53:21;1704657201;55;Second
07/01/2024 20:53:21;1704657201;56;First
07/01/2024 20:53:22;1704657202;57;Second
07/01/2024 20:53:23;1704657203;16;First
07/01/2024 20:53:23;1704657203;18;Second
07/01/2024 20:53:24;1704657204;21;First
07/01/2024 20:53:24;1704657204;24;First
07/01/2024 20:53:24;1704657204;24;Second
07/01/2024 20:53:24;1704657204;26;Second
07/01/2024 20:53:24;1704657204;29;Second
07/01/2024 20:53:24;1704657204;29;First
07/01/2024 20:53:25;1704657205;14;First
07/01/2024 20:53:25;1704657205;15;First
07/01/2024 20:53:25;1704657205;16;Second
07/01/2024 20:53:25;1704657205;17;Second
07/01/2024 20:53:25;1704657205;18;First
07/01/2024 20:53:25;1704657205;19;Second
07/01/2024 20:53:25;1704657205;20;First
07/01/2024 20:53:25;1704657205;21;Second
07/01/2024 20:53:27;1704657207;17;First
07/01/2024 20:53:27;1704657207;18;First
07/01/2024 20:53:27;1704657207;19;Second
07/01/2024 20:53:27;1704657207;20;First
07/01/2024 20:53:27;1704657207;21;Second
07/01/2024 20:53:27;1704657207;23;First
07/01/2024 20:53:27;1704657207;23;Second
07/01/2024 20:53:27;1704657207;24;Second
07/01/2024 20:53:29;1704657209;18;Second
07/01/2024 20:53:29;1704657209;19;First
07/01/2024 20:53:29;1704657209;20;Second
07/01/2024 20:53:29;1704657209;20;First
07/01/2024 20:53:29;1704657209;24;Second
07/01/2024 20:53:29;1704657209;26;Second
07/01/2024 20:53:38;1704657218;300;First
07/01/2024 20:53:38;1704657218;300;First
07/01/2024 20:53:40;1704657220;15;Second
07/01/2024 20:53:40;1704657220;19;First
07/01/2024 20:53:40;1704657220;19;Second
07/01/2024 20:53:40;1704657220;20;First
07/01/2024 20:53:40;1704657220;23;Second
07/01/2024 20:53:41;1704657221;27;Second
07/01/2024 20:53:41;1704657221;28;First
07/01/2024 20:53:41;1704657221;29;First
07/01/2024 20:53:43;1704657223;20;First
07/01/2024 20:53:43;1704657223;20;Second
07/01/2024 20:53:43;1704657223;23;First
07/01/2024 20:53:43;1704657223;25;First
07/01/2024 20:53:43;1704657223;25;Second
07/01/2024 20:53:43;1704657223;26;Second
07/01/2024 20:53:43;1704657223;27;First
07/01/2024 20:53:43;1704657223;27;Second
07/01/2024 20:53:45;1704657225;16;First
07/01/2024 20:53:45;1704657225;20;Second
07/01/2024 20:53:45;1704657225;21;First
07/01/2024 20:53:45;1704657225;22;Second
07/01/2024 20:53:45;1704657225;23;Second
07/01/2024 20:53:45;1704657225;24;First
07/01/2024 20:53:45;1704657225;26;First
07/01/2024 20:53:45;1704657225;26;Second
07/01/2024 20:53:47;1704657227;18;Second
07/01/2024 20:53:47;1704657227;19;First
07/01/2024 20:53:47;1704657227;19;Second
07/01/2024 20:53:47;1704657227;21;First
07/01/2024 20:53:47;1704657227;22;First
07/01/2024 20:53:47;1704657227;23;Second
07/01/2024 20:53:47;1704657227;24;Second
07/01/2024 20:53:47;1704657227;25;First
07/01/2024 20:53:49;1704657229;17;First
07/01/2024 20:53:49;1704657229;21;First
07/01/2024 20:53:49;1704657229;22;Second
07/01/2024 20:53:50;1704657230;23;Second
07/01/2024 20:53:50;1704657230;24;First
07/01/2024 20:53:50;1704657230;24;Second
07/01/2024 20:53:50;1704657230;24;First
07/01/2024 20:53:50;1704657230;25;Second
07/01/2024 20:53:51;1704657231;15;First
07/01/2024 20:53:51;1704657231;16;Second
07/01/2024 20:53:51;1704657231;17;First
07/01/2024 20:53:51;1704657231;19;Second
07/01/2024 20:53:51;1704657231;19;First
07/01/2024 20:53:51;1704657231;20;Second
07/01/2024 20:53:51;1704657231;21;First
07/01/2024 20:53:51;1704657231;21;Second
07/01/2024 20:53:53;1704657233;18;First
07/01/2024 20:53:53;1704657233;19;Second
07/01/2024 20:53:53;1704657233;20;First
07/01/2024 20:53:53;1704657233;21;Second
07/01/2024 20:53:53;1704657233;22;Second
07/01/2024 20:53:53;1704657233;24;Second
07/01/2024 20:53:53;1704657233;26;First
07/01/2024 20:53:53;1704657233;27;First
07/01/2024 20:53:55;1704657235;19;First
07/01/2024 20:53:55;1704657235;19;Second
07/01/2024 20:53:55;1704657235;21;Second
07/01/2024 20:53:55;1704657235;21;First
07/01/2024 20:53:55;1704657235;22;First
07/01/2024 20:53:55;1704657235;23;Second
07/01/2024 20:53:55;1704657235;23;First
07/01/2024 20:53:55;1704657235;24;Second
07/01/2024 20:53:57;1704657237;16;First
07/01/2024 20:53:57;1704657237;17;Second
07/01/2024 20:53:57;1704657237;20;First
07/01/2024 20:53:57;1704657237;23;Second
07/01/2024 20:53:57;1704657237;24;First
07/01/2024 20:53:57;1704657237;24;Second
07/01/2024 20:53:57;1704657237;25;First
07/01/2024 20:53:57;1704657237;27;Second
07/01/2024 20:53:59;1704657239;17;First
07/01/2024 20:53:59;1704657239;17;Second
07/01/2024 20:53:59;1704657239;20;First
07/01/2024 20:53:59;1704657239;23;First
07/01/2024 20:53:59;1704657239;26;Second
07/01/2024 20:54:00;1704657240;30;Second
07/01/2024 20:54:00;1704657240;38;First
07/01/2024 20:54:00;1704657240;39;Second
07/01/2024 20:54:01;1704657241;15;First
07/01/2024 20:54:01;1704657241;18;Second
07/01/2024 20:54:01;1704657241;18;First
07/01/2024 20:54:01;1704657241;19;First
07/01/2024 20:54:01;1704657241;19;Second
07/01/2024 20:54:01;1704657241;21;Second
07/01/2024 20:54:02;1704657242;22;Second
07/01/2024 20:54:02;1704657242;23;First
07/01/2024 20:54:03;1704657243;16;Second
07/01/2024 20:54:03;1704657243;18;Second
07/01/2024 20:54:03;1704657243;18;First
07/01/2024 20:54:03;1704657243;20;Second
07/01/2024 20:54:03;1704657243;21;First
07/01/2024 20:54:03;1704657243;21;Second
07/01/2024 20:54:03;1704657243;23;First
07/01/2024 20:54:03;1704657243;24;First
07/01/2024 20:54:05;1704657245;18;Second
07/01/2024 20:54:05;1704657245;19;First
07/01/2024 20:54:05;1704657245;20;Second
07/01/2024 20:54:05;1704657245;20;First
07/01/2024 20:54:05;1704657245;21;First
07/01/2024 20:54:05;1704657245;21;Second
07/01/2024 20:54:05;1704657245;25;Second
07/01/2024 20:54:11;1704657251;299;First
07/01/2024 20:54:13;1704657253;18;Second
07/01/2024 20:54:13;1704657253;18;First
07/01/2024 20:54:13;1704657253;20;First
07/01/2024 20:54:13;1704657253;20;Second
07/01/2024 20:54:13;1704657253;21;First
07/01/2024 20:54:13;1704657253;22;Second
07/01/2024 20:54:13;1704657253;23;First
07/01/2024 20:54:13;1704657253;24;Second
07/01/2024 20:54:15;1704657255;17;Second
07/01/2024 20:54:15;1704657255;17;First
07/01/2024 20:54:15;1704657255;19;First
07/01/2024 20:54:15;1704657255;20;Second
07/01/2024 20:54:15;1704657255;21;Second
07/01/2024 20:54:15;1704657255;22;First
07/01/2024 20:54:15;1704657255;23;Second
07/01/2024 20:54:15;1704657255;24;First
07/01/2024 20:54:16;1704657256;16;Second
07/01/2024 20:54:16;1704657256;18;First
07/01/2024 20:54:16;1704657256;18;Second
07/01/2024 20:54:16;1704657256;19;First
07/01/2024 20:54:16;1704657256;20;First
07/01/2024 20:54:16;1704657256;21;Second
07/01/2024 20:54:16;1704657256;22;Second
07/01/2024 20:54:16;1704657256;22;First
07/01/2024 20:54:19;1704657259;18;First
07/01/2024 20:54:19;1704657259;24;First
07/01/2024 20:54:19;1704657259;26;Second
07/01/2024 20:54:20;1704657260;27;First
07/01/2024 20:54:20;1704657260;28;Second
07/01/2024 20:54:20;1704657260;30;Second
07/01/2024 20:54:20;1704657260;32;First
07/01/2024 20:54:20;1704657260;37;Second
07/01/2024 20:54:21;1704657261;17;First
07/01/2024 20:54:21;1704657261;18;Second
07/01/2024 20:54:21;1704657261;20;Second
07/01/2024 20:54:22;1704657262;22;First
07/01/2024 20:54:22;1704657262;22;Second
07/01/2024 20:54:22;1704657262;23;First
07/01/2024 20:54:22;1704657262;35;First
07/01/2024 20:54:24;1704657264;127;Second
07/01/2024 20:54:26;1704657266;17;First
07/01/2024 20:54:26;1704657266;18;First
07/01/2024 20:54:26;1704657266;20;Second
07/01/2024 20:54:26;1704657266;21;First
07/01/2024 20:54:26;1704657266;22;Second
07/01/2024 20:54:26;1704657266;25;Second
07/01/2024 20:54:26;1704657266;29;First
07/01/2024 20:54:32;1704657272;300;Second
07/01/2024 20:54:33;1704657273;16;First
07/01/2024 20:54:33;1704657273;18;First
07/01/2024 20:54:33;1704657273;19;Second
07/01/2024 20:54:33;1704657273;21;First
07/01/2024 20:54:34;1704657274;21;Second
07/01/2024 20:54:34;1704657274;23;First
07/01/2024 20:54:34;1704657274;23;Second
07/01/2024 20:54:34;1704657274;24;Second
07/01/2024 20:54:35;1704657275;17;First
07/01/2024 20:54:35;1704657275;18;Second
07/01/2024 20:54:35;1704657275;19;First
07/01/2024 20:54:35;1704657275;20;Second
07/01/2024 20:54:35;1704657275;22;First
07/01/2024 20:54:35;1704657275;22;Second
07/01/2024 20:54:35;1704657275;23;First
07/01/2024 20:54:35;1704657275;24;Second
07/01/2024 20:54:36;1704657276;17;Second
07/01/2024 20:54:37;1704657277;18;Second
07/01/2024 20:54:37;1704657277;19;First
07/01/2024 20:54:37;1704657277;19;Second
07/01/2024 20:54:37;1704657277;22;First
07/01/2024 20:54:37;1704657277;22;Second
07/01/2024 20:54:37;1704657277;25;First
07/01/2024 20:54:42;1704657282;300;First
07/01/2024 20:54:44;1704657284;16;Second
07/01/2024 20:54:44;1704657284;18;Second
07/01/2024 20:54:44;1704657284;18;First
07/01/2024 20:54:44;1704657284;20;First
07/01/2024 20:54:44;1704657284;21;First
07/01/2024 20:54:44;1704657284;23;Second
07/01/2024 20:54:44;1704657284;23;First
07/01/2024 20:54:44;1704657284;24;Second
07/01/2024 20:54:47;1704657287;17;Second
07/01/2024 20:54:47;1704657287;19;First
07/01/2024 20:54:47;1704657287;20;First
07/01/2024 20:54:47;1704657287;23;Second
07/01/2024 20:54:47;1704657287;25;Second
07/01/2024 20:54:47;1704657287;26;Second
07/01/2024 20:54:47;1704657287;27;First
07/01/2024 20:54:47;1704657287;29;First
07/01/2024 20:54:49;1704657289;17;Second
07/01/2024 20:54:49;1704657289;17;First
07/01/2024 20:54:49;1704657289;18;Second
07/01/2024 20:54:49;1704657289;19;First
07/01/2024 20:54:49;1704657289;21;First
07/01/2024 20:54:49;1704657289;21;Second
07/01/2024 20:54:49;1704657289;24;First
07/01/2024 20:54:53;1704657293;299;Second
07/01/2024 20:54:55;1704657295;16;First
07/01/2024 20:54:55;1704657295;18;First
07/01/2024 20:54:55;1704657295;19;First
07/01/2024 20:54:55;1704657295;22;Second
07/01/2024 20:54:55;1704657295;23;Second
07/01/2024 20:54:55;1704657295;24;First
07/01/2024 20:54:55;1704657295;24;Second
07/01/2024 20:54:56;1704657296;26;Second
07/01/2024 20:54:57;1704657297;15;First
07/01/2024 20:54:57;1704657297;19;First
07/01/2024 20:54:57;1704657297;21;Second
07/01/2024 20:54:57;1704657297;21;First
07/01/2024 20:54:57;1704657297;21;Second
07/01/2024 20:54:57;1704657297;23;Second
07/01/2024 20:54:57;1704657297;25;Second
07/01/2024 20:54:57;1704657297;26;First
07/01/2024 20:54:59;1704657299;17;First
07/01/2024 20:54:59;1704657299;17;Second
07/01/2024 20:54:59;1704657299;21;Second
07/01/2024 20:54:59;1704657299;24;Second
07/01/2024 20:54:59;1704657299;24;First
07/01/2024 20:55:04;1704657304;155;First
07/01/2024 20:55:07;1704657307;299;First
07/01/2024 20:55:07;1704657307;299;Second
07/01/2024 20:55:09;1704657309;18;Second
07/01/2024 20:55:09;1704657309;20;First
07/01/2024 20:55:09;1704657309;21;Second
07/01/2024 20:55:09;1704657309;21;First
07/01/2024 20:55:09;1704657309;22;First
07/01/2024 20:55:09;1704657309;22;Second
07/01/2024 20:55:09;1704657309;24;Second
07/01/2024 20:55:09;1704657309;25;First
07/01/2024 20:55:10;1704657310;15;First
07/01/2024 20:55:11;1704657311;16;Second
07/01/2024 20:55:11;1704657311;18;Second
07/01/2024 20:55:11;1704657311;19;First
07/01/2024 20:55:11;1704657311;19;Second
07/01/2024 20:55:11;1704657311;21;Second
07/01/2024 20:55:11;1704657311;21;First
07/01/2024 20:55:11;1704657311;22;First
07/01/2024 20:55:12;1704657312;18;First
07/01/2024 20:55:12;1704657312;19;First
07/01/2024 20:55:12;1704657312;20;Second
07/01/2024 20:55:13;1704657313;20;First
07/01/2024 20:55:13;1704657313;22;Second
07/01/2024 20:55:13;1704657313;22;First
07/01/2024 20:55:13;1704657313;23;Second
07/01/2024 20:55:13;1704657313;25;Second
07/01/2024 20:55:14;1704657314;16;First
07/01/2024 20:55:14;1704657314;18;Second
07/01/2024 20:55:14;1704657314;18;First
07/01/2024 20:55:14;1704657314;21;Second
07/01/2024 20:55:15;1704657315;22;First
07/01/2024 20:55:15;1704657315;22;Second
07/01/2024 20:55:15;1704657315;30;First
07/01/2024 20:55:15;1704657315;34;Second
07/01/2024 20:55:17;1704657317;18;Second
07/01/2024 20:55:17;1704657317;20;First
07/01/2024 20:55:17;1704657317;21;First
07/01/2024 20:55:17;1704657317;25;Second
07/01/2024 20:55:18;1704657318;30;First
07/01/2024 20:55:19;1704657319;44;First
07/01/2024 20:55:19;1704657319;47;Second
07/01/2024 20:55:24;1704657324;299;Second
07/01/2024 20:55:26;1704657326;18;First
07/01/2024 20:55:26;1704657326;19;Second
07/01/2024 20:55:26;1704657326;19;First
07/01/2024 20:55:26;1704657326;21;Second
07/01/2024 20:55:26;1704657326;23;First
07/01/2024 20:55:26;1704657326;23;Second
07/01/2024 20:55:26;1704657326;23;Second
07/01/2024 20:55:29;1704657329;196;First
07/01/2024 20:55:31;1704657331;17;First
07/01/2024 20:55:31;1704657331;18;Second
07/01/2024 20:55:31;1704657331;20;Second
07/01/2024 20:55:31;1704657331;22;Second
07/01/2024 20:55:31;1704657331;22;First
07/01/2024 20:55:31;1704657331;23;First
07/01/2024 20:55:31;1704657331;28;First
07/01/2024 20:55:31;1704657331;32;Second
07/01/2024 20:55:33;1704657333;17;First
07/01/2024 20:55:33;1704657333;19;Second
07/01/2024 20:55:33;1704657333;20;Second
07/01/2024 20:55:33;1704657333;21;First
07/01/2024 20:55:33;1704657333;28;Second
07/01/2024 20:55:33;1704657333;28;First
07/01/2024 20:55:34;1704657334;30;Second
07/01/2024 20:55:39;1704657339;300;First
07/01/2024 20:55:41;1704657341;16;Second
07/01/2024 20:55:41;1704657341;17;Second
07/01/2024 20:55:41;1704657341;19;First
07/01/2024 20:55:41;1704657341;21;First
07/01/2024 20:55:41;1704657341;24;First
07/01/2024 20:55:41;1704657341;28;First
07/01/2024 20:55:41;1704657341;29;Second
07/01/2024 20:55:46;1704657346;299;Second
07/01/2024 20:55:48;1704657348;18;First
07/01/2024 20:55:48;1704657348;19;First
07/01/2024 20:55:48;1704657348;22;Second
07/01/2024 20:55:48;1704657348;24;Second
07/01/2024 20:55:48;1704657348;25;Second
07/01/2024 20:55:48;1704657348;25;First
07/01/2024 20:55:49;1704657349;27;First
07/01/2024 20:55:49;1704657349;28;Second
07/01/2024 20:55:50;1704657350;15;Second
07/01/2024 20:55:50;1704657350;18;Second
07/01/2024 20:55:50;1704657350;19;First
07/01/2024 20:55:50;1704657350;20;Second
07/01/2024 20:55:50;1704657350;21;First
07/01/2024 20:55:50;1704657350;22;Second
07/01/2024 20:55:50;1704657350;23;First
07/01/2024 20:55:50;1704657350;24;First
07/01/2024 20:55:52;1704657352;16;First
07/01/2024 20:55:52;1704657352;17;Second
07/01/2024 20:55:52;1704657352;19;First
07/01/2024 20:55:52;1704657352;20;Second
07/01/2024 20:55:52;1704657352;20;First
07/01/2024 20:55:52;1704657352;21;Second
07/01/2024 20:55:52;1704657352;22;First
07/01/2024 20:55:52;1704657352;23;Second
07/01/2024 20:55:53;1704657353;16;Second
07/01/2024 20:55:53;1704657353;17;First
07/01/2024 20:55:54;1704657354;19;Second
07/01/2024 20:55:54;1704657354;20;First
07/01/2024 20:55:54;1704657354;22;First
07/01/2024 20:55:54;1704657354;28;First
07/01/2024 20:55:54;1704657354;33;Second
07/01/2024 20:55:59;1704657359;299;Second
07/01/2024 20:56:01;1704657361;17;Second
07/01/2024 20:56:01;1704657361;19;Second
07/01/2024 20:56:01;1704657361;22;First
07/01/2024 20:56:01;1704657361;23;First
07/01/2024 20:56:01;1704657361;23;Second
07/01/2024 20:56:02;1704657362;32;Second
07/01/2024 20:56:02;1704657362;32;First
07/01/2024 20:56:02;1704657362;34;First
07/01/2024 20:56:03;1704657363;16;First
07/01/2024 20:56:03;1704657363;17;Second
07/01/2024 20:56:03;1704657363;18;First
07/01/2024 20:56:03;1704657363;19;Second
07/01/2024 20:56:03;1704657363;20;Second
07/01/2024 20:56:03;1704657363;22;Second
07/01/2024 20:56:04;1704657364;23;First
07/01/2024 20:56:04;1704657364;25;First
07/01/2024 20:56:05;1704657365;14;First
07/01/2024 20:56:05;1704657365;16;Second
07/01/2024 20:56:05;1704657365;17;First
07/01/2024 20:56:05;1704657365;19;Second
07/01/2024 20:56:05;1704657365;20;First
07/01/2024 20:56:05;1704657365;22;Second
07/01/2024 20:56:05;1704657365;25;Second
07/01/2024 20:56:05;1704657365;26;First
07/01/2024 20:56:07;1704657367;16;Second
07/01/2024 20:56:07;1704657367;20;Second
07/01/2024 20:56:07;1704657367;20;First
07/01/2024 20:56:07;1704657367;22;Second
07/01/2024 20:56:07;1704657367;23;First
07/01/2024 20:56:07;1704657367;24;First
07/01/2024 20:56:08;1704657368;26;First
07/01/2024 20:56:08;1704657368;26;Second
07/01/2024 20:56:09;1704657369;15;First
07/01/2024 20:56:09;1704657369;18;Second
07/01/2024 20:56:09;1704657369;19;Second
07/01/2024 20:56:09;1704657369;20;First
07/01/2024 20:56:09;1704657369;21;Second
07/01/2024 20:56:09;1704657369;22;Second
07/01/2024 20:56:09;1704657369;23;First
07/01/2024 20:56:14;1704657374;300;First
07/01/2024 20:56:16;1704657376;16;First
07/01/2024 20:56:16;1704657376;17;First
07/01/2024 20:56:16;1704657376;20;Second
07/01/2024 20:56:16;1704657376;21;First
07/01/2024 20:56:16;1704657376;23;Second
07/01/2024 20:56:16;1704657376;25;Second
07/01/2024 20:56:16;1704657376;25;First
07/01/2024 20:56:16;1704657376;26;Second
07/01/2024 20:56:18;1704657378;17;First
07/01/2024 20:56:18;1704657378;17;Second
07/01/2024 20:56:18;1704657378;21;Second
07/01/2024 20:56:19;1704657379;25;First
07/01/2024 20:56:19;1704657379;26;Second
07/01/2024 20:56:19;1704657379;26;First
07/01/2024 20:56:19;1704657379;27;Second
07/01/2024 20:56:19;1704657379;28;First
07/01/2024 20:56:20;1704657380;18;Second
07/01/2024 20:56:20;1704657380;19;First
07/01/2024 20:56:20;1704657380;19;Second
07/01/2024 20:56:20;1704657380;20;First
07/01/2024 20:56:20;1704657380;22;First
07/01/2024 20:56:20;1704657380;23;Second
07/01/2024 20:56:20;1704657380;24;Second
07/01/2024 20:56:21;1704657381;26;First
07/01/2024 20:56:23;1704657383;17;First
07/01/2024 20:56:23;1704657383;20;First
07/01/2024 20:56:23;1704657383;22;Second
07/01/2024 20:56:23;1704657383;27;First
07/01/2024 20:56:23;1704657383;27;Second
07/01/2024 20:56:23;1704657383;28;Second
07/01/2024 20:56:23;1704657383;30;Second
07/01/2024 20:56:29;1704657389;300;First
07/01/2024 20:56:31;1704657391;16;Second
07/01/2024 20:56:31;1704657391;17;First
07/01/2024 20:56:31;1704657391;19;First
07/01/2024 20:56:31;1704657391;19;Second
07/01/2024 20:56:31;1704657391;21;First
07/01/2024 20:56:31;1704657391;27;Second
07/01/2024 20:56:32;1704657392;28;First
07/01/2024 20:56:32;1704657392;28;Second
07/01/2024 20:56:33;1704657393;15;Second
07/01/2024 20:56:34;1704657394;18;First
07/01/2024 20:56:34;1704657394;18;Second
07/01/2024 20:56:34;1704657394;21;Second
07/01/2024 20:56:34;1704657394;26;First
07/01/2024 20:56:34;1704657394;28;First
07/01/2024 20:56:35;1704657395;37;First
07/01/2024 20:56:35;1704657395;37;Second
07/01/2024 20:56:36;1704657396;16;First
07/01/2024 20:56:36;1704657396;16;Second
07/01/2024 20:56:36;1704657396;18;First
07/01/2024 20:56:36;1704657396;20;Second
07/01/2024 20:56:36;1704657396;20;First
07/01/2024 20:56:36;1704657396;21;Second
07/01/2024 20:56:36;1704657396;22;Second
07/01/2024 20:56:36;1704657396;25;First
07/01/2024 20:56:38;1704657398;17;First
07/01/2024 20:56:38;1704657398;19;First
07/01/2024 20:56:40;1704657400;32;Second
07/01/2024 20:56:40;1704657400;34;Second
07/01/2024 20:56:40;1704657400;35;First
07/01/2024 20:56:40;1704657400;35;Second
07/01/2024 20:56:40;1704657400;37;First
07/01/2024 20:56:45;1704657405;300;Second
07/01/2024 20:56:47;1704657407;17;First
07/01/2024 20:56:47;1704657407;18;First
07/01/2024 20:56:47;1704657407;19;Second
07/01/2024 20:56:47;1704657407;20;Second
07/01/2024 20:56:47;1704657407;20;First
07/01/2024 20:56:47;1704657407;22;Second
07/01/2024 20:56:47;1704657407;22;First
07/01/2024 20:56:47;1704657407;23;Second
07/01/2024 20:56:48;1704657408;17;Second
07/01/2024 20:56:49;1704657409;19;First
07/01/2024 20:56:49;1704657409;22;First
07/01/2024 20:56:49;1704657409;24;Second
07/01/2024 20:56:49;1704657409;25;First
07/01/2024 20:56:49;1704657409;26;Second
07/01/2024 20:56:49;1704657409;27;Second
07/01/2024 20:56:49;1704657409;36;First
07/01/2024 20:56:51;1704657411;16;Second
07/01/2024 20:56:51;1704657411;17;First
07/01/2024 20:56:51;1704657411;19;First
07/01/2024 20:56:51;1704657411;20;Second
07/01/2024 20:56:51;1704657411;22;Second
07/01/2024 20:56:51;1704657411;23;First
07/01/2024 20:56:51;1704657411;24;Second
07/01/2024 20:56:56;1704657416;300;First
07/01/2024 20:56:58;1704657418;17;First
07/01/2024 20:56:58;1704657418;18;Second
07/01/2024 20:56:58;1704657418;19;Second
07/01/2024 20:56:58;1704657418;19;First
07/01/2024 20:56:58;1704657418;20;First
07/01/2024 20:56:58;1704657418;21;Second
07/01/2024 20:56:58;1704657418;22;Second
07/01/2024 20:56:58;1704657418;23;First
07/01/2024 20:57:00;1704657420;15;First
07/01/2024 20:57:00;1704657420;16;Second
07/01/2024 20:57:00;1704657420;19;First
07/01/2024 20:57:00;1704657420;20;Second
07/01/2024 20:57:00;1704657420;21;First
07/01/2024 20:57:00;1704657420;25;Second
07/01/2024 20:57:00;1704657420;26;Second
07/01/2024 20:57:00;1704657420;28;First
07/01/2024 20:57:02;1704657422;18;First
07/01/2024 20:57:02;1704657422;19;First
07/01/2024 20:57:02;1704657422;19;Second
07/01/2024 20:57:02;1704657422;20;First
07/01/2024 20:57:02;1704657422;20;Second
07/01/2024 20:57:02;1704657422;22;Second
07/01/2024 20:57:02;1704657422;23;Second
07/01/2024 20:57:02;1704657422;23;First
07/01/2024 20:57:04;1704657424;19;Second
07/01/2024 20:57:04;1704657424;20;First
07/01/2024 20:57:04;1704657424;23;First
07/01/2024 20:57:04;1704657424;24;Second
07/01/2024 20:57:04;1704657424;25;Second
07/01/2024 20:57:04;1704657424;26;First
07/01/2024 20:57:04;1704657424;26;Second
07/01/2024 20:57:05;1704657425;31;First
07/01/2024 20:57:06;1704657426;16;First
07/01/2024 20:57:06;1704657426;18;First
07/01/2024 20:57:06;1704657426;19;Second
07/01/2024 20:57:06;1704657426;20;Second
07/01/2024 20:57:06;1704657426;21;Second
07/01/2024 20:57:06;1704657426;23;First
07/01/2024 20:57:06;1704657426;24;First
07/01/2024 20:57:06;1704657426;24;Second
07/01/2024 20:57:08;1704657428;17;Second
07/01/2024 20:57:08;1704657428;18;Second
07/01/2024 20:57:08;1704657428;19;First
07/01/2024 20:57:08;1704657428;21;Second
07/01/2024 20:57:08;1704657428;22;First
07/01/2024 20:57:08;1704657428;22;Second
07/01/2024 20:57:08;1704657428;25;First
07/01/2024 20:57:08;1704657428;27;First
07/01/2024 20:57:10;1704657430;15;Second
07/01/2024 20:57:10;1704657430;17;First
07/01/2024 20:57:10;1704657430;18;Second
07/01/2024 20:57:10;1704657430;20;First
07/01/2024 20:57:10;1704657430;20;Second
07/01/2024 20:57:10;1704657430;21;Second
07/01/2024 20:57:10;1704657430;22;First
07/01/2024 20:57:10;1704657430;23;First
07/01/2024 20:57:12;1704657432;18;First
07/01/2024 20:57:12;1704657432;19;Second
07/01/2024 20:57:12;1704657432;20;First
07/01/2024 20:57:12;1704657432;20;Second
07/01/2024 20:57:12;1704657432;22;Second
07/01/2024 20:57:12;1704657432;22;First
07/01/2024 20:57:12;1704657432;23;First
07/01/2024 20:57:12;1704657432;25;Second
07/01/2024 20:57:14;1704657434;17;First
07/01/2024 20:57:14;1704657434;20;Second
07/01/2024 20:57:14;1704657434;20;First
07/01/2024 20:57:14;1704657434;21;Second
07/01/2024 20:57:14;1704657434;21;First
07/01/2024 20:57:14;1704657434;23;Second
07/01/2024 20:57:14;1704657434;25;Second
07/01/2024 20:57:14;1704657434;26;First
07/01/2024 20:57:16;1704657436;15;First
07/01/2024 20:57:16;1704657436;19;Second
07/01/2024 20:57:16;1704657436;20;First
07/01/2024 20:57:16;1704657436;20;Second
07/01/2024 20:57:16;1704657436;23;Second
07/01/2024 20:57:16;1704657436;24;Second
07/01/2024 20:57:16;1704657436;26;First
07/01/2024 20:57:22;1704657442;299;First
07/01/2024 20:57:24;1704657444;17;First
07/01/2024 20:57:24;1704657444;23;First
07/01/2024 20:57:25;1704657445;24;Second
07/01/2024 20:57:25;1704657445;25;Second
07/01/2024 20:57:25;1704657445;26;First
07/01/2024 20:57:25;1704657445;27;Second
07/01/2024 20:57:25;1704657445;30;Second
07/01/2024 20:57:25;1704657445;31;First
07/01/2024 20:57:27;1704657447;19;Second
07/01/2024 20:57:27;1704657447;21;Second
07/01/2024 20:57:27;1704657447;22;First
07/01/2024 20:57:27;1704657447;22;Second
07/01/2024 20:57:27;1704657447;23;First
07/01/2024 20:57:27;1704657447;25;First
07/01/2024 20:57:27;1704657447;26;First
07/01/2024 20:57:27;1704657447;28;Second
07/01/2024 20:57:29;1704657449;17;First
07/01/2024 20:57:29;1704657449;19;Second
07/01/2024 20:57:29;1704657449;20;First
07/01/2024 20:57:29;1704657449;21;Second
07/01/2024 20:57:29;1704657449;22;Second
07/01/2024 20:57:29;1704657449;22;First
07/01/2024 20:57:29;1704657449;24;Second
07/01/2024 20:57:29;1704657449;26;First
07/01/2024 20:57:31;1704657451;14;Second
07/01/2024 20:57:31;1704657451;17;First
07/01/2024 20:57:31;1704657451;21;First
07/01/2024 20:57:31;1704657451;22;Second
07/01/2024 20:57:31;1704657451;23;First
07/01/2024 20:57:31;1704657451;23;Second
07/01/2024 20:57:31;1704657451;28;Second
07/01/2024 20:57:31;1704657451;30;First
07/01/2024 20:57:33;1704657453;17;First
07/01/2024 20:57:33;1704657453;19;Second
07/01/2024 20:57:33;1704657453;21;First
07/01/2024 20:57:33;1704657453;21;Second
07/01/2024 20:57:33;1704657453;22;First
07/01/2024 20:57:33;1704657453;24;First
07/01/2024 20:57:33;1704657453;24;Second
07/01/2024 20:57:33;1704657453;26;Second
07/01/2024 20:57:35;1704657455;16;First
07/01/2024 20:57:35;1704657455;18;First
07/01/2024 20:57:35;1704657455;19;Second
07/01/2024 20:57:35;1704657455;21;Second
07/01/2024 20:57:35;1704657455;22;Second
07/01/2024 20:57:35;1704657455;23;First
07/01/2024 20:57:35;1704657455;25;First
07/01/2024 20:57:35;1704657455;26;Second
07/01/2024 20:57:37;1704657457;15;Second
07/01/2024 20:57:37;1704657457;17;Second
07/01/2024 20:57:37;1704657457;19;First
07/01/2024 20:57:37;1704657457;20;First
07/01/2024 20:57:37;1704657457;21;Second
07/01/2024 20:57:37;1704657457;22;First
07/01/2024 20:57:37;1704657457;22;Second
07/01/2024 20:57:37;1704657457;23;First
07/01/2024 20:57:39;1704657459;18;First
07/01/2024 20:57:39;1704657459;20;First
07/01/2024 20:57:39;1704657459;21;First
07/01/2024 20:57:39;1704657459;22;Second
07/01/2024 20:57:39;1704657459;23;Second
07/01/2024 20:57:39;1704657459;25;Second
07/01/2024 20:57:40;1704657460;36;Second
07/01/2024 20:57:40;1704657460;38;First
07/01/2024 20:57:41;1704657461;18;Second
07/01/2024 20:57:41;1704657461;18;First
07/01/2024 20:57:41;1704657461;20;First
07/01/2024 20:57:42;1704657462;22;First
07/01/2024 20:57:42;1704657462;23;Second
07/01/2024 20:57:42;1704657462;23;First
07/01/2024 20:57:42;1704657462;25;Second
07/01/2024 20:57:42;1704657462;26;Second
07/01/2024 20:57:43;1704657463;17;Second
07/01/2024 20:57:43;1704657463;18;First
07/01/2024 20:57:43;1704657463;19;First
07/01/2024 20:57:44;1704657464;20;Second
07/01/2024 20:57:44;1704657464;29;First
07/01/2024 20:57:45;1704657465;36;Second
07/01/2024 20:57:45;1704657465;37;First
07/01/2024 20:57:45;1704657465;37;Second
07/01/2024 20:57:47;1704657467;20;First
07/01/2024 20:57:47;1704657467;20;Second
07/01/2024 20:57:47;1704657467;21;Second
07/01/2024 20:57:47;1704657467;22;First
07/01/2024 20:57:47;1704657467;27;Second
07/01/2024 20:57:47;1704657467;27;First
07/01/2024 20:57:47;1704657467;28;Second
07/01/2024 20:57:47;1704657467;29;First
07/01/2024 20:57:49;1704657469;17;First
07/01/2024 20:57:49;1704657469;18;Second
07/01/2024 20:57:49;1704657469;21;Second
07/01/2024 20:57:49;1704657469;24;First
07/01/2024 20:57:49;1704657469;24;Second
07/01/2024 20:57:49;1704657469;26;Second
07/01/2024 20:57:49;1704657469;26;First
07/01/2024 20:57:49;1704657469;28;First
07/01/2024 20:57:51;1704657471;15;First
07/01/2024 20:57:51;1704657471;18;First
07/01/2024 20:57:51;1704657471;18;Second
07/01/2024 20:57:51;1704657471;19;First
07/01/2024 20:57:51;1704657471;20;Second
07/01/2024 20:57:51;1704657471;21;First
07/01/2024 20:57:51;1704657471;22;Second
07/01/2024 20:57:51;1704657471;23;Second
07/01/2024 20:57:52;1704657472;17;First
07/01/2024 20:57:52;1704657472;17;Second
07/01/2024 20:57:53;1704657473;18;Second
07/01/2024 20:57:53;1704657473;19;First
07/01/2024 20:57:53;1704657473;19;Second
07/01/2024 20:57:53;1704657473;20;First
07/01/2024 20:57:53;1704657473;22;First
07/01/2024 20:57:53;1704657473;22;Second
07/01/2024 20:57:54;1704657474;16;Second
07/01/2024 20:57:55;1704657475;19;Second
07/01/2024 20:57:55;1704657475;20;First
07/01/2024 20:57:55;1704657475;21;Second
07/01/2024 20:57:55;1704657475;21;First
07/01/2024 20:57:55;1704657475;23;First
07/01/2024 20:57:55;1704657475;24;First
07/01/2024 20:57:59;1704657479;250;Second
07/01/2024 20:58:01;1704657481;16;Second
07/01/2024 20:58:01;1704657481;17;Second
07/01/2024 20:58:01;1704657481;19;First
07/01/2024 20:58:01;1704657481;19;Second
07/01/2024 20:58:01;1704657481;21;First
07/01/2024 20:58:01;1704657481;21;First
07/01/2024 20:58:01;1704657481;22;Second
07/01/2024 20:58:01;1704657481;22;First
07/01/2024 20:58:03;1704657483;17;First
07/01/2024 20:58:03;1704657483;17;Second
07/01/2024 20:58:03;1704657483;19;Second
07/01/2024 20:58:03;1704657483;21;Second
07/01/2024 20:58:03;1704657483;24;First
07/01/2024 20:58:03;1704657483;25;First
07/01/2024 20:58:08;1704657488;195;Second
07/01/2024 20:58:09;1704657489;300;First
07/01/2024 20:58:11;1704657491;16;First
07/01/2024 20:58:11;1704657491;18;Second
07/01/2024 20:58:11;1704657491;19;First
07/01/2024 20:58:11;1704657491;19;Second
07/01/2024 20:58:11;1704657491;20;First
07/01/2024 20:58:11;1704657491;22;Second
07/01/2024 20:58:11;1704657491;23;First
07/01/2024 20:58:11;1704657491;23;Second
07/01/2024 20:58:13;1704657493;16;First
07/01/2024 20:58:13;1704657493;20;Second
07/01/2024 20:58:13;1704657493;20;First
07/01/2024 20:58:13;1704657493;21;First
07/01/2024 20:58:13;1704657493;22;Second
07/01/2024 20:58:13;1704657493;24;Second
07/01/2024 20:58:14;1704657494;37;Second
07/01/2024 20:58:14;1704657494;38;First
