07/01/2024 21:42:13;1704660133;0;First
07/01/2024 21:42:13;1704660133;33;First
07/01/2024 21:42:14;1704660134;37;First
07/01/2024 21:42:14;1704660134;38;First
07/01/2024 21:42:15;1704660135;41;First
07/01/2024 21:42:16;1704660136;40;First
07/01/2024 21:42:16;1704660136;38;First
07/01/2024 21:42:17;1704660137;38;First
07/01/2024 21:42:17;1704660137;37;First
07/01/2024 21:42:18;1704660138;38;First
07/01/2024 21:42:18;1704660138;37;First
07/01/2024 21:42:19;1704660139;40;First
07/01/2024 21:42:20;1704660140;38;First
07/01/2024 21:42:20;1704660140;40;First
07/01/2024 21:42:21;1704660141;38;First
07/01/2024 21:42:21;1704660141;37;First
07/01/2024 21:42:22;1704660142;37;First
07/01/2024 21:42:23;1704660143;36;First
07/01/2024 21:42:23;1704660143;42;First
07/01/2024 21:42:24;1704660144;38;First
07/01/2024 21:42:24;1704660144;41;First
07/01/2024 21:42:25;1704660145;41;First
07/01/2024 21:42:25;1704660145;33;First
07/01/2024 21:42:26;1704660146;39;First
07/01/2024 21:42:27;1704660147;39;First
07/01/2024 21:42:27;1704660147;36;First
07/01/2024 21:42:28;1704660148;39;First
07/01/2024 21:42:28;1704660148;37;First
07/01/2024 21:42:29;1704660149;37;First
07/01/2024 21:42:29;1704660149;36;First
07/01/2024 21:42:30;1704660150;36;First
07/01/2024 21:42:31;1704660151;37;First
07/01/2024 21:42:31;1704660151;40;First
07/01/2024 21:42:32;1704660152;37;First
07/01/2024 21:42:32;1704660152;39;First
07/01/2024 21:42:33;1704660153;38;First
07/01/2024 21:42:33;1704660153;40;First
07/01/2024 21:42:34;1704660154;40;First
07/01/2024 21:42:35;1704660155;36;First
07/01/2024 21:42:35;1704660155;35;First
07/01/2024 21:42:36;1704660156;39;First
07/01/2024 21:42:36;1704660156;39;First
07/01/2024 21:42:37;1704660157;39;First
07/01/2024 21:42:38;1704660158;42;First
07/01/2024 21:42:38;1704660158;38;First
07/01/2024 21:42:39;1704660159;37;First
07/01/2024 21:42:40;1704660160;39;First
07/01/2024 21:42:40;1704660160;38;First
07/01/2024 21:42:41;1704660161;39;First
07/01/2024 21:42:42;1704660162;35;First
07/01/2024 21:42:42;1704660162;41;First
07/01/2024 21:42:43;1704660163;37;First
07/01/2024 21:42:44;1704660164;41;First
07/01/2024 21:42:44;1704660164;39;First
07/01/2024 21:42:45;1704660165;42;First
07/01/2024 21:42:46;1704660166;40;First
07/01/2024 21:42:46;1704660166;37;First
07/01/2024 21:42:47;1704660167;37;First
07/01/2024 21:42:47;1704660167;35;First
07/01/2024 21:42:48;1704660168;41;First
07/01/2024 21:42:49;1704660169;39;First
07/01/2024 21:42:49;1704660169;42;First
07/01/2024 21:42:50;1704660170;32;First
07/01/2024 21:42:50;1704660170;36;First
07/01/2024 21:42:51;1704660171;38;First
07/01/2024 21:42:52;1704660172;40;First
07/01/2024 21:42:52;1704660172;41;First
07/01/2024 21:42:53;1704660173;39;First
07/01/2024 21:42:53;1704660173;40;First
07/01/2024 21:42:54;1704660174;39;First
07/01/2024 21:42:54;1704660174;37;First
07/01/2024 21:42:55;1704660175;37;First
07/01/2024 21:42:56;1704660176;39;First
07/01/2024 21:42:56;1704660176;38;First
07/01/2024 21:42:57;1704660177;35;First
07/01/2024 21:42:57;1704660177;50;First
07/01/2024 21:42:58;1704660178;40;First
07/01/2024 21:42:59;1704660179;38;First
07/01/2024 21:42:59;1704660179;41;First
07/01/2024 21:43:00;1704660180;43;First
07/01/2024 21:43:01;1704660181;41;First
07/01/2024 21:43:01;1704660181;33;First
07/01/2024 21:43:02;1704660182;38;First
07/01/2024 21:43:02;1704660182;35;First
07/01/2024 21:43:03;1704660183;39;First
07/01/2024 21:43:03;1704660183;36;First
07/01/2024 21:43:04;1704660184;36;First
07/01/2024 21:43:04;1704660184;35;First
07/01/2024 21:43:05;1704660185;40;First
07/01/2024 21:43:06;1704660186;37;First
07/01/2024 21:43:06;1704660186;40;First
07/01/2024 21:43:07;1704660187;37;First
07/01/2024 21:43:07;1704660187;37;First
07/01/2024 21:43:08;1704660188;38;First
07/01/2024 21:43:09;1704660189;39;First
07/01/2024 21:43:09;1704660189;40;First
07/01/2024 21:43:10;1704660190;37;First
07/01/2024 21:43:10;1704660190;41;First
07/01/2024 21:43:11;1704660191;36;First
07/01/2024 21:43:12;1704660192;35;First
07/01/2024 21:43:12;1704660192;38;First
