05/01/2024 22:12:15;1704489135;0;First
05/01/2024 22:12:16;1704489136;35;First
05/01/2024 22:12:16;1704489136;30;First
05/01/2024 22:12:17;1704489137;34;First
05/01/2024 22:12:17;1704489137;34;First
05/01/2024 22:12:18;1704489138;32;First
05/01/2024 22:12:18;1704489138;33;First
05/01/2024 22:12:18;1704489138;29;First
05/01/2024 22:12:19;1704489139;32;First
05/01/2024 22:12:19;1704489139;32;First
05/01/2024 22:12:20;1704489140;31;First
05/01/2024 22:12:20;1704489140;34;First
05/01/2024 22:12:21;1704489141;30;First
05/01/2024 22:12:21;1704489141;32;First
05/01/2024 22:12:22;1704489142;31;First
05/01/2024 22:12:22;1704489142;31;First
05/01/2024 22:12:23;1704489143;31;First
05/01/2024 22:12:23;1704489143;32;First
05/01/2024 22:12:24;1704489144;36;First
05/01/2024 22:12:24;1704489144;33;First
05/01/2024 22:12:25;1704489145;31;First
05/01/2024 22:12:25;1704489145;30;First
05/01/2024 22:12:25;1704489145;33;First
05/01/2024 22:12:26;1704489146;30;First
05/01/2024 22:12:26;1704489146;34;First
05/01/2024 22:12:27;1704489147;32;First
05/01/2024 22:12:27;1704489147;31;First
05/01/2024 22:12:28;1704489148;31;First
05/01/2024 22:12:28;1704489148;31;First
05/01/2024 22:12:29;1704489149;31;First
05/01/2024 22:12:29;1704489149;32;First
