{
    "Pedone": {
        "checkpoints": [
            {
                "steps": 899953,
                "file_path": "results\\CV_BASE_DEFINITIVO\\Pedone\\Pedone-899953.onnx",
                "reward": 2.451581954079516,
                "creation_time": 1702122525.4723103
            },
            {
                "steps": 999956,
                "file_path": "results\\CV_BASE_DEFINITIVO\\Pedone\\Pedone-999956.onnx",
                "reward": 3.10291685523658,
                "creation_time": 1702122677.1587794
            },
            {
                "steps": 1099962,
                "file_path": "results\\CV_BASE_DEFINITIVO\\Pedone\\Pedone-1099962.onnx",
                "reward": 4.2459431449572245,
                "creation_time": 1702122857.3415346
            },
            {
                "steps": 1199958,
                "file_path": "results\\CV_BASE_DEFINITIVO\\Pedone\\Pedone-1199958.onnx",
                "reward": 5.673224866390228,
                "creation_time": 1702123006.5304909
            },
            {
                "steps": 1299966,
                "file_path": "results\\CV_BASE_DEFINITIVO\\Pedone\\Pedone-1299966.onnx",
                "reward": 5.018437138823575,
                "creation_time": 1702123154.3382437
            },
            {
                "steps": 1399982,
                "file_path": "results\\CV_BASE_DEFINITIVO\\Pedone\\Pedone-1399982.onnx",
                "reward": 5.978942119158232,
                "creation_time": 1702123306.1836073
            },
            {
                "steps": 1499960,
                "file_path": "results\\CV_BASE_DEFINITIVO\\Pedone\\Pedone-1499960.onnx",
                "reward": -7.142574906349182,
                "creation_time": 1702123457.6069083
            },
            {
                "steps": 1599961,
                "file_path": "results\\CV_BASE_DEFINITIVO\\Pedone\\Pedone-1599961.onnx",
                "reward": 4.501546494166056,
                "creation_time": 1702123616.3131564
            },
            {
                "steps": 1699951,
                "file_path": "results\\CV_BASE_DEFINITIVO\\Pedone\\Pedone-1699951.onnx",
                "reward": null,
                "creation_time": 1702123797.348229
            },
            {
                "steps": 1751758,
                "file_path": "results\\CV_BASE_DEFINITIVO\\Pedone\\Pedone-1751758.onnx",
                "reward": null,
                "creation_time": 1702123985.3556764
            }
        ],
        "final_checkpoint": {
            "steps": 1751758,
            "file_path": "results\\CV_BASE_DEFINITIVO\\Pedone.onnx",
            "reward": null,
            "creation_time": 1702123985.3556764
        }
    },
    "metadata": {
        "stats_format_version": "0.2.0",
        "mlagents_version": "0.25.0",
        "torch_version": "1.7.1+cpu"
    }
}