07/01/2024 23:14:07;1704665647;29
07/01/2024 23:14:08;1704665648;84
07/01/2024 23:14:10;1704665650;76
07/01/2024 23:14:12;1704665652;80
07/01/2024 23:14:13;1704665653;78
07/01/2024 23:14:15;1704665655;81
07/01/2024 23:14:17;1704665657;77
07/01/2024 23:14:19;1704665659;77
07/01/2024 23:14:20;1704665660;80
07/01/2024 23:14:22;1704665662;79
07/01/2024 23:14:24;1704665664;79
07/01/2024 23:14:26;1704665666;77
07/01/2024 23:14:28;1704665668;75
07/01/2024 23:14:30;1704665670;77
07/01/2024 23:14:32;1704665672;80
07/01/2024 23:14:34;1704665674;80
07/01/2024 23:14:35;1704665675;76
07/01/2024 23:14:37;1704665677;77
07/01/2024 23:14:39;1704665679;75
07/01/2024 23:14:40;1704665680;75
07/01/2024 23:14:42;1704665682;79
07/01/2024 23:14:44;1704665684;78
07/01/2024 23:14:46;1704665686;80
07/01/2024 23:14:47;1704665687;79
07/01/2024 23:14:49;1704665689;80
07/01/2024 23:14:51;1704665691;78
07/01/2024 23:14:53;1704665693;80
07/01/2024 23:14:54;1704665694;77
07/01/2024 23:14:56;1704665696;78
07/01/2024 23:14:58;1704665698;74
07/01/2024 23:14:59;1704665699;80
07/01/2024 23:15:01;1704665701;77
07/01/2024 23:15:03;1704665703;76
07/01/2024 23:15:05;1704665705;76
07/01/2024 23:15:06;1704665706;74
07/01/2024 23:15:08;1704665708;75
07/01/2024 23:15:11;1704665711;77
07/01/2024 23:15:12;1704665712;80
07/01/2024 23:15:14;1704665714;75
07/01/2024 23:15:16;1704665716;78
07/01/2024 23:15:18;1704665718;79
07/01/2024 23:15:19;1704665719;79
07/01/2024 23:15:21;1704665721;76
07/01/2024 23:15:23;1704665723;79
07/01/2024 23:15:25;1704665725;79
07/01/2024 23:15:26;1704665726;79
07/01/2024 23:15:28;1704665728;74
07/01/2024 23:15:30;1704665730;78
07/01/2024 23:15:32;1704665732;84
07/01/2024 23:15:33;1704665733;79
07/01/2024 23:15:35;1704665735;75
07/01/2024 23:15:37;1704665737;77
07/01/2024 23:15:38;1704665738;77
07/01/2024 23:15:40;1704665740;76
07/01/2024 23:15:42;1704665742;76
07/01/2024 23:15:44;1704665744;77
07/01/2024 23:15:45;1704665745;79
07/01/2024 23:15:47;1704665747;74
07/01/2024 23:15:49;1704665749;77
07/01/2024 23:15:50;1704665750;72
07/01/2024 23:15:52;1704665752;76
07/01/2024 23:15:54;1704665754;78
07/01/2024 23:15:56;1704665756;80
07/01/2024 23:15:58;1704665758;74
07/01/2024 23:16:00;1704665760;77
07/01/2024 23:16:02;1704665762;74
07/01/2024 23:16:04;1704665764;78
07/01/2024 23:16:05;1704665765;75
07/01/2024 23:16:07;1704665767;76
07/01/2024 23:16:09;1704665769;76
07/01/2024 23:16:10;1704665770;78
07/01/2024 23:16:12;1704665772;78
07/01/2024 23:16:14;1704665774;79
07/01/2024 23:16:16;1704665776;76
07/01/2024 23:16:17;1704665777;78
07/01/2024 23:16:19;1704665779;74
07/01/2024 23:16:21;1704665781;78
07/01/2024 23:16:23;1704665783;78
07/01/2024 23:16:24;1704665784;79
07/01/2024 23:16:26;1704665786;73
07/01/2024 23:16:28;1704665788;78
07/01/2024 23:16:29;1704665789;75
07/01/2024 23:16:31;1704665791;79
07/01/2024 23:16:33;1704665793;80
07/01/2024 23:16:34;1704665794;79
07/01/2024 23:16:36;1704665796;78
07/01/2024 23:16:38;1704665798;77
07/01/2024 23:16:40;1704665800;76
07/01/2024 23:16:41;1704665801;78
07/01/2024 23:16:44;1704665804;77
07/01/2024 23:16:46;1704665806;82
07/01/2024 23:16:47;1704665807;80
07/01/2024 23:16:49;1704665809;77
07/01/2024 23:16:51;1704665811;76
07/01/2024 23:16:52;1704665812;77
07/01/2024 23:16:54;1704665814;75
07/01/2024 23:16:56;1704665816;80
07/01/2024 23:16:58;1704665818;78
07/01/2024 23:16:59;1704665819;79
07/01/2024 23:17:01;1704665821;77
