07/01/2024 20:26:14;1704655574;20
07/01/2024 20:26:15;1704655575;14
07/01/2024 20:26:15;1704655575;13
07/01/2024 20:26:15;1704655575;16
07/01/2024 20:26:15;1704655575;14
07/01/2024 20:26:15;1704655575;13
07/01/2024 20:26:16;1704655576;15
07/01/2024 20:26:16;1704655576;13
07/01/2024 20:26:16;1704655576;15
07/01/2024 20:26:16;1704655576;14
07/01/2024 20:26:17;1704655577;14
07/01/2024 20:26:17;1704655577;15
07/01/2024 20:26:17;1704655577;14
07/01/2024 20:26:17;1704655577;13
07/01/2024 20:26:18;1704655578;16
07/01/2024 20:26:18;1704655578;15
07/01/2024 20:26:18;1704655578;17
07/01/2024 20:26:18;1704655578;14
07/01/2024 20:26:18;1704655578;14
07/01/2024 20:26:19;1704655579;14
07/01/2024 20:26:19;1704655579;14
07/01/2024 20:26:19;1704655579;15
07/01/2024 20:26:19;1704655579;16
07/01/2024 20:26:20;1704655580;15
07/01/2024 20:26:20;1704655580;15
07/01/2024 20:26:20;1704655580;13
07/01/2024 20:26:20;1704655580;14
07/01/2024 20:26:20;1704655580;14
07/01/2024 20:26:21;1704655581;13
07/01/2024 20:26:21;1704655581;16
07/01/2024 20:26:21;1704655581;15
07/01/2024 20:26:21;1704655581;14
07/01/2024 20:26:21;1704655581;13
07/01/2024 20:26:22;1704655582;15
07/01/2024 20:26:22;1704655582;15
07/01/2024 20:26:22;1704655582;13
07/01/2024 20:26:22;1704655582;16
07/01/2024 20:26:23;1704655583;13
07/01/2024 20:26:23;1704655583;14
07/01/2024 20:26:23;1704655583;15
07/01/2024 20:26:23;1704655583;14
07/01/2024 20:26:23;1704655583;13
07/01/2024 20:26:24;1704655584;14
07/01/2024 20:26:24;1704655584;15
07/01/2024 20:26:24;1704655584;14
07/01/2024 20:26:24;1704655584;14
07/01/2024 20:26:24;1704655584;14
07/01/2024 20:26:25;1704655585;13
07/01/2024 20:26:25;1704655585;14
07/01/2024 20:26:25;1704655585;16
07/01/2024 20:26:25;1704655585;15
07/01/2024 20:26:25;1704655585;15
07/01/2024 20:26:26;1704655586;13
07/01/2024 20:26:26;1704655586;14
07/01/2024 20:26:26;1704655586;14
07/01/2024 20:26:26;1704655586;14
07/01/2024 20:26:26;1704655586;16
07/01/2024 20:26:27;1704655587;14
07/01/2024 20:26:27;1704655587;15
07/01/2024 20:26:27;1704655587;14
07/01/2024 20:26:27;1704655587;15
07/01/2024 20:26:28;1704655588;15
07/01/2024 20:26:28;1704655588;15
07/01/2024 20:26:28;1704655588;15
07/01/2024 20:26:28;1704655588;17
07/01/2024 20:26:28;1704655588;14
07/01/2024 20:26:29;1704655589;14
07/01/2024 20:26:29;1704655589;14
07/01/2024 20:26:29;1704655589;13
07/01/2024 20:26:29;1704655589;15
07/01/2024 20:26:29;1704655589;14
07/01/2024 20:26:30;1704655590;14
07/01/2024 20:26:30;1704655590;14
07/01/2024 20:26:30;1704655590;14
07/01/2024 20:26:30;1704655590;14
07/01/2024 20:26:31;1704655591;14
07/01/2024 20:26:31;1704655591;13
07/01/2024 20:26:31;1704655591;14
07/01/2024 20:26:31;1704655591;15
07/01/2024 20:26:31;1704655591;13
07/01/2024 20:26:32;1704655592;15
07/01/2024 20:26:32;1704655592;14
07/01/2024 20:26:32;1704655592;14
07/01/2024 20:26:32;1704655592;14
07/01/2024 20:26:32;1704655592;13
07/01/2024 20:26:33;1704655593;14
07/01/2024 20:26:33;1704655593;15
07/01/2024 20:26:33;1704655593;13
07/01/2024 20:26:33;1704655593;12
07/01/2024 20:26:33;1704655593;14
07/01/2024 20:26:34;1704655594;13
07/01/2024 20:26:34;1704655594;14
07/01/2024 20:26:34;1704655594;16
07/01/2024 20:26:34;1704655594;15
07/01/2024 20:26:34;1704655594;15
07/01/2024 20:26:35;1704655595;15
07/01/2024 20:26:35;1704655595;14
07/01/2024 20:26:35;1704655595;14
07/01/2024 20:26:35;1704655595;14
07/01/2024 20:26:36;1704655596;14
