05/01/2024 22:24:33;1704489873;0;First
05/01/2024 22:24:33;1704489873;0;Second
05/01/2024 22:24:33;1704489873;0;Second
05/01/2024 22:24:33;1704489873;0;First
05/01/2024 22:24:33;1704489873;0;First
05/01/2024 22:24:33;1704489873;0;Second
05/01/2024 22:24:34;1704489874;13;Second
05/01/2024 22:24:34;1704489874;14;First
05/01/2024 22:24:34;1704489874;14;First
05/01/2024 22:24:34;1704489874;14;Second
05/01/2024 22:24:34;1704489874;15;Second
05/01/2024 22:24:34;1704489874;20;First
05/01/2024 22:24:34;1704489874;9;Second
05/01/2024 22:24:34;1704489874;10;First
05/01/2024 22:24:34;1704489874;11;Second
05/01/2024 22:24:34;1704489874;14;Second
05/01/2024 22:24:35;1704489875;15;First
05/01/2024 22:24:35;1704489875;17;First
05/01/2024 22:24:35;1704489875;10;Second
05/01/2024 22:24:35;1704489875;12;First
05/01/2024 22:24:35;1704489875;13;Second
05/01/2024 22:24:35;1704489875;14;First
05/01/2024 22:24:35;1704489875;14;Second
05/01/2024 22:24:35;1704489875;15;First
05/01/2024 22:24:36;1704489876;12;Second
05/01/2024 22:24:36;1704489876;13;Second
05/01/2024 22:24:36;1704489876;14;First
05/01/2024 22:24:36;1704489876;15;Second
05/01/2024 22:24:36;1704489876;15;First
05/01/2024 22:24:36;1704489876;15;First
05/01/2024 22:24:36;1704489876;11;Second
05/01/2024 22:24:37;1704489877;12;First
05/01/2024 22:24:37;1704489877;12;Second
05/01/2024 22:24:37;1704489877;13;First
05/01/2024 22:24:37;1704489877;13;First
05/01/2024 22:24:37;1704489877;14;Second
05/01/2024 22:24:37;1704489877;11;Second
05/01/2024 22:24:37;1704489877;11;Second
05/01/2024 22:24:37;1704489877;11;First
05/01/2024 22:24:37;1704489877;12;First
05/01/2024 22:24:37;1704489877;12;First
05/01/2024 22:24:37;1704489877;13;Second
05/01/2024 22:24:38;1704489878;10;First
05/01/2024 22:24:38;1704489878;12;Second
05/01/2024 22:24:38;1704489878;12;First
05/01/2024 22:24:38;1704489878;12;Second
05/01/2024 22:24:38;1704489878;13;Second
05/01/2024 22:24:38;1704489878;14;First
05/01/2024 22:24:38;1704489878;11;Second
05/01/2024 22:24:38;1704489878;11;Second
05/01/2024 22:24:38;1704489878;12;First
05/01/2024 22:24:38;1704489878;12;First
05/01/2024 22:24:38;1704489878;17;Second
05/01/2024 22:24:38;1704489878;17;First
05/01/2024 22:24:39;1704489879;10;First
05/01/2024 22:24:39;1704489879;11;Second
05/01/2024 22:24:39;1704489879;13;First
05/01/2024 22:24:39;1704489879;13;Second
05/01/2024 22:24:39;1704489879;14;First
05/01/2024 22:24:39;1704489879;14;Second
05/01/2024 22:24:40;1704489880;12;Second
05/01/2024 22:24:40;1704489880;13;First
05/01/2024 22:24:40;1704489880;14;Second
05/01/2024 22:24:40;1704489880;15;First
05/01/2024 22:24:40;1704489880;17;Second
05/01/2024 22:24:40;1704489880;18;First
05/01/2024 22:24:40;1704489880;11;First
05/01/2024 22:24:40;1704489880;11;Second
05/01/2024 22:24:40;1704489880;12;First
05/01/2024 22:24:40;1704489880;13;Second
05/01/2024 22:24:40;1704489880;14;First
05/01/2024 22:24:40;1704489880;14;Second
05/01/2024 22:24:41;1704489881;10;Second
05/01/2024 22:24:41;1704489881;10;First
05/01/2024 22:24:41;1704489881;13;Second
05/01/2024 22:24:41;1704489881;13;First
05/01/2024 22:24:41;1704489881;14;First
05/01/2024 22:24:41;1704489881;15;Second
05/01/2024 22:24:41;1704489881;10;First
05/01/2024 22:24:41;1704489881;10;Second
05/01/2024 22:24:41;1704489881;12;First
05/01/2024 22:24:41;1704489881;13;Second
05/01/2024 22:24:42;1704489882;15;Second
05/01/2024 22:24:42;1704489882;16;First
05/01/2024 22:24:42;1704489882;10;First
05/01/2024 22:24:42;1704489882;10;Second
05/01/2024 22:24:42;1704489882;10;Second
05/01/2024 22:24:42;1704489882;14;First
05/01/2024 22:24:42;1704489882;16;Second
05/01/2024 22:24:42;1704489882;16;First
05/01/2024 22:24:43;1704489883;10;First
05/01/2024 22:24:43;1704489883;11;Second
05/01/2024 22:24:43;1704489883;11;Second
05/01/2024 22:24:43;1704489883;12;First
05/01/2024 22:24:43;1704489883;12;Second
05/01/2024 22:24:43;1704489883;12;First
05/01/2024 22:24:44;1704489884;12;First
05/01/2024 22:24:44;1704489884;12;Second
05/01/2024 22:24:44;1704489884;18;First
05/01/2024 22:24:44;1704489884;18;Second
05/01/2024 22:24:44;1704489884;19;Second
05/01/2024 22:24:44;1704489884;19;First
05/01/2024 22:24:44;1704489884;10;Second
05/01/2024 22:24:44;1704489884;10;First
05/01/2024 22:24:44;1704489884;11;First
05/01/2024 22:24:44;1704489884;12;Second
05/01/2024 22:24:44;1704489884;13;Second
05/01/2024 22:24:44;1704489884;15;First
05/01/2024 22:24:45;1704489885;10;First
05/01/2024 22:24:45;1704489885;10;Second
05/01/2024 22:24:45;1704489885;11;Second
05/01/2024 22:24:45;1704489885;12;First
05/01/2024 22:24:45;1704489885;14;Second
05/01/2024 22:24:45;1704489885;15;First
05/01/2024 22:24:45;1704489885;10;Second
05/01/2024 22:24:45;1704489885;10;First
05/01/2024 22:24:45;1704489885;11;First
05/01/2024 22:24:45;1704489885;13;Second
05/01/2024 22:24:45;1704489885;14;First
05/01/2024 22:24:45;1704489885;15;Second
05/01/2024 22:24:46;1704489886;10;First
05/01/2024 22:24:46;1704489886;12;First
05/01/2024 22:24:46;1704489886;14;Second
05/01/2024 22:24:46;1704489886;14;Second
05/01/2024 22:24:46;1704489886;15;Second
05/01/2024 22:24:46;1704489886;17;First
05/01/2024 22:24:47;1704489887;9;First
05/01/2024 22:24:47;1704489887;12;Second
05/01/2024 22:24:47;1704489887;13;Second
05/01/2024 22:24:47;1704489887;13;First
05/01/2024 22:24:47;1704489887;13;Second
05/01/2024 22:24:47;1704489887;16;First
05/01/2024 22:24:47;1704489887;10;First
05/01/2024 22:24:47;1704489887;10;Second
05/01/2024 22:24:47;1704489887;11;Second
05/01/2024 22:24:47;1704489887;12;First
05/01/2024 22:24:47;1704489887;12;Second
05/01/2024 22:24:47;1704489887;13;First
05/01/2024 22:24:48;1704489888;10;Second
05/01/2024 22:24:48;1704489888;11;First
05/01/2024 22:24:48;1704489888;12;First
05/01/2024 22:24:48;1704489888;13;Second
05/01/2024 22:24:48;1704489888;13;Second
05/01/2024 22:24:48;1704489888;15;First
05/01/2024 22:24:48;1704489888;11;First
05/01/2024 22:24:48;1704489888;11;Second
05/01/2024 22:24:48;1704489888;13;First
05/01/2024 22:24:48;1704489888;13;Second
05/01/2024 22:24:48;1704489888;15;Second
05/01/2024 22:24:49;1704489889;20;First
05/01/2024 22:24:49;1704489889;11;Second
05/01/2024 22:24:49;1704489889;11;First
05/01/2024 22:24:49;1704489889;11;Second
05/01/2024 22:24:49;1704489889;12;Second
05/01/2024 22:24:49;1704489889;13;First
05/01/2024 22:24:49;1704489889;15;First
05/01/2024 22:24:49;1704489889;10;Second
05/01/2024 22:24:49;1704489889;10;First
05/01/2024 22:24:49;1704489889;11;Second
05/01/2024 22:24:49;1704489889;12;Second
05/01/2024 22:24:49;1704489889;12;First
05/01/2024 22:24:50;1704489890;18;First
05/01/2024 22:24:50;1704489890;11;First
05/01/2024 22:24:50;1704489890;11;Second
05/01/2024 22:24:50;1704489890;12;Second
05/01/2024 22:24:50;1704489890;12;First
05/01/2024 22:24:50;1704489890;13;Second
05/01/2024 22:24:50;1704489890;18;First
05/01/2024 22:24:51;1704489891;10;Second
05/01/2024 22:24:51;1704489891;10;First
05/01/2024 22:24:51;1704489891;12;First
05/01/2024 22:24:51;1704489891;13;Second
05/01/2024 22:24:51;1704489891;16;Second
05/01/2024 22:24:51;1704489891;18;First
05/01/2024 22:24:51;1704489891;10;Second
05/01/2024 22:24:51;1704489891;11;First
05/01/2024 22:24:51;1704489891;12;Second
05/01/2024 22:24:51;1704489891;12;First
05/01/2024 22:24:51;1704489891;12;Second
05/01/2024 22:24:51;1704489891;19;First
05/01/2024 22:24:52;1704489892;10;First
05/01/2024 22:24:52;1704489892;11;Second
05/01/2024 22:24:52;1704489892;11;Second
05/01/2024 22:24:52;1704489892;12;First
05/01/2024 22:24:52;1704489892;12;Second
05/01/2024 22:24:52;1704489892;14;First
