07/01/2024 19:08:11;1704650891;7192;1;7,989199
07/01/2024 19:08:17;1704650897;7492;3;-183,2982
07/01/2024 19:08:19;1704650899;7578;3;4,307934
07/01/2024 19:08:20;1704650900;7659;3;5,642103
07/01/2024 19:08:22;1704650902;7739;3;4,292704
07/01/2024 19:08:24;1704650904;7818;3;4,798302
07/01/2024 19:08:26;1704650906;7898;3;5,972533
07/01/2024 19:08:31;1704650911;8197;3;-176,7347
07/01/2024 19:08:33;1704650913;8279;3;4,445835
07/01/2024 19:08:35;1704650915;8362;3;8,640365
07/01/2024 19:08:36;1704650916;8444;3;4,755933
07/01/2024 19:08:38;1704650918;8521;3;7,472971
07/01/2024 19:08:40;1704650920;8606;3;-0,3884653
07/01/2024 19:08:41;1704650921;8681;3;7,142334
07/01/2024 19:08:43;1704650923;8761;3;4,459167
07/01/2024 19:08:45;1704650925;8846;3;5,775105
07/01/2024 19:08:47;1704650927;8929;3;6,974302
07/01/2024 19:08:48;1704650928;9005;3;9,975966
07/01/2024 19:08:50;1704650930;9087;3;3,287504
07/01/2024 19:08:52;1704650932;9173;3;4,95797
07/01/2024 19:08:54;1704650934;9253;3;2,788837
07/01/2024 19:08:56;1704650936;9333;3;5,474841
07/01/2024 19:08:58;1704650938;9420;3;0,6241975
07/01/2024 19:09:00;1704650940;9502;3;3,289567
07/01/2024 19:09:02;1704650942;9584;3;0,1348298
07/01/2024 19:09:03;1704650943;9663;3;5,778968
07/01/2024 19:09:05;1704650945;9743;3;7,64183
07/01/2024 19:09:07;1704650947;9824;3;5,800508
07/01/2024 19:09:09;1704650949;9905;3;1,777366
07/01/2024 19:09:10;1704650950;9986;3;5,802103
07/01/2024 19:09:12;1704650952;10070;3;1,796061
07/01/2024 19:09:14;1704650954;10152;3;2,797633
07/01/2024 19:09:16;1704650956;10231;3;7,138204
07/01/2024 19:09:17;1704650957;10309;3;6,447304
07/01/2024 19:09:19;1704650959;10388;3;5,781936
07/01/2024 19:09:21;1704650961;10473;3;2,788895
07/01/2024 19:09:23;1704650963;10556;3;5,308331
07/01/2024 19:09:25;1704650965;10642;3;5,973135
07/01/2024 19:09:26;1704650966;10725;3;-2,045455
07/01/2024 19:09:28;1704650968;10810;3;-3,894604
07/01/2024 19:09:30;1704650970;10890;3;6,789837
07/01/2024 19:09:32;1704650972;10969;3;8,975167
07/01/2024 19:09:33;1704650973;11048;3;4,641902
07/01/2024 19:09:35;1704650975;11137;3;-8,239196
07/01/2024 19:09:37;1704650977;11218;3;1,465669
07/01/2024 19:09:39;1704650979;11298;3;2,292071
07/01/2024 19:09:41;1704650981;11379;3;6,141936
07/01/2024 19:09:42;1704650982;11457;3;7,473736
07/01/2024 19:09:44;1704650984;11539;3;5,470534
07/01/2024 19:09:46;1704650986;11624;3;0,2786673
07/01/2024 19:09:48;1704650988;11707;3;6,794503
07/01/2024 19:09:50;1704650990;11786;3;5,467634
07/01/2024 19:09:51;1704650991;11870;3;3,118133
07/01/2024 19:09:54;1704650994;11955;3;0,2627324
07/01/2024 19:09:55;1704650995;12040;3;6,140266
07/01/2024 19:09:57;1704650997;12125;3;3,131264
07/01/2024 19:09:59;1704650999;12206;3;6,808002
07/01/2024 19:10:01;1704651001;12286;3;5,292704
07/01/2024 19:10:02;1704651002;12369;3;2,308233
07/01/2024 19:10:04;1704651004;12457;3;-0,368329
07/01/2024 19:10:06;1704651006;12539;3;4,971933
07/01/2024 19:10:08;1704651008;12624;3;0,7943668
07/01/2024 19:10:10;1704651010;12706;3;9,141534
07/01/2024 19:10:11;1704651011;12790;3;2,299066
07/01/2024 19:10:13;1704651013;12867;3;2,443167
07/01/2024 19:10:15;1704651015;12943;3;8,30927
07/01/2024 19:10:17;1704651017;13019;3;3,642438
07/01/2024 19:10:22;1704651022;13318;3;-187,8966
07/01/2024 19:10:24;1704651024;13396;3;8,23943
07/01/2024 19:10:26;1704651026;13477;3;8,641734
07/01/2024 19:10:27;1704651027;13559;3;6,618738
07/01/2024 19:10:29;1704651029;13642;3;5,634036
07/01/2024 19:10:31;1704651031;13723;3;5,962135
07/01/2024 19:10:32;1704651032;13797;3;8,140232
07/01/2024 19:10:34;1704651034;13872;3;8,809333
07/01/2024 19:10:36;1704651036;13948;3;4,962434
07/01/2024 19:10:37;1704651037;14028;3;8,142367
07/01/2024 19:10:39;1704651039;14118;3;-4,219673
07/01/2024 19:10:41;1704651041;14203;3;2,952163
07/01/2024 19:10:43;1704651043;14279;3;7,628771
07/01/2024 19:10:45;1704651045;14358;3;6,279736
07/01/2024 19:10:47;1704651047;14442;3;3,286231
07/01/2024 19:10:48;1704651048;14521;3;0,8042014
07/01/2024 19:10:50;1704651050;14604;3;-0,04219977
07/01/2024 19:10:52;1704651052;14684;3;1,460832
07/01/2024 19:10:54;1704651054;14759;3;5,307065
07/01/2024 19:10:55;1704651055;14835;3;7,807436
07/01/2024 19:10:57;1704651057;14912;3;0,7924315
07/01/2024 19:10:59;1704651059;14992;3;5,139738
07/01/2024 19:11:01;1704651061;15072;3;0,7980325
07/01/2024 19:11:02;1704651062;15157;3;6,473868
07/01/2024 19:11:04;1704651064;15239;3;4,97473
07/01/2024 19:11:06;1704651066;15317;3;8,474233
07/01/2024 19:11:08;1704651068;15416;3;-4,213017
07/01/2024 19:11:09;1704651069;15495;3;5,142004
07/01/2024 19:11:11;1704651071;15581;3;2,792026
07/01/2024 19:11:13;1704651073;15659;3;3,446632
07/01/2024 19:11:15;1704651075;15740;3;7,464736
07/01/2024 19:11:17;1704651077;15827;3;1,442831
07/01/2024 19:11:22;1704651082;16126;3;-162,7155
