07/01/2024 21:57:48;1704661068;0;First
07/01/2024 21:57:48;1704661068;0;Second
07/01/2024 21:57:48;1704661068;0;Second
07/01/2024 21:57:48;1704661068;0;First
07/01/2024 21:57:48;1704661068;0;First
07/01/2024 21:57:48;1704661068;0;Second
07/01/2024 21:57:48;1704661068;11;First
07/01/2024 21:57:49;1704661069;14;Second
07/01/2024 21:57:49;1704661069;14;First
07/01/2024 21:57:49;1704661069;15;Second
07/01/2024 21:57:49;1704661069;17;First
07/01/2024 21:57:49;1704661069;17;Second
07/01/2024 21:57:49;1704661069;12;First
07/01/2024 21:57:49;1704661069;12;Second
07/01/2024 21:57:49;1704661069;13;First
07/01/2024 21:57:49;1704661069;17;First
07/01/2024 21:57:49;1704661069;18;Second
07/01/2024 21:57:49;1704661069;20;Second
07/01/2024 21:57:50;1704661070;11;First
07/01/2024 21:57:50;1704661070;12;Second
07/01/2024 21:57:50;1704661070;14;First
07/01/2024 21:57:50;1704661070;15;First
07/01/2024 21:57:50;1704661070;18;Second
07/01/2024 21:57:50;1704661070;21;Second
07/01/2024 21:57:51;1704661071;12;Second
07/01/2024 21:57:51;1704661071;12;First
07/01/2024 21:57:51;1704661071;13;Second
07/01/2024 21:57:51;1704661071;13;First
07/01/2024 21:57:51;1704661071;17;Second
07/01/2024 21:57:51;1704661071;19;First
07/01/2024 21:57:51;1704661071;10;First
07/01/2024 21:57:51;1704661071;11;Second
07/01/2024 21:57:52;1704661072;14;First
07/01/2024 21:57:52;1704661072;14;First
07/01/2024 21:57:52;1704661072;16;Second
07/01/2024 21:57:52;1704661072;20;Second
07/01/2024 21:57:52;1704661072;10;First
07/01/2024 21:57:52;1704661072;13;Second
07/01/2024 21:57:52;1704661072;14;First
07/01/2024 21:57:52;1704661072;15;Second
07/01/2024 21:57:52;1704661072;17;Second
07/01/2024 21:57:52;1704661072;18;First
07/01/2024 21:57:53;1704661073;11;First
07/01/2024 21:57:53;1704661073;13;Second
07/01/2024 21:57:53;1704661073;13;First
07/01/2024 21:57:53;1704661073;15;Second
07/01/2024 21:57:53;1704661073;19;Second
07/01/2024 21:57:53;1704661073;19;First
07/01/2024 21:57:53;1704661073;10;First
07/01/2024 21:57:53;1704661073;11;Second
07/01/2024 21:57:53;1704661073;13;First
07/01/2024 21:57:53;1704661073;14;Second
07/01/2024 21:57:53;1704661073;17;Second
07/01/2024 21:57:53;1704661073;18;First
07/01/2024 21:57:54;1704661074;9;First
07/01/2024 21:57:54;1704661074;11;Second
07/01/2024 21:57:54;1704661074;13;First
07/01/2024 21:57:54;1704661074;14;Second
07/01/2024 21:57:54;1704661074;14;Second
07/01/2024 21:57:54;1704661074;16;First
07/01/2024 21:57:54;1704661074;11;First
07/01/2024 21:57:54;1704661074;12;Second
07/01/2024 21:57:55;1704661075;14;First
07/01/2024 21:57:55;1704661075;15;First
07/01/2024 21:57:55;1704661075;17;Second
07/01/2024 21:57:55;1704661075;20;Second
07/01/2024 21:57:55;1704661075;10;First
07/01/2024 21:57:55;1704661075;11;Second
07/01/2024 21:57:55;1704661075;13;First
07/01/2024 21:57:55;1704661075;14;Second
07/01/2024 21:57:55;1704661075;17;Second
07/01/2024 21:57:55;1704661075;20;First
07/01/2024 21:57:56;1704661076;11;First
07/01/2024 21:57:56;1704661076;11;Second
07/01/2024 21:57:56;1704661076;13;First
07/01/2024 21:57:56;1704661076;17;First
07/01/2024 21:57:56;1704661076;18;Second
07/01/2024 21:57:56;1704661076;19;Second
07/01/2024 21:57:56;1704661076;11;Second
07/01/2024 21:57:56;1704661076;11;First
07/01/2024 21:57:56;1704661076;13;Second
07/01/2024 21:57:56;1704661076;14;Second
07/01/2024 21:57:56;1704661076;14;First
07/01/2024 21:57:56;1704661076;15;First
07/01/2024 21:57:57;1704661077;11;First
07/01/2024 21:57:57;1704661077;14;Second
07/01/2024 21:57:57;1704661077;14;Second
07/01/2024 21:57:57;1704661077;15;First
07/01/2024 21:57:57;1704661077;16;First
07/01/2024 21:57:57;1704661077;19;Second
07/01/2024 21:57:57;1704661077;10;First
07/01/2024 21:57:57;1704661077;10;Second
07/01/2024 21:57:57;1704661077;11;Second
07/01/2024 21:57:57;1704661077;14;First
07/01/2024 21:57:57;1704661077;15;Second
07/01/2024 21:57:57;1704661077;19;First
07/01/2024 21:57:58;1704661078;11;First
07/01/2024 21:57:58;1704661078;13;Second
07/01/2024 21:57:58;1704661078;14;Second
07/01/2024 21:57:58;1704661078;17;First
07/01/2024 21:57:58;1704661078;18;First
07/01/2024 21:57:58;1704661078;18;Second
07/01/2024 21:57:59;1704661079;11;Second
07/01/2024 21:57:59;1704661079;12;First
07/01/2024 21:57:59;1704661079;13;First
07/01/2024 21:57:59;1704661079;14;Second
07/01/2024 21:57:59;1704661079;17;First
07/01/2024 21:57:59;1704661079;22;Second
07/01/2024 21:57:59;1704661079;10;First
07/01/2024 21:57:59;1704661079;10;Second
07/01/2024 21:57:59;1704661079;12;First
07/01/2024 21:57:59;1704661079;14;Second
07/01/2024 21:57:59;1704661079;15;First
07/01/2024 21:57:59;1704661079;17;Second
07/01/2024 21:58:00;1704661080;11;First
07/01/2024 21:58:00;1704661080;12;Second
07/01/2024 21:58:00;1704661080;13;First
07/01/2024 21:58:00;1704661080;15;Second
07/01/2024 21:58:00;1704661080;17;Second
07/01/2024 21:58:00;1704661080;20;First
07/01/2024 21:58:00;1704661080;10;First
07/01/2024 21:58:00;1704661080;11;Second
07/01/2024 21:58:00;1704661080;13;First
07/01/2024 21:58:00;1704661080;17;Second
07/01/2024 21:58:00;1704661080;17;First
07/01/2024 21:58:00;1704661080;19;Second
07/01/2024 21:58:01;1704661081;11;First
07/01/2024 21:58:01;1704661081;12;First
07/01/2024 21:58:01;1704661081;13;Second
07/01/2024 21:58:01;1704661081;15;First
07/01/2024 21:58:01;1704661081;17;Second
07/01/2024 21:58:01;1704661081;19;Second
07/01/2024 21:58:01;1704661081;10;First
07/01/2024 21:58:01;1704661081;12;Second
07/01/2024 21:58:01;1704661081;12;Second
07/01/2024 21:58:02;1704661082;13;First
07/01/2024 21:58:02;1704661082;15;First
07/01/2024 21:58:02;1704661082;20;Second
07/01/2024 21:58:02;1704661082;10;First
07/01/2024 21:58:02;1704661082;11;Second
07/01/2024 21:58:02;1704661082;13;First
07/01/2024 21:58:02;1704661082;13;Second
07/01/2024 21:58:02;1704661082;16;First
07/01/2024 21:58:02;1704661082;18;Second
07/01/2024 21:58:03;1704661083;11;First
07/01/2024 21:58:03;1704661083;11;Second
07/01/2024 21:58:03;1704661083;14;First
07/01/2024 21:58:03;1704661083;16;Second
07/01/2024 21:58:03;1704661083;17;First
07/01/2024 21:58:03;1704661083;18;Second
07/01/2024 21:58:03;1704661083;11;Second
07/01/2024 21:58:03;1704661083;11;First
07/01/2024 21:58:03;1704661083;12;Second
07/01/2024 21:58:03;1704661083;13;First
07/01/2024 21:58:03;1704661083;14;First
07/01/2024 21:58:03;1704661083;16;Second
07/01/2024 21:58:04;1704661084;11;First
07/01/2024 21:58:04;1704661084;12;Second
07/01/2024 21:58:04;1704661084;14;First
07/01/2024 21:58:04;1704661084;14;Second
07/01/2024 21:58:04;1704661084;15;First
07/01/2024 21:58:04;1704661084;20;Second
07/01/2024 21:58:04;1704661084;11;First
07/01/2024 21:58:05;1704661085;13;Second
07/01/2024 21:58:05;1704661085;14;First
07/01/2024 21:58:05;1704661085;15;Second
07/01/2024 21:58:05;1704661085;16;First
07/01/2024 21:58:05;1704661085;20;Second
07/01/2024 21:58:05;1704661085;10;Second
07/01/2024 21:58:05;1704661085;12;First
07/01/2024 21:58:05;1704661085;14;Second
07/01/2024 21:58:05;1704661085;15;First
07/01/2024 21:58:05;1704661085;16;First
07/01/2024 21:58:05;1704661085;18;Second
07/01/2024 21:58:06;1704661086;12;Second
07/01/2024 21:58:06;1704661086;12;First
07/01/2024 21:58:06;1704661086;13;First
07/01/2024 21:58:06;1704661086;15;Second
07/01/2024 21:58:06;1704661086;15;Second
07/01/2024 21:58:06;1704661086;16;First
07/01/2024 21:58:06;1704661086;10;First
07/01/2024 21:58:06;1704661086;12;Second
07/01/2024 21:58:06;1704661086;12;Second
07/01/2024 21:58:06;1704661086;15;First
07/01/2024 21:58:06;1704661086;16;First
07/01/2024 21:58:06;1704661086;17;Second
07/01/2024 21:58:07;1704661087;12;First
07/01/2024 21:58:07;1704661087;14;First
07/01/2024 21:58:07;1704661087;16;Second
07/01/2024 21:58:07;1704661087;17;First
07/01/2024 21:58:07;1704661087;18;Second
07/01/2024 21:58:07;1704661087;23;Second
07/01/2024 21:58:08;1704661088;10;First
07/01/2024 21:58:08;1704661088;11;Second
07/01/2024 21:58:08;1704661088;12;Second
07/01/2024 21:58:08;1704661088;12;First
07/01/2024 21:58:08;1704661088;15;First
07/01/2024 21:58:08;1704661088;21;Second
07/01/2024 21:58:08;1704661088;11;First
07/01/2024 21:58:08;1704661088;12;Second
07/01/2024 21:58:08;1704661088;14;First
07/01/2024 21:58:08;1704661088;14;Second
07/01/2024 21:58:08;1704661088;14;First
07/01/2024 21:58:08;1704661088;18;Second
07/01/2024 21:58:09;1704661089;9;First
07/01/2024 21:58:09;1704661089;12;Second
07/01/2024 21:58:09;1704661089;14;Second
07/01/2024 21:58:09;1704661089;14;First
07/01/2024 21:58:09;1704661089;15;First
07/01/2024 21:58:09;1704661089;17;Second
07/01/2024 21:58:09;1704661089;10;First
07/01/2024 21:58:09;1704661089;11;Second
07/01/2024 21:58:09;1704661089;12;First
07/01/2024 21:58:09;1704661089;13;Second
07/01/2024 21:58:10;1704661090;15;First
07/01/2024 21:58:10;1704661090;17;Second
07/01/2024 21:58:10;1704661090;11;Second
07/01/2024 21:58:10;1704661090;11;Second
07/01/2024 21:58:10;1704661090;13;First
07/01/2024 21:58:10;1704661090;15;First
07/01/2024 21:58:10;1704661090;19;Second
07/01/2024 21:58:10;1704661090;19;First
07/01/2024 21:58:11;1704661091;10;First
07/01/2024 21:58:11;1704661091;12;Second
07/01/2024 21:58:11;1704661091;14;First
07/01/2024 21:58:11;1704661091;14;Second
07/01/2024 21:58:11;1704661091;16;First
07/01/2024 21:58:11;1704661091;16;Second
07/01/2024 21:58:11;1704661091;10;First
07/01/2024 21:58:11;1704661091;11;Second
07/01/2024 21:58:11;1704661091;14;First
07/01/2024 21:58:11;1704661091;17;Second
07/01/2024 21:58:11;1704661091;17;First
07/01/2024 21:58:11;1704661091;19;Second
07/01/2024 21:58:12;1704661092;13;First
07/01/2024 21:58:12;1704661092;13;First
07/01/2024 21:58:12;1704661092;14;Second
07/01/2024 21:58:12;1704661092;17;Second
07/01/2024 21:58:12;1704661092;18;First
07/01/2024 21:58:12;1704661092;19;Second
07/01/2024 21:58:12;1704661092;9;First
07/01/2024 21:58:12;1704661092;11;Second
07/01/2024 21:58:12;1704661092;12;First
07/01/2024 21:58:13;1704661093;16;First
07/01/2024 21:58:13;1704661093;16;Second
07/01/2024 21:58:13;1704661093;19;Second
07/01/2024 21:58:13;1704661093;10;First
07/01/2024 21:58:13;1704661093;11;Second
07/01/2024 21:58:13;1704661093;14;First
07/01/2024 21:58:13;1704661093;18;Second
07/01/2024 21:58:13;1704661093;18;First
07/01/2024 21:58:13;1704661093;20;Second
07/01/2024 21:58:13;1704661093;9;First
07/01/2024 21:58:14;1704661094;11;Second
07/01/2024 21:58:14;1704661094;15;First
07/01/2024 21:58:14;1704661094;15;Second
07/01/2024 21:58:14;1704661094;17;First
07/01/2024 21:58:14;1704661094;18;Second
07/01/2024 21:58:14;1704661094;11;First
07/01/2024 21:58:14;1704661094;11;Second
07/01/2024 21:58:14;1704661094;12;Second
07/01/2024 21:58:14;1704661094;14;First
07/01/2024 21:58:14;1704661094;16;First
07/01/2024 21:58:14;1704661094;20;Second
07/01/2024 21:58:15;1704661095;11;First
07/01/2024 21:58:15;1704661095;11;Second
07/01/2024 21:58:15;1704661095;13;First
07/01/2024 21:58:15;1704661095;15;First
07/01/2024 21:58:15;1704661095;17;Second
07/01/2024 21:58:15;1704661095;19;Second
07/01/2024 21:58:15;1704661095;10;First
07/01/2024 21:58:15;1704661095;12;Second
07/01/2024 21:58:16;1704661096;16;Second
07/01/2024 21:58:16;1704661096;17;First
07/01/2024 21:58:16;1704661096;19;Second
07/01/2024 21:58:16;1704661096;20;First
07/01/2024 21:58:16;1704661096;9;First
07/01/2024 21:58:16;1704661096;13;Second
07/01/2024 21:58:16;1704661096;13;First
07/01/2024 21:58:16;1704661096;14;First
07/01/2024 21:58:16;1704661096;16;Second
07/01/2024 21:58:16;1704661096;20;Second
07/01/2024 21:58:17;1704661097;12;Second
07/01/2024 21:58:17;1704661097;13;First
07/01/2024 21:58:17;1704661097;14;First
07/01/2024 21:58:17;1704661097;15;Second
07/01/2024 21:58:17;1704661097;17;First
07/01/2024 21:58:17;1704661097;19;Second
07/01/2024 21:58:17;1704661097;11;Second
07/01/2024 21:58:17;1704661097;12;First
07/01/2024 21:58:17;1704661097;13;First
07/01/2024 21:58:17;1704661097;14;Second
07/01/2024 21:58:17;1704661097;16;Second
07/01/2024 21:58:17;1704661097;18;First
07/01/2024 21:58:18;1704661098;10;First
07/01/2024 21:58:18;1704661098;11;Second
07/01/2024 21:58:18;1704661098;13;Second
07/01/2024 21:58:18;1704661098;14;First
07/01/2024 21:58:18;1704661098;17;First
07/01/2024 21:58:18;1704661098;20;Second
07/01/2024 21:58:18;1704661098;11;First
07/01/2024 21:58:18;1704661098;13;Second
07/01/2024 21:58:18;1704661098;14;Second
07/01/2024 21:58:18;1704661098;15;First
07/01/2024 21:58:19;1704661099;17;First
07/01/2024 21:58:19;1704661099;18;Second
07/01/2024 21:58:19;1704661099;11;First
07/01/2024 21:58:19;1704661099;11;Second
07/01/2024 21:58:19;1704661099;13;First
07/01/2024 21:58:19;1704661099;15;Second
07/01/2024 21:58:19;1704661099;16;Second
07/01/2024 21:58:19;1704661099;18;First
07/01/2024 21:58:19;1704661099;10;First
07/01/2024 21:58:20;1704661100;13;Second
07/01/2024 21:58:20;1704661100;14;First
07/01/2024 21:58:20;1704661100;14;Second
07/01/2024 21:58:20;1704661100;17;First
07/01/2024 21:58:20;1704661100;20;Second
07/01/2024 21:58:20;1704661100;11;First
07/01/2024 21:58:20;1704661100;14;Second
07/01/2024 21:58:20;1704661100;17;First
07/01/2024 21:58:20;1704661100;17;Second
07/01/2024 21:58:20;1704661100;19;First
07/01/2024 21:58:20;1704661100;20;Second
07/01/2024 21:58:21;1704661101;11;First
07/01/2024 21:58:21;1704661101;12;Second
07/01/2024 21:58:21;1704661101;13;Second
07/01/2024 21:58:21;1704661101;15;First
07/01/2024 21:58:21;1704661101;17;Second
07/01/2024 21:58:21;1704661101;20;First
07/01/2024 21:58:22;1704661102;10;First
07/01/2024 21:58:22;1704661102;13;Second
07/01/2024 21:58:22;1704661102;14;First
07/01/2024 21:58:22;1704661102;15;First
07/01/2024 21:58:22;1704661102;16;Second
07/01/2024 21:58:22;1704661102;16;Second
07/01/2024 21:58:22;1704661102;12;First
07/01/2024 21:58:23;1704661103;13;Second
07/01/2024 21:58:23;1704661103;16;First
07/01/2024 21:58:23;1704661103;17;Second
07/01/2024 21:58:23;1704661103;17;First
07/01/2024 21:58:23;1704661103;19;Second
07/01/2024 21:58:23;1704661103;12;First
07/01/2024 21:58:23;1704661103;12;Second
07/01/2024 21:58:23;1704661103;14;First
07/01/2024 21:58:23;1704661103;17;Second
07/01/2024 21:58:23;1704661103;21;Second
07/01/2024 21:58:23;1704661103;22;First
07/01/2024 21:58:24;1704661104;12;First
07/01/2024 21:58:24;1704661104;13;Second
07/01/2024 21:58:24;1704661104;14;Second
07/01/2024 21:58:24;1704661104;15;First
07/01/2024 21:58:24;1704661104;16;First
07/01/2024 21:58:24;1704661104;18;Second
07/01/2024 21:58:25;1704661105;10;First
07/01/2024 21:58:25;1704661105;11;Second
07/01/2024 21:58:25;1704661105;13;First
07/01/2024 21:58:25;1704661105;15;Second
07/01/2024 21:58:25;1704661105;16;First
07/01/2024 21:58:25;1704661105;16;Second
07/01/2024 21:58:25;1704661105;11;First
07/01/2024 21:58:25;1704661105;12;Second
07/01/2024 21:58:25;1704661105;14;First
07/01/2024 21:58:25;1704661105;17;First
07/01/2024 21:58:26;1704661106;19;Second
07/01/2024 21:58:26;1704661106;19;Second
07/01/2024 21:58:26;1704661106;11;First
07/01/2024 21:58:26;1704661106;13;Second
07/01/2024 21:58:26;1704661106;14;First
07/01/2024 21:58:26;1704661106;14;First
07/01/2024 21:58:26;1704661106;17;Second
07/01/2024 21:58:26;1704661106;21;Second
07/01/2024 21:58:27;1704661107;11;First
07/01/2024 21:58:27;1704661107;12;Second
07/01/2024 21:58:27;1704661107;14;Second
07/01/2024 21:58:27;1704661107;14;First
07/01/2024 21:58:27;1704661107;17;Second
07/01/2024 21:58:27;1704661107;17;First
07/01/2024 21:58:27;1704661107;11;First
07/01/2024 21:58:27;1704661107;12;Second
07/01/2024 21:58:27;1704661107;15;Second
07/01/2024 21:58:27;1704661107;16;First
07/01/2024 21:58:27;1704661107;16;First
07/01/2024 21:58:27;1704661107;17;Second
07/01/2024 21:58:28;1704661108;12;First
07/01/2024 21:58:28;1704661108;13;Second
07/01/2024 21:58:28;1704661108;14;First
07/01/2024 21:58:28;1704661108;17;Second
07/01/2024 21:58:28;1704661108;20;First
07/01/2024 21:58:28;1704661108;24;Second
07/01/2024 21:58:28;1704661108;10;First
07/01/2024 21:58:28;1704661108;12;First
07/01/2024 21:58:28;1704661108;13;Second
07/01/2024 21:58:28;1704661108;13;Second
07/01/2024 21:58:29;1704661109;15;Second
07/01/2024 21:58:29;1704661109;16;First
07/01/2024 21:58:29;1704661109;10;First
07/01/2024 21:58:29;1704661109;12;Second
07/01/2024 21:58:29;1704661109;13;First
07/01/2024 21:58:29;1704661109;13;Second
07/01/2024 21:58:29;1704661109;16;First
07/01/2024 21:58:29;1704661109;17;Second
07/01/2024 21:58:29;1704661109;12;First
07/01/2024 21:58:29;1704661109;12;Second
07/01/2024 21:58:30;1704661110;14;Second
07/01/2024 21:58:30;1704661110;16;First
07/01/2024 21:58:30;1704661110;17;Second
07/01/2024 21:58:30;1704661110;21;First
07/01/2024 21:58:30;1704661110;11;First
07/01/2024 21:58:30;1704661110;12;Second
07/01/2024 21:58:30;1704661110;14;First
07/01/2024 21:58:30;1704661110;16;Second
07/01/2024 21:58:30;1704661110;16;First
07/01/2024 21:58:30;1704661110;20;Second
07/01/2024 21:58:31;1704661111;11;First
07/01/2024 21:58:31;1704661111;11;Second
07/01/2024 21:58:31;1704661111;13;First
07/01/2024 21:58:31;1704661111;15;Second
07/01/2024 21:58:31;1704661111;17;Second
07/01/2024 21:58:31;1704661111;19;First
07/01/2024 21:58:31;1704661111;10;First
07/01/2024 21:58:31;1704661111;11;Second
07/01/2024 21:58:31;1704661111;13;First
07/01/2024 21:58:31;1704661111;13;Second
07/01/2024 21:58:31;1704661111;15;First
07/01/2024 21:58:32;1704661112;19;Second
07/01/2024 21:58:32;1704661112;11;First
07/01/2024 21:58:32;1704661112;12;Second
07/01/2024 21:58:32;1704661112;14;First
07/01/2024 21:58:32;1704661112;15;Second
07/01/2024 21:58:32;1704661112;16;First
07/01/2024 21:58:32;1704661112;22;Second
07/01/2024 21:58:33;1704661113;10;First
07/01/2024 21:58:33;1704661113;11;Second
07/01/2024 21:58:33;1704661113;13;First
07/01/2024 21:58:33;1704661113;14;Second
07/01/2024 21:58:33;1704661113;16;First
07/01/2024 21:58:33;1704661113;19;Second
07/01/2024 21:58:33;1704661113;11;First
07/01/2024 21:58:33;1704661113;11;Second
07/01/2024 21:58:33;1704661113;16;Second
07/01/2024 21:58:33;1704661113;17;First
07/01/2024 21:58:33;1704661113;18;Second
07/01/2024 21:58:33;1704661113;19;First
07/01/2024 21:58:34;1704661114;11;First
07/01/2024 21:58:34;1704661114;13;Second
07/01/2024 21:58:34;1704661114;14;Second
07/01/2024 21:58:34;1704661114;14;First
07/01/2024 21:58:34;1704661114;16;First
07/01/2024 21:58:34;1704661114;21;Second
07/01/2024 21:58:34;1704661114;9;First
07/01/2024 21:58:34;1704661114;11;Second
07/01/2024 21:58:34;1704661114;12;First
07/01/2024 21:58:35;1704661115;13;Second
07/01/2024 21:58:35;1704661115;17;First
07/01/2024 21:58:35;1704661115;19;Second
07/01/2024 21:58:35;1704661115;10;First
07/01/2024 21:58:35;1704661115;13;First
07/01/2024 21:58:35;1704661115;13;Second
07/01/2024 21:58:35;1704661115;16;Second
07/01/2024 21:58:35;1704661115;17;Second
07/01/2024 21:58:35;1704661115;17;First
07/01/2024 21:58:36;1704661116;10;First
07/01/2024 21:58:36;1704661116;12;Second
07/01/2024 21:58:36;1704661116;12;Second
07/01/2024 21:58:36;1704661116;14;First
07/01/2024 21:58:36;1704661116;14;First
07/01/2024 21:58:36;1704661116;17;Second
07/01/2024 21:58:36;1704661116;11;First
07/01/2024 21:58:36;1704661116;11;Second
07/01/2024 21:58:36;1704661116;13;First
07/01/2024 21:58:36;1704661116;14;First
07/01/2024 21:58:36;1704661116;14;Second
07/01/2024 21:58:37;1704661117;20;Second
07/01/2024 21:58:37;1704661117;11;First
07/01/2024 21:58:37;1704661117;13;First
07/01/2024 21:58:37;1704661117;14;Second
07/01/2024 21:58:37;1704661117;16;Second
07/01/2024 21:58:37;1704661117;18;First
07/01/2024 21:58:37;1704661117;21;Second
07/01/2024 21:58:38;1704661118;11;Second
07/01/2024 21:58:38;1704661118;11;First
07/01/2024 21:58:38;1704661118;14;First
07/01/2024 21:58:38;1704661118;16;Second
07/01/2024 21:58:38;1704661118;18;Second
07/01/2024 21:58:38;1704661118;18;First
07/01/2024 21:58:38;1704661118;10;Second
07/01/2024 21:58:38;1704661118;11;First
07/01/2024 21:58:38;1704661118;12;Second
07/01/2024 21:58:38;1704661118;15;Second
07/01/2024 21:58:38;1704661118;15;First
07/01/2024 21:58:38;1704661118;17;First
07/01/2024 21:58:39;1704661119;11;First
07/01/2024 21:58:39;1704661119;13;Second
07/01/2024 21:58:39;1704661119;14;First
07/01/2024 21:58:39;1704661119;17;Second
07/01/2024 21:58:39;1704661119;19;First
07/01/2024 21:58:39;1704661119;22;Second
07/01/2024 21:58:39;1704661119;10;First
07/01/2024 21:58:39;1704661119;11;Second
07/01/2024 21:58:39;1704661119;13;First
07/01/2024 21:58:39;1704661119;13;Second
07/01/2024 21:58:39;1704661119;15;First
07/01/2024 21:58:39;1704661119;17;Second
07/01/2024 21:58:40;1704661120;11;First
07/01/2024 21:58:40;1704661120;12;Second
07/01/2024 21:58:40;1704661120;12;Second
07/01/2024 21:58:40;1704661120;14;First
07/01/2024 21:58:40;1704661120;19;First
07/01/2024 21:58:40;1704661120;21;Second
07/01/2024 21:58:41;1704661121;9;First
07/01/2024 21:58:41;1704661121;12;First
07/01/2024 21:58:41;1704661121;12;Second
07/01/2024 21:58:41;1704661121;13;First
07/01/2024 21:58:41;1704661121;15;Second
07/01/2024 21:58:41;1704661121;19;Second
07/01/2024 21:58:41;1704661121;10;First
07/01/2024 21:58:41;1704661121;12;Second
07/01/2024 21:58:41;1704661121;13;First
07/01/2024 21:58:41;1704661121;15;Second
07/01/2024 21:58:41;1704661121;19;Second
07/01/2024 21:58:41;1704661121;19;First
07/01/2024 21:58:42;1704661122;12;First
07/01/2024 21:58:42;1704661122;12;Second
07/01/2024 21:58:42;1704661122;13;Second
07/01/2024 21:58:42;1704661122;15;First
07/01/2024 21:58:42;1704661122;19;Second
07/01/2024 21:58:42;1704661122;19;First
07/01/2024 21:58:42;1704661122;11;First
07/01/2024 21:58:42;1704661122;12;Second
07/01/2024 21:58:42;1704661122;15;Second
07/01/2024 21:58:42;1704661122;16;First
07/01/2024 21:58:42;1704661122;16;Second
07/01/2024 21:58:42;1704661122;18;First
07/01/2024 21:58:43;1704661123;10;First
07/01/2024 21:58:43;1704661123;12;Second
07/01/2024 21:58:43;1704661123;13;Second
07/01/2024 21:58:43;1704661123;16;First
07/01/2024 21:58:43;1704661123;16;First
07/01/2024 21:58:43;1704661123;17;Second
07/01/2024 21:58:43;1704661123;10;First
07/01/2024 21:58:43;1704661123;11;Second
07/01/2024 21:58:44;1704661124;13;First
07/01/2024 21:58:44;1704661124;14;First
07/01/2024 21:58:44;1704661124;17;Second
07/01/2024 21:58:44;1704661124;17;Second
07/01/2024 21:58:44;1704661124;11;First
07/01/2024 21:58:44;1704661124;13;First
07/01/2024 21:58:44;1704661124;13;Second
07/01/2024 21:58:44;1704661124;14;Second
07/01/2024 21:58:44;1704661124;16;First
07/01/2024 21:58:44;1704661124;19;Second
07/01/2024 21:58:45;1704661125;12;First
07/01/2024 21:58:45;1704661125;12;Second
07/01/2024 21:58:45;1704661125;13;First
07/01/2024 21:58:45;1704661125;14;Second
07/01/2024 21:58:45;1704661125;17;First
07/01/2024 21:58:45;1704661125;18;Second
07/01/2024 21:58:45;1704661125;11;First
07/01/2024 21:58:45;1704661125;11;Second
07/01/2024 21:58:45;1704661125;13;Second
07/01/2024 21:58:45;1704661125;14;First
07/01/2024 21:58:45;1704661125;18;First
07/01/2024 21:58:45;1704661125;18;Second
07/01/2024 21:58:46;1704661126;11;First
07/01/2024 21:58:46;1704661126;11;Second
07/01/2024 21:58:46;1704661126;13;First
07/01/2024 21:58:46;1704661126;18;First
07/01/2024 21:58:46;1704661126;19;Second
07/01/2024 21:58:46;1704661126;21;Second
07/01/2024 21:58:46;1704661126;9;First
07/01/2024 21:58:47;1704661127;11;Second
07/01/2024 21:58:47;1704661127;13;Second
07/01/2024 21:58:47;1704661127;13;First
07/01/2024 21:58:47;1704661127;17;First
07/01/2024 21:58:47;1704661127;21;Second
07/01/2024 21:58:47;1704661127;11;Second
07/01/2024 21:58:47;1704661127;11;First
07/01/2024 21:58:47;1704661127;11;Second
07/01/2024 21:58:47;1704661127;14;First
07/01/2024 21:58:47;1704661127;15;First
07/01/2024 21:58:47;1704661127;17;Second
07/01/2024 21:58:48;1704661128;11;First
07/01/2024 21:58:48;1704661128;12;First
07/01/2024 21:58:48;1704661128;12;Second
07/01/2024 21:58:48;1704661128;12;Second
07/01/2024 21:58:48;1704661128;16;First
07/01/2024 21:58:48;1704661128;19;Second
07/01/2024 21:58:48;1704661128;10;First
07/01/2024 21:58:48;1704661128;13;First
07/01/2024 21:58:49;1704661129;13;Second
07/01/2024 21:58:49;1704661129;14;Second
07/01/2024 21:58:49;1704661129;16;Second
07/01/2024 21:58:49;1704661129;18;First
07/01/2024 21:58:49;1704661129;11;Second
07/01/2024 21:58:49;1704661129;12;First
07/01/2024 21:58:49;1704661129;15;Second
07/01/2024 21:58:49;1704661129;16;First
07/01/2024 21:58:49;1704661129;17;Second
07/01/2024 21:58:49;1704661129;18;First
07/01/2024 21:58:50;1704661130;11;First
07/01/2024 21:58:50;1704661130;11;Second
07/01/2024 21:58:50;1704661130;15;First
07/01/2024 21:58:50;1704661130;16;Second
07/01/2024 21:58:50;1704661130;17;First
07/01/2024 21:58:50;1704661130;19;Second
