06/01/2024 16:08:28;1704553708;34
06/01/2024 16:08:30;1704553710;81
06/01/2024 16:08:32;1704553712;78
06/01/2024 16:08:33;1704553713;83
06/01/2024 16:08:35;1704553715;77
06/01/2024 16:08:37;1704553717;77
06/01/2024 16:08:39;1704553719;81
06/01/2024 16:08:40;1704553720;78
06/01/2024 16:08:48;1704553728;300
06/01/2024 16:08:49;1704553729;78
06/01/2024 16:08:51;1704553731;78
06/01/2024 16:08:53;1704553733;75
06/01/2024 16:08:54;1704553734;78
06/01/2024 16:08:56;1704553736;77
06/01/2024 16:08:58;1704553738;75
06/01/2024 16:08:59;1704553739;79
06/01/2024 16:09:01;1704553741;79
06/01/2024 16:09:03;1704553743;76
06/01/2024 16:09:04;1704553744;81
06/01/2024 16:09:06;1704553746;83
06/01/2024 16:09:11;1704553751;299
06/01/2024 16:09:13;1704553753;77
06/01/2024 16:09:15;1704553755;77
06/01/2024 16:09:17;1704553757;84
06/01/2024 16:09:18;1704553758;82
06/01/2024 16:09:20;1704553760;76
06/01/2024 16:09:21;1704553761;77
06/01/2024 16:09:23;1704553763;77
06/01/2024 16:09:25;1704553765;76
06/01/2024 16:09:27;1704553767;82
06/01/2024 16:09:28;1704553768;77
06/01/2024 16:09:30;1704553770;77
06/01/2024 16:09:31;1704553771;75
06/01/2024 16:09:33;1704553773;85
06/01/2024 16:09:35;1704553775;74
06/01/2024 16:09:36;1704553776;80
06/01/2024 16:09:38;1704553778;77
06/01/2024 16:09:40;1704553780;79
06/01/2024 16:09:42;1704553782;80
06/01/2024 16:09:43;1704553783;79
06/01/2024 16:09:45;1704553785;76
06/01/2024 16:09:47;1704553787;76
06/01/2024 16:09:48;1704553788;80
06/01/2024 16:09:50;1704553790;80
06/01/2024 16:09:52;1704553792;78
06/01/2024 16:09:53;1704553793;78
06/01/2024 16:09:55;1704553795;77
06/01/2024 16:09:57;1704553797;81
06/01/2024 16:09:58;1704553798;75
06/01/2024 16:10:00;1704553800;77
06/01/2024 16:10:02;1704553802;77
06/01/2024 16:10:03;1704553803;82
06/01/2024 16:10:05;1704553805;78
06/01/2024 16:10:07;1704553807;80
06/01/2024 16:10:13;1704553813;300
06/01/2024 16:10:15;1704553815;80
06/01/2024 16:10:17;1704553817;81
06/01/2024 16:10:19;1704553819;78
06/01/2024 16:10:21;1704553821;80
06/01/2024 16:10:22;1704553822;83
06/01/2024 16:10:24;1704553824;75
06/01/2024 16:10:26;1704553826;77
06/01/2024 16:10:28;1704553828;82
06/01/2024 16:10:29;1704553829;79
06/01/2024 16:10:31;1704553831;80
06/01/2024 16:10:33;1704553833;76
06/01/2024 16:10:35;1704553835;78
06/01/2024 16:10:36;1704553836;78
06/01/2024 16:10:38;1704553838;76
06/01/2024 16:10:40;1704553840;77
06/01/2024 16:10:41;1704553841;79
06/01/2024 16:10:43;1704553843;81
06/01/2024 16:10:45;1704553845;76
06/01/2024 16:10:47;1704553847;80
06/01/2024 16:10:54;1704553854;300
06/01/2024 16:10:55;1704553855;77
06/01/2024 16:10:57;1704553857;80
06/01/2024 16:10:59;1704553859;80
06/01/2024 16:11:00;1704553860;80
06/01/2024 16:11:02;1704553862;72
06/01/2024 16:11:08;1704553868;300
06/01/2024 16:11:09;1704553869;78
06/01/2024 16:11:11;1704553871;74
06/01/2024 16:11:13;1704553873;75
06/01/2024 16:11:14;1704553874;81
06/01/2024 16:11:16;1704553876;81
06/01/2024 16:11:18;1704553878;78
06/01/2024 16:11:19;1704553879;76
06/01/2024 16:11:21;1704553881;79
06/01/2024 16:11:23;1704553883;75
06/01/2024 16:11:24;1704553884;77
06/01/2024 16:11:26;1704553886;79
06/01/2024 16:11:28;1704553888;79
06/01/2024 16:11:29;1704553889;79
06/01/2024 16:11:36;1704553896;300
06/01/2024 16:11:38;1704553898;75
06/01/2024 16:11:39;1704553899;79
06/01/2024 16:11:41;1704553901;78
06/01/2024 16:11:43;1704553903;77
06/01/2024 16:11:44;1704553904;80
