07/01/2024 19:37:33;1704652653;0;First
07/01/2024 19:37:33;1704652653;0;Second
07/01/2024 19:37:33;1704652653;0;Second
07/01/2024 19:37:33;1704652653;0;Second
07/01/2024 19:37:33;1704652653;0;First
07/01/2024 19:37:33;1704652653;0;Second
07/01/2024 19:37:33;1704652653;7;Second
07/01/2024 19:37:33;1704652653;9;Second
07/01/2024 19:37:33;1704652653;11;Second
07/01/2024 19:37:33;1704652653;11;First
07/01/2024 19:37:33;1704652653;14;Second
07/01/2024 19:37:33;1704652653;15;First
07/01/2024 19:37:34;1704652654;7;Second
07/01/2024 19:37:34;1704652654;8;Second
07/01/2024 19:37:34;1704652654;11;Second
07/01/2024 19:37:34;1704652654;11;Second
07/01/2024 19:37:34;1704652654;13;First
07/01/2024 19:37:34;1704652654;14;First
07/01/2024 19:37:34;1704652654;7;Second
07/01/2024 19:37:34;1704652654;9;Second
07/01/2024 19:37:34;1704652654;10;Second
07/01/2024 19:37:34;1704652654;11;Second
07/01/2024 19:37:34;1704652654;14;First
07/01/2024 19:37:34;1704652654;15;First
07/01/2024 19:37:35;1704652655;7;Second
07/01/2024 19:37:35;1704652655;9;Second
07/01/2024 19:37:35;1704652655;12;Second
07/01/2024 19:37:35;1704652655;12;Second
07/01/2024 19:37:35;1704652655;14;First
07/01/2024 19:37:35;1704652655;14;First
07/01/2024 19:37:35;1704652655;8;Second
07/01/2024 19:37:35;1704652655;10;Second
07/01/2024 19:37:35;1704652655;10;Second
07/01/2024 19:37:35;1704652655;12;First
07/01/2024 19:37:35;1704652655;13;Second
07/01/2024 19:37:35;1704652655;14;First
07/01/2024 19:37:35;1704652655;7;Second
07/01/2024 19:37:35;1704652655;8;Second
07/01/2024 19:37:35;1704652655;10;Second
07/01/2024 19:37:36;1704652656;13;First
07/01/2024 19:37:36;1704652656;13;Second
07/01/2024 19:37:36;1704652656;15;First
07/01/2024 19:37:36;1704652656;7;Second
07/01/2024 19:37:36;1704652656;9;Second
07/01/2024 19:37:36;1704652656;11;Second
07/01/2024 19:37:36;1704652656;13;Second
07/01/2024 19:37:36;1704652656;14;First
07/01/2024 19:37:36;1704652656;18;First
07/01/2024 19:37:36;1704652656;8;Second
07/01/2024 19:37:36;1704652656;9;Second
07/01/2024 19:37:36;1704652656;11;Second
07/01/2024 19:37:36;1704652656;12;Second
07/01/2024 19:37:36;1704652656;12;First
07/01/2024 19:37:36;1704652656;14;First
07/01/2024 19:37:37;1704652657;7;Second
07/01/2024 19:37:37;1704652657;9;Second
07/01/2024 19:37:37;1704652657;11;Second
07/01/2024 19:37:37;1704652657;13;First
07/01/2024 19:37:37;1704652657;15;First
07/01/2024 19:37:37;1704652657;15;Second
07/01/2024 19:37:37;1704652657;8;Second
07/01/2024 19:37:37;1704652657;10;Second
07/01/2024 19:37:37;1704652657;11;Second
07/01/2024 19:37:37;1704652657;13;First
07/01/2024 19:37:37;1704652657;13;Second
07/01/2024 19:37:37;1704652657;15;First
07/01/2024 19:37:38;1704652658;8;Second
07/01/2024 19:37:38;1704652658;9;Second
07/01/2024 19:37:38;1704652658;11;Second
07/01/2024 19:37:38;1704652658;12;First
07/01/2024 19:37:38;1704652658;12;Second
07/01/2024 19:37:38;1704652658;16;First
07/01/2024 19:37:38;1704652658;8;Second
07/01/2024 19:37:38;1704652658;8;Second
07/01/2024 19:37:38;1704652658;10;Second
07/01/2024 19:37:38;1704652658;12;First
07/01/2024 19:37:38;1704652658;13;Second
07/01/2024 19:37:38;1704652658;16;First
07/01/2024 19:37:38;1704652658;7;Second
07/01/2024 19:37:38;1704652658;8;Second
07/01/2024 19:37:38;1704652658;10;Second
07/01/2024 19:37:38;1704652658;11;First
07/01/2024 19:37:38;1704652658;11;Second
07/01/2024 19:37:38;1704652658;14;First
07/01/2024 19:37:39;1704652659;7;Second
07/01/2024 19:37:39;1704652659;8;Second
07/01/2024 19:37:39;1704652659;9;Second
07/01/2024 19:37:39;1704652659;12;Second
07/01/2024 19:37:39;1704652659;13;First
07/01/2024 19:37:39;1704652659;15;First
07/01/2024 19:37:39;1704652659;8;Second
07/01/2024 19:37:39;1704652659;10;Second
07/01/2024 19:37:39;1704652659;10;Second
07/01/2024 19:37:39;1704652659;12;Second
07/01/2024 19:37:39;1704652659;13;First
07/01/2024 19:37:39;1704652659;15;First
07/01/2024 19:37:40;1704652660;7;Second
07/01/2024 19:37:40;1704652660;8;Second
07/01/2024 19:37:40;1704652660;10;Second
07/01/2024 19:37:40;1704652660;12;Second
07/01/2024 19:37:40;1704652660;14;First
07/01/2024 19:37:40;1704652660;15;First
07/01/2024 19:37:40;1704652660;8;Second
07/01/2024 19:37:40;1704652660;9;Second
07/01/2024 19:37:40;1704652660;11;Second
07/01/2024 19:37:40;1704652660;13;Second
07/01/2024 19:37:40;1704652660;15;First
07/01/2024 19:37:40;1704652660;16;First
07/01/2024 19:37:40;1704652660;7;Second
07/01/2024 19:37:40;1704652660;9;Second
07/01/2024 19:37:40;1704652660;10;Second
07/01/2024 19:37:40;1704652660;13;First
07/01/2024 19:37:40;1704652660;14;Second
07/01/2024 19:37:40;1704652660;15;First
07/01/2024 19:37:41;1704652661;7;Second
07/01/2024 19:37:41;1704652661;9;Second
07/01/2024 19:37:41;1704652661;11;Second
07/01/2024 19:37:41;1704652661;12;First
07/01/2024 19:37:41;1704652661;12;Second
07/01/2024 19:37:41;1704652661;14;First
07/01/2024 19:37:41;1704652661;8;Second
07/01/2024 19:37:41;1704652661;9;Second
07/01/2024 19:37:41;1704652661;10;Second
07/01/2024 19:37:41;1704652661;13;First
07/01/2024 19:37:41;1704652661;14;Second
07/01/2024 19:37:41;1704652661;15;First
07/01/2024 19:37:42;1704652662;8;Second
07/01/2024 19:37:42;1704652662;10;Second
07/01/2024 19:37:42;1704652662;11;Second
07/01/2024 19:37:42;1704652662;13;Second
07/01/2024 19:37:42;1704652662;13;First
07/01/2024 19:37:42;1704652662;18;First
07/01/2024 19:37:42;1704652662;8;Second
07/01/2024 19:37:42;1704652662;9;Second
07/01/2024 19:37:42;1704652662;11;Second
07/01/2024 19:37:42;1704652662;12;First
07/01/2024 19:37:42;1704652662;14;First
07/01/2024 19:37:42;1704652662;14;Second
07/01/2024 19:37:42;1704652662;7;Second
07/01/2024 19:37:43;1704652663;9;Second
07/01/2024 19:37:43;1704652663;11;Second
07/01/2024 19:37:43;1704652663;12;First
07/01/2024 19:37:43;1704652663;13;Second
07/01/2024 19:37:43;1704652663;15;First
07/01/2024 19:37:43;1704652663;7;Second
07/01/2024 19:37:43;1704652663;9;Second
07/01/2024 19:37:43;1704652663;10;Second
07/01/2024 19:37:43;1704652663;13;Second
07/01/2024 19:37:43;1704652663;13;First
07/01/2024 19:37:43;1704652663;14;First
07/01/2024 19:37:43;1704652663;7;Second
07/01/2024 19:37:43;1704652663;10;Second
07/01/2024 19:37:43;1704652663;10;Second
07/01/2024 19:37:43;1704652663;13;First
07/01/2024 19:37:43;1704652663;14;Second
07/01/2024 19:37:43;1704652663;15;First
07/01/2024 19:37:44;1704652664;7;Second
07/01/2024 19:37:44;1704652664;9;Second
07/01/2024 19:37:44;1704652664;11;Second
07/01/2024 19:37:44;1704652664;14;Second
07/01/2024 19:37:44;1704652664;14;First
07/01/2024 19:37:44;1704652664;15;First
07/01/2024 19:37:44;1704652664;7;Second
07/01/2024 19:37:44;1704652664;9;Second
07/01/2024 19:37:44;1704652664;10;Second
07/01/2024 19:37:44;1704652664;12;Second
07/01/2024 19:37:44;1704652664;13;First
07/01/2024 19:37:44;1704652664;15;First
07/01/2024 19:37:44;1704652664;8;Second
07/01/2024 19:37:45;1704652665;9;Second
07/01/2024 19:37:45;1704652665;13;Second
07/01/2024 19:37:45;1704652665;13;Second
07/01/2024 19:37:45;1704652665;15;First
07/01/2024 19:37:45;1704652665;17;First
07/01/2024 19:37:45;1704652665;7;Second
07/01/2024 19:37:45;1704652665;9;Second
07/01/2024 19:37:45;1704652665;10;Second
07/01/2024 19:37:45;1704652665;12;Second
07/01/2024 19:37:45;1704652665;13;First
07/01/2024 19:37:45;1704652665;15;First
07/01/2024 19:37:45;1704652665;8;Second
07/01/2024 19:37:45;1704652665;9;Second
07/01/2024 19:37:45;1704652665;10;Second
07/01/2024 19:37:46;1704652666;11;Second
07/01/2024 19:37:46;1704652666;15;First
07/01/2024 19:37:46;1704652666;15;First
07/01/2024 19:37:46;1704652666;7;Second
07/01/2024 19:37:46;1704652666;9;Second
07/01/2024 19:37:46;1704652666;10;Second
07/01/2024 19:37:46;1704652666;13;First
07/01/2024 19:37:46;1704652666;14;Second
07/01/2024 19:37:46;1704652666;15;First
07/01/2024 19:37:46;1704652666;8;Second
07/01/2024 19:37:46;1704652666;10;Second
07/01/2024 19:37:46;1704652666;10;Second
07/01/2024 19:37:46;1704652666;13;First
07/01/2024 19:37:46;1704652666;13;Second
07/01/2024 19:37:46;1704652666;15;First
07/01/2024 19:37:47;1704652667;7;Second
07/01/2024 19:37:47;1704652667;8;Second
07/01/2024 19:37:47;1704652667;10;Second
07/01/2024 19:37:47;1704652667;12;First
07/01/2024 19:37:47;1704652667;13;Second
07/01/2024 19:37:47;1704652667;14;First
07/01/2024 19:37:47;1704652667;8;Second
07/01/2024 19:37:47;1704652667;10;Second
07/01/2024 19:37:47;1704652667;11;Second
07/01/2024 19:37:47;1704652667;13;First
07/01/2024 19:37:47;1704652667;14;Second
07/01/2024 19:37:47;1704652667;15;First
07/01/2024 19:37:47;1704652667;8;Second
07/01/2024 19:37:48;1704652668;9;Second
07/01/2024 19:37:48;1704652668;10;Second
07/01/2024 19:37:48;1704652668;12;Second
07/01/2024 19:37:48;1704652668;13;First
07/01/2024 19:37:48;1704652668;15;First
07/01/2024 19:37:48;1704652668;7;Second
07/01/2024 19:37:48;1704652668;8;Second
07/01/2024 19:37:48;1704652668;10;Second
07/01/2024 19:37:48;1704652668;12;First
07/01/2024 19:37:48;1704652668;13;Second
07/01/2024 19:37:48;1704652668;15;First
07/01/2024 19:37:48;1704652668;7;Second
07/01/2024 19:37:48;1704652668;9;Second
07/01/2024 19:37:48;1704652668;11;Second
07/01/2024 19:37:48;1704652668;12;First
07/01/2024 19:37:48;1704652668;12;Second
07/01/2024 19:37:49;1704652669;16;First
07/01/2024 19:37:49;1704652669;7;Second
07/01/2024 19:37:49;1704652669;9;Second
07/01/2024 19:37:49;1704652669;9;Second
07/01/2024 19:37:49;1704652669;11;Second
07/01/2024 19:37:49;1704652669;11;First
07/01/2024 19:37:49;1704652669;15;First
07/01/2024 19:37:49;1704652669;8;Second
07/01/2024 19:37:49;1704652669;9;Second
07/01/2024 19:37:49;1704652669;9;Second
07/01/2024 19:37:49;1704652669;13;First
07/01/2024 19:37:49;1704652669;13;Second
07/01/2024 19:37:49;1704652669;14;First
07/01/2024 19:37:50;1704652670;7;Second
07/01/2024 19:37:50;1704652670;9;Second
07/01/2024 19:37:50;1704652670;10;Second
07/01/2024 19:37:50;1704652670;12;Second
07/01/2024 19:37:50;1704652670;12;First
07/01/2024 19:37:50;1704652670;15;First
07/01/2024 19:37:50;1704652670;7;Second
07/01/2024 19:37:50;1704652670;8;Second
07/01/2024 19:37:50;1704652670;10;Second
07/01/2024 19:37:50;1704652670;12;First
07/01/2024 19:37:50;1704652670;13;Second
07/01/2024 19:37:50;1704652670;15;First
07/01/2024 19:37:51;1704652671;7;Second
07/01/2024 19:37:51;1704652671;8;Second
07/01/2024 19:37:51;1704652671;9;Second
07/01/2024 19:37:51;1704652671;12;Second
07/01/2024 19:37:51;1704652671;12;First
07/01/2024 19:37:51;1704652671;16;First
07/01/2024 19:37:51;1704652671;7;Second
07/01/2024 19:37:51;1704652671;9;Second
07/01/2024 19:37:51;1704652671;10;Second
07/01/2024 19:37:51;1704652671;12;First
07/01/2024 19:37:51;1704652671;13;Second
07/01/2024 19:37:51;1704652671;16;First
07/01/2024 19:37:51;1704652671;7;Second
07/01/2024 19:37:51;1704652671;9;Second
07/01/2024 19:37:51;1704652671;10;Second
07/01/2024 19:37:52;1704652672;12;First
07/01/2024 19:37:52;1704652672;12;Second
07/01/2024 19:37:52;1704652672;15;First
07/01/2024 19:37:52;1704652672;7;Second
07/01/2024 19:37:52;1704652672;8;Second
07/01/2024 19:37:52;1704652672;10;Second
07/01/2024 19:37:52;1704652672;11;Second
07/01/2024 19:37:52;1704652672;13;First
07/01/2024 19:37:52;1704652672;15;First
07/01/2024 19:37:52;1704652672;7;Second
07/01/2024 19:37:52;1704652672;9;Second
07/01/2024 19:37:52;1704652672;10;Second
07/01/2024 19:37:52;1704652672;12;First
07/01/2024 19:37:52;1704652672;14;First
07/01/2024 19:37:52;1704652672;14;Second
07/01/2024 19:37:53;1704652673;7;Second
07/01/2024 19:37:53;1704652673;8;Second
07/01/2024 19:37:53;1704652673;10;Second
07/01/2024 19:37:53;1704652673;12;Second
07/01/2024 19:37:53;1704652673;12;First
07/01/2024 19:37:53;1704652673;14;First
07/01/2024 19:37:53;1704652673;8;Second
07/01/2024 19:37:53;1704652673;9;Second
07/01/2024 19:37:53;1704652673;11;Second
07/01/2024 19:37:53;1704652673;13;First
07/01/2024 19:37:53;1704652673;13;Second
07/01/2024 19:37:53;1704652673;16;First
07/01/2024 19:37:53;1704652673;6;Second
07/01/2024 19:37:53;1704652673;8;Second
07/01/2024 19:37:53;1704652673;9;Second
07/01/2024 19:37:53;1704652673;13;First
07/01/2024 19:37:53;1704652673;13;Second
07/01/2024 19:37:54;1704652674;14;First
07/01/2024 19:37:54;1704652674;8;Second
07/01/2024 19:37:54;1704652674;9;Second
07/01/2024 19:37:54;1704652674;10;Second
07/01/2024 19:37:54;1704652674;12;Second
07/01/2024 19:37:54;1704652674;13;First
07/01/2024 19:37:54;1704652674;14;First
07/01/2024 19:37:54;1704652674;8;Second
07/01/2024 19:37:54;1704652674;9;Second
07/01/2024 19:37:54;1704652674;11;Second
07/01/2024 19:37:54;1704652674;13;First
07/01/2024 19:37:54;1704652674;14;Second
07/01/2024 19:37:54;1704652674;15;First
07/01/2024 19:37:55;1704652675;7;Second
07/01/2024 19:37:55;1704652675;9;Second
07/01/2024 19:37:55;1704652675;11;Second
07/01/2024 19:37:55;1704652675;11;Second
07/01/2024 19:37:55;1704652675;12;First
07/01/2024 19:37:55;1704652675;15;First
07/01/2024 19:37:55;1704652675;7;Second
07/01/2024 19:37:55;1704652675;9;Second
07/01/2024 19:37:55;1704652675;10;Second
07/01/2024 19:37:55;1704652675;13;First
07/01/2024 19:37:55;1704652675;13;Second
07/01/2024 19:37:55;1704652675;15;First
07/01/2024 19:37:55;1704652675;7;Second
07/01/2024 19:37:55;1704652675;9;Second
07/01/2024 19:37:55;1704652675;10;Second
07/01/2024 19:37:56;1704652676;12;First
07/01/2024 19:37:56;1704652676;12;Second
07/01/2024 19:37:56;1704652676;13;First
07/01/2024 19:37:56;1704652676;7;Second
07/01/2024 19:37:56;1704652676;9;Second
07/01/2024 19:37:56;1704652676;11;Second
07/01/2024 19:37:56;1704652676;13;First
07/01/2024 19:37:56;1704652676;13;Second
07/01/2024 19:37:56;1704652676;15;First
07/01/2024 19:37:56;1704652676;7;Second
07/01/2024 19:37:56;1704652676;9;Second
07/01/2024 19:37:56;1704652676;9;Second
07/01/2024 19:37:56;1704652676;12;First
07/01/2024 19:37:56;1704652676;13;Second
07/01/2024 19:37:56;1704652676;14;First
07/01/2024 19:37:57;1704652677;7;Second
07/01/2024 19:37:57;1704652677;8;Second
07/01/2024 19:37:57;1704652677;10;Second
07/01/2024 19:37:57;1704652677;12;Second
07/01/2024 19:37:57;1704652677;13;First
07/01/2024 19:37:57;1704652677;16;First
07/01/2024 19:37:57;1704652677;6;Second
07/01/2024 19:37:57;1704652677;8;Second
07/01/2024 19:37:57;1704652677;8;Second
07/01/2024 19:37:57;1704652677;12;First
07/01/2024 19:37:57;1704652677;13;Second
07/01/2024 19:37:57;1704652677;14;First
07/01/2024 19:37:57;1704652677;7;Second
07/01/2024 19:37:57;1704652677;9;Second
07/01/2024 19:37:57;1704652677;10;Second
07/01/2024 19:37:58;1704652678;12;First
07/01/2024 19:37:58;1704652678;13;Second
07/01/2024 19:37:58;1704652678;15;First
07/01/2024 19:37:58;1704652678;7;Second
07/01/2024 19:37:58;1704652678;9;Second
07/01/2024 19:37:58;1704652678;10;Second
07/01/2024 19:37:58;1704652678;12;First
07/01/2024 19:37:58;1704652678;12;Second
07/01/2024 19:37:58;1704652678;15;First
07/01/2024 19:37:58;1704652678;7;Second
07/01/2024 19:37:58;1704652678;9;Second
07/01/2024 19:37:58;1704652678;10;Second
07/01/2024 19:37:58;1704652678;12;First
07/01/2024 19:37:58;1704652678;13;Second
07/01/2024 19:37:58;1704652678;14;First
07/01/2024 19:37:59;1704652679;7;Second
07/01/2024 19:37:59;1704652679;10;Second
07/01/2024 19:37:59;1704652679;11;Second
07/01/2024 19:37:59;1704652679;12;First
07/01/2024 19:37:59;1704652679;14;First
07/01/2024 19:37:59;1704652679;15;Second
07/01/2024 19:37:59;1704652679;7;Second
07/01/2024 19:37:59;1704652679;9;Second
07/01/2024 19:37:59;1704652679;10;Second
07/01/2024 19:37:59;1704652679;12;Second
07/01/2024 19:37:59;1704652679;14;First
07/01/2024 19:37:59;1704652679;15;First
07/01/2024 19:37:59;1704652679;8;Second
07/01/2024 19:37:59;1704652679;9;Second
07/01/2024 19:38:00;1704652680;10;Second
07/01/2024 19:38:00;1704652680;12;Second
07/01/2024 19:38:00;1704652680;12;First
07/01/2024 19:38:00;1704652680;15;First
07/01/2024 19:38:00;1704652680;8;Second
07/01/2024 19:38:00;1704652680;9;Second
07/01/2024 19:38:00;1704652680;11;Second
07/01/2024 19:38:00;1704652680;12;Second
07/01/2024 19:38:00;1704652680;13;First
07/01/2024 19:38:00;1704652680;17;First
07/01/2024 19:38:00;1704652680;7;Second
07/01/2024 19:38:00;1704652680;9;Second
07/01/2024 19:38:00;1704652680;9;Second
07/01/2024 19:38:00;1704652680;12;Second
07/01/2024 19:38:00;1704652680;13;First
07/01/2024 19:38:00;1704652680;15;First
07/01/2024 19:38:01;1704652681;7;Second
07/01/2024 19:38:01;1704652681;9;Second
07/01/2024 19:38:01;1704652681;10;Second
07/01/2024 19:38:01;1704652681;13;Second
07/01/2024 19:38:01;1704652681;13;First
07/01/2024 19:38:01;1704652681;14;First
07/01/2024 19:38:01;1704652681;7;Second
07/01/2024 19:38:01;1704652681;9;Second
07/01/2024 19:38:01;1704652681;10;Second
07/01/2024 19:38:01;1704652681;13;Second
07/01/2024 19:38:01;1704652681;13;First
07/01/2024 19:38:01;1704652681;16;First
07/01/2024 19:38:02;1704652682;7;Second
07/01/2024 19:38:02;1704652682;9;Second
07/01/2024 19:38:02;1704652682;10;Second
07/01/2024 19:38:02;1704652682;11;Second
07/01/2024 19:38:02;1704652682;13;First
07/01/2024 19:38:02;1704652682;16;First
07/01/2024 19:38:02;1704652682;8;Second
07/01/2024 19:38:02;1704652682;9;Second
07/01/2024 19:38:02;1704652682;10;Second
07/01/2024 19:38:02;1704652682;12;Second
07/01/2024 19:38:02;1704652682;12;First
07/01/2024 19:38:02;1704652682;15;First
07/01/2024 19:38:02;1704652682;7;Second
07/01/2024 19:38:02;1704652682;9;Second
07/01/2024 19:38:02;1704652682;10;Second
07/01/2024 19:38:02;1704652682;12;Second
07/01/2024 19:38:02;1704652682;13;First
07/01/2024 19:38:03;1704652683;15;First
07/01/2024 19:38:03;1704652683;7;Second
07/01/2024 19:38:03;1704652683;9;Second
07/01/2024 19:38:03;1704652683;10;Second
07/01/2024 19:38:03;1704652683;12;First
07/01/2024 19:38:03;1704652683;13;Second
07/01/2024 19:38:03;1704652683;16;First
07/01/2024 19:38:03;1704652683;7;Second
07/01/2024 19:38:03;1704652683;8;Second
07/01/2024 19:38:03;1704652683;10;Second
07/01/2024 19:38:03;1704652683;12;First
07/01/2024 19:38:03;1704652683;14;Second
07/01/2024 19:38:03;1704652683;15;First
07/01/2024 19:38:04;1704652684;7;Second
07/01/2024 19:38:04;1704652684;9;Second
07/01/2024 19:38:04;1704652684;10;Second
07/01/2024 19:38:04;1704652684;12;Second
07/01/2024 19:38:04;1704652684;13;First
07/01/2024 19:38:04;1704652684;15;First
07/01/2024 19:38:04;1704652684;8;Second
07/01/2024 19:38:04;1704652684;9;Second
07/01/2024 19:38:04;1704652684;11;Second
07/01/2024 19:38:04;1704652684;12;First
07/01/2024 19:38:04;1704652684;13;Second
07/01/2024 19:38:04;1704652684;14;First
07/01/2024 19:38:04;1704652684;7;Second
07/01/2024 19:38:04;1704652684;9;Second
07/01/2024 19:38:04;1704652684;10;Second
07/01/2024 19:38:04;1704652684;12;First
07/01/2024 19:38:04;1704652684;14;Second
07/01/2024 19:38:05;1704652685;15;First
07/01/2024 19:38:05;1704652685;7;Second
07/01/2024 19:38:05;1704652685;9;Second
07/01/2024 19:38:05;1704652685;10;Second
07/01/2024 19:38:05;1704652685;12;Second
07/01/2024 19:38:05;1704652685;13;First
07/01/2024 19:38:05;1704652685;16;First
07/01/2024 19:38:05;1704652685;7;Second
07/01/2024 19:38:05;1704652685;8;Second
07/01/2024 19:38:05;1704652685;9;Second
07/01/2024 19:38:05;1704652685;12;First
07/01/2024 19:38:05;1704652685;14;Second
07/01/2024 19:38:05;1704652685;14;First
07/01/2024 19:38:06;1704652686;7;Second
07/01/2024 19:38:06;1704652686;9;Second
07/01/2024 19:38:06;1704652686;11;Second
07/01/2024 19:38:06;1704652686;13;First
07/01/2024 19:38:06;1704652686;14;Second
07/01/2024 19:38:06;1704652686;15;First
07/01/2024 19:38:06;1704652686;8;Second
07/01/2024 19:38:06;1704652686;9;Second
07/01/2024 19:38:06;1704652686;10;Second
07/01/2024 19:38:06;1704652686;12;Second
07/01/2024 19:38:06;1704652686;12;First
07/01/2024 19:38:06;1704652686;15;First
07/01/2024 19:38:06;1704652686;7;Second
07/01/2024 19:38:06;1704652686;8;Second
07/01/2024 19:38:06;1704652686;10;Second
07/01/2024 19:38:07;1704652687;12;First
07/01/2024 19:38:07;1704652687;12;Second
07/01/2024 19:38:07;1704652687;16;First
07/01/2024 19:38:07;1704652687;8;Second
07/01/2024 19:38:07;1704652687;9;Second
07/01/2024 19:38:07;1704652687;10;Second
07/01/2024 19:38:07;1704652687;12;First
07/01/2024 19:38:07;1704652687;14;Second
07/01/2024 19:38:07;1704652687;14;First
07/01/2024 19:38:07;1704652687;8;Second
07/01/2024 19:38:07;1704652687;9;Second
07/01/2024 19:38:07;1704652687;11;Second
07/01/2024 19:38:07;1704652687;13;Second
07/01/2024 19:38:07;1704652687;14;First
07/01/2024 19:38:07;1704652687;15;First
07/01/2024 19:38:08;1704652688;8;Second
07/01/2024 19:38:08;1704652688;9;Second
07/01/2024 19:38:08;1704652688;11;Second
07/01/2024 19:38:08;1704652688;13;First
07/01/2024 19:38:08;1704652688;15;First
07/01/2024 19:38:08;1704652688;15;Second
07/01/2024 19:38:08;1704652688;8;Second
07/01/2024 19:38:08;1704652688;9;Second
07/01/2024 19:38:08;1704652688;10;Second
07/01/2024 19:38:08;1704652688;13;First
07/01/2024 19:38:08;1704652688;13;Second
07/01/2024 19:38:08;1704652688;14;First
07/01/2024 19:38:08;1704652688;8;Second
07/01/2024 19:38:08;1704652688;10;Second
07/01/2024 19:38:09;1704652689;11;Second
07/01/2024 19:38:09;1704652689;12;Second
07/01/2024 19:38:09;1704652689;14;First
07/01/2024 19:38:09;1704652689;16;First
07/01/2024 19:38:09;1704652689;7;Second
07/01/2024 19:38:09;1704652689;9;Second
07/01/2024 19:38:09;1704652689;9;Second
07/01/2024 19:38:09;1704652689;11;Second
07/01/2024 19:38:09;1704652689;12;First
07/01/2024 19:38:09;1704652689;14;First
07/01/2024 19:38:09;1704652689;8;Second
07/01/2024 19:38:09;1704652689;10;Second
07/01/2024 19:38:09;1704652689;10;Second
07/01/2024 19:38:09;1704652689;12;Second
07/01/2024 19:38:09;1704652689;13;First
07/01/2024 19:38:09;1704652689;15;First
07/01/2024 19:38:10;1704652690;7;Second
07/01/2024 19:38:10;1704652690;8;Second
07/01/2024 19:38:10;1704652690;11;Second
07/01/2024 19:38:10;1704652690;12;First
07/01/2024 19:38:10;1704652690;13;Second
07/01/2024 19:38:10;1704652690;14;First
07/01/2024 19:38:10;1704652690;8;Second
07/01/2024 19:38:10;1704652690;9;Second
07/01/2024 19:38:10;1704652690;10;Second
07/01/2024 19:38:10;1704652690;12;Second
07/01/2024 19:38:10;1704652690;12;First
07/01/2024 19:38:10;1704652690;15;First
07/01/2024 19:38:11;1704652691;8;Second
07/01/2024 19:38:11;1704652691;9;Second
07/01/2024 19:38:11;1704652691;11;Second
07/01/2024 19:38:11;1704652691;13;First
07/01/2024 19:38:11;1704652691;14;Second
07/01/2024 19:38:11;1704652691;15;First
07/01/2024 19:38:11;1704652691;7;Second
07/01/2024 19:38:11;1704652691;8;Second
07/01/2024 19:38:11;1704652691;9;Second
07/01/2024 19:38:11;1704652691;12;First
07/01/2024 19:38:11;1704652691;14;First
07/01/2024 19:38:11;1704652691;15;Second
07/01/2024 19:38:11;1704652691;7;Second
07/01/2024 19:38:11;1704652691;9;Second
07/01/2024 19:38:11;1704652691;9;Second
07/01/2024 19:38:11;1704652691;12;Second
07/01/2024 19:38:11;1704652691;14;First
07/01/2024 19:38:11;1704652691;16;First
07/01/2024 19:38:12;1704652692;7;Second
07/01/2024 19:38:12;1704652692;9;Second
07/01/2024 19:38:12;1704652692;10;Second
07/01/2024 19:38:12;1704652692;12;Second
07/01/2024 19:38:12;1704652692;13;First
07/01/2024 19:38:12;1704652692;15;First
07/01/2024 19:38:12;1704652692;7;Second
07/01/2024 19:38:12;1704652692;8;Second
07/01/2024 19:38:12;1704652692;10;Second
07/01/2024 19:38:12;1704652692;12;First
07/01/2024 19:38:12;1704652692;13;Second
07/01/2024 19:38:12;1704652692;14;First
07/01/2024 19:38:12;1704652692;7;Second
07/01/2024 19:38:13;1704652693;9;Second
07/01/2024 19:38:13;1704652693;11;Second
07/01/2024 19:38:13;1704652693;12;Second
07/01/2024 19:38:13;1704652693;13;First
07/01/2024 19:38:13;1704652693;16;First
07/01/2024 19:38:13;1704652693;7;Second
07/01/2024 19:38:13;1704652693;8;Second
07/01/2024 19:38:13;1704652693;10;Second
07/01/2024 19:38:13;1704652693;13;First
07/01/2024 19:38:13;1704652693;13;Second
07/01/2024 19:38:13;1704652693;15;First
07/01/2024 19:38:13;1704652693;7;Second
07/01/2024 19:38:13;1704652693;8;Second
07/01/2024 19:38:13;1704652693;9;Second
07/01/2024 19:38:13;1704652693;12;Second
07/01/2024 19:38:13;1704652693;12;First
07/01/2024 19:38:13;1704652693;15;First
07/01/2024 19:38:14;1704652694;8;Second
07/01/2024 19:38:14;1704652694;9;Second
07/01/2024 19:38:14;1704652694;11;Second
07/01/2024 19:38:14;1704652694;12;Second
07/01/2024 19:38:14;1704652694;13;First
07/01/2024 19:38:14;1704652694;16;First
07/01/2024 19:38:14;1704652694;6;Second
07/01/2024 19:38:14;1704652694;8;Second
07/01/2024 19:38:14;1704652694;10;Second
07/01/2024 19:38:14;1704652694;12;Second
07/01/2024 19:38:14;1704652694;12;First
07/01/2024 19:38:14;1704652694;15;First
