07/01/2024 21:07:26;1704658046;0;Third
07/01/2024 21:07:26;1704658046;0;Second
07/01/2024 21:07:26;1704658046;0;First
07/01/2024 21:07:28;1704658048;68;First
07/01/2024 21:07:28;1704658048;77;Third
07/01/2024 21:07:28;1704658048;78;Second
07/01/2024 21:07:30;1704658050;69;First
07/01/2024 21:07:30;1704658050;70;Third
07/01/2024 21:07:31;1704658051;73;Second
07/01/2024 21:07:33;1704658053;71;First
07/01/2024 21:07:33;1704658053;73;Second
07/01/2024 21:07:33;1704658053;76;Third
07/01/2024 21:07:36;1704658056;70;First
07/01/2024 21:07:36;1704658056;71;Third
07/01/2024 21:07:36;1704658056;72;Second
07/01/2024 21:07:38;1704658058;70;First
07/01/2024 21:07:38;1704658058;74;Third
07/01/2024 21:07:38;1704658058;79;Second
07/01/2024 21:07:40;1704658060;66;First
07/01/2024 21:07:40;1704658060;72;Third
07/01/2024 21:07:40;1704658060;73;Second
07/01/2024 21:07:42;1704658062;65;First
07/01/2024 21:07:42;1704658062;71;Third
07/01/2024 21:07:42;1704658062;72;Second
07/01/2024 21:07:45;1704658065;70;First
07/01/2024 21:07:45;1704658065;71;Third
07/01/2024 21:07:45;1704658065;72;Second
07/01/2024 21:07:47;1704658067;66;First
07/01/2024 21:07:47;1704658067;69;Third
07/01/2024 21:07:47;1704658067;71;Second
07/01/2024 21:07:49;1704658069;67;First
07/01/2024 21:07:49;1704658069;72;Second
07/01/2024 21:07:49;1704658069;73;Third
07/01/2024 21:07:51;1704658071;66;First
07/01/2024 21:07:51;1704658071;71;Third
07/01/2024 21:07:51;1704658071;81;Second
07/01/2024 21:07:53;1704658073;65;First
07/01/2024 21:07:53;1704658073;67;Third
07/01/2024 21:07:54;1704658074;74;Second
07/01/2024 21:07:56;1704658076;62;First
07/01/2024 21:07:56;1704658076;67;Third
07/01/2024 21:07:56;1704658076;69;Second
07/01/2024 21:07:59;1704658079;71;First
07/01/2024 21:07:59;1704658079;72;Third
07/01/2024 21:07:59;1704658079;77;Second
07/01/2024 21:08:00;1704658080;65;First
07/01/2024 21:08:00;1704658080;69;Third
07/01/2024 21:08:00;1704658080;74;Second
07/01/2024 21:08:02;1704658082;67;First
07/01/2024 21:08:03;1704658083;69;Third
07/01/2024 21:08:03;1704658083;76;Second
07/01/2024 21:08:04;1704658084;67;First
07/01/2024 21:08:04;1704658084;69;Third
07/01/2024 21:08:05;1704658085;78;Second
07/01/2024 21:08:07;1704658087;66;First
07/01/2024 21:08:07;1704658087;74;Third
07/01/2024 21:08:07;1704658087;83;Second
07/01/2024 21:08:09;1704658089;67;First
07/01/2024 21:08:10;1704658090;70;Second
07/01/2024 21:08:10;1704658090;78;Third
07/01/2024 21:08:11;1704658091;67;First
07/01/2024 21:08:12;1704658092;71;Third
07/01/2024 21:08:12;1704658092;79;Second
07/01/2024 21:08:13;1704658093;61;First
07/01/2024 21:08:13;1704658093;67;Third
07/01/2024 21:08:13;1704658093;70;Second
07/01/2024 21:08:15;1704658095;67;First
07/01/2024 21:08:15;1704658095;71;Third
07/01/2024 21:08:15;1704658095;76;Second
07/01/2024 21:08:17;1704658097;62;Third
07/01/2024 21:08:17;1704658097;74;Second
07/01/2024 21:08:17;1704658097;75;First
07/01/2024 21:08:20;1704658100;70;First
07/01/2024 21:08:20;1704658100;70;Third
07/01/2024 21:08:20;1704658100;75;Second
07/01/2024 21:08:22;1704658102;69;First
07/01/2024 21:08:22;1704658102;73;Third
07/01/2024 21:08:22;1704658102;74;Second
07/01/2024 21:08:25;1704658105;69;First
07/01/2024 21:08:25;1704658105;70;Third
07/01/2024 21:08:25;1704658105;75;Second
07/01/2024 21:08:27;1704658107;70;First
07/01/2024 21:08:27;1704658107;72;Third
07/01/2024 21:08:27;1704658107;73;Second
07/01/2024 21:08:29;1704658109;68;First
07/01/2024 21:08:29;1704658109;74;Third
07/01/2024 21:08:29;1704658109;75;Second
07/01/2024 21:08:31;1704658111;62;First
07/01/2024 21:08:31;1704658111;72;Third
07/01/2024 21:08:31;1704658111;74;Second
07/01/2024 21:08:33;1704658113;65;First
07/01/2024 21:08:33;1704658113;67;Third
07/01/2024 21:08:33;1704658113;72;Second
07/01/2024 21:08:35;1704658115;69;First
07/01/2024 21:08:35;1704658115;70;Third
07/01/2024 21:08:36;1704658116;81;Second
07/01/2024 21:08:37;1704658117;65;First
07/01/2024 21:08:37;1704658117;70;Third
07/01/2024 21:08:37;1704658117;75;Second
07/01/2024 21:08:40;1704658120;67;First
07/01/2024 21:08:40;1704658120;72;Third
07/01/2024 21:08:40;1704658120;74;Second
07/01/2024 21:08:42;1704658122;65;Third
07/01/2024 21:08:42;1704658122;67;Second
07/01/2024 21:08:42;1704658122;72;First
07/01/2024 21:08:45;1704658125;70;First
07/01/2024 21:08:46;1704658126;71;Third
07/01/2024 21:08:46;1704658126;78;Second
07/01/2024 21:08:48;1704658128;65;First
07/01/2024 21:08:48;1704658128;69;Third
07/01/2024 21:08:48;1704658128;72;Second
07/01/2024 21:08:50;1704658130;63;Third
07/01/2024 21:08:50;1704658130;71;First
07/01/2024 21:08:50;1704658130;77;Second
07/01/2024 21:08:53;1704658133;74;First
07/01/2024 21:08:53;1704658133;77;Second
07/01/2024 21:08:53;1704658133;78;Third
07/01/2024 21:08:55;1704658135;65;First
07/01/2024 21:08:55;1704658135;67;Third
07/01/2024 21:08:55;1704658135;72;Second
07/01/2024 21:08:57;1704658137;69;First
07/01/2024 21:08:57;1704658137;74;Third
07/01/2024 21:08:58;1704658138;79;Second
07/01/2024 21:09:00;1704658140;69;First
07/01/2024 21:09:00;1704658140;71;Third
07/01/2024 21:09:00;1704658140;72;Second
07/01/2024 21:09:03;1704658143;69;First
07/01/2024 21:09:03;1704658143;72;Third
07/01/2024 21:09:03;1704658143;73;Second
07/01/2024 21:09:05;1704658145;67;First
07/01/2024 21:09:05;1704658145;71;Third
07/01/2024 21:09:05;1704658145;75;Second
07/01/2024 21:09:08;1704658148;69;First
07/01/2024 21:09:08;1704658148;71;Third
07/01/2024 21:09:08;1704658148;72;Second
07/01/2024 21:09:10;1704658150;67;First
07/01/2024 21:09:10;1704658150;69;Third
07/01/2024 21:09:10;1704658150;74;Second
07/01/2024 21:09:12;1704658152;64;First
07/01/2024 21:09:12;1704658152;66;Third
07/01/2024 21:09:12;1704658152;70;Second
07/01/2024 21:09:15;1704658155;68;First
07/01/2024 21:09:15;1704658155;69;Third
07/01/2024 21:09:15;1704658155;71;Second
07/01/2024 21:09:16;1704658156;64;First
07/01/2024 21:09:16;1704658156;70;Third
07/01/2024 21:09:17;1704658157;80;Second
07/01/2024 21:09:19;1704658159;67;First
07/01/2024 21:09:19;1704658159;70;Third
07/01/2024 21:09:19;1704658159;72;Second
07/01/2024 21:09:21;1704658161;65;First
07/01/2024 21:09:21;1704658161;68;Third
07/01/2024 21:09:21;1704658161;69;Second
07/01/2024 21:09:24;1704658164;69;First
07/01/2024 21:09:24;1704658164;75;Second
07/01/2024 21:09:24;1704658164;78;Third
07/01/2024 21:09:27;1704658167;70;First
07/01/2024 21:09:27;1704658167;71;Third
07/01/2024 21:09:27;1704658167;72;Second
07/01/2024 21:09:29;1704658169;68;First
07/01/2024 21:09:29;1704658169;73;Second
07/01/2024 21:09:29;1704658169;78;Third
07/01/2024 21:09:31;1704658171;67;First
07/01/2024 21:09:31;1704658171;68;Third
07/01/2024 21:09:32;1704658172;71;Second
07/01/2024 21:09:33;1704658173;66;First
07/01/2024 21:09:33;1704658173;69;Third
07/01/2024 21:09:33;1704658173;72;Second
07/01/2024 21:09:36;1704658176;68;Third
07/01/2024 21:09:36;1704658176;72;First
07/01/2024 21:09:36;1704658176;73;Second
07/01/2024 21:09:37;1704658177;64;First
07/01/2024 21:09:38;1704658178;72;Third
07/01/2024 21:09:38;1704658178;75;Second
07/01/2024 21:09:41;1704658181;76;First
07/01/2024 21:09:41;1704658181;77;Third
07/01/2024 21:09:41;1704658181;79;Second
07/01/2024 21:09:43;1704658183;68;First
07/01/2024 21:09:43;1704658183;69;Third
07/01/2024 21:09:43;1704658183;74;Second
07/01/2024 21:09:45;1704658185;67;First
07/01/2024 21:09:46;1704658186;70;Third
07/01/2024 21:09:46;1704658186;73;Second
07/01/2024 21:09:48;1704658188;69;First
07/01/2024 21:09:48;1704658188;69;Third
07/01/2024 21:09:48;1704658188;76;Second
07/01/2024 21:09:51;1704658191;66;First
07/01/2024 21:09:51;1704658191;71;Second
07/01/2024 21:09:51;1704658191;78;Third
07/01/2024 21:09:54;1704658194;70;First
07/01/2024 21:09:54;1704658194;71;Third
07/01/2024 21:09:54;1704658194;73;Second
07/01/2024 21:09:56;1704658196;65;First
07/01/2024 21:09:56;1704658196;70;Third
07/01/2024 21:09:56;1704658196;74;Second
07/01/2024 21:09:59;1704658199;67;First
07/01/2024 21:09:59;1704658199;68;Third
07/01/2024 21:09:59;1704658199;71;Second
07/01/2024 21:10:01;1704658201;70;First
07/01/2024 21:10:01;1704658201;71;Third
07/01/2024 21:10:01;1704658201;73;Second
07/01/2024 21:10:03;1704658203;66;First
07/01/2024 21:10:03;1704658203;70;Third
07/01/2024 21:10:04;1704658204;82;Second
07/01/2024 21:10:06;1704658206;68;First
07/01/2024 21:10:06;1704658206;69;Third
07/01/2024 21:10:06;1704658206;76;Second
07/01/2024 21:10:08;1704658208;70;First
07/01/2024 21:10:08;1704658208;71;Second
07/01/2024 21:10:14;1704658214;300;Third
07/01/2024 21:10:15;1704658215;68;First
07/01/2024 21:10:15;1704658215;70;Third
07/01/2024 21:10:15;1704658215;75;Second
07/01/2024 21:10:17;1704658217;67;First
07/01/2024 21:10:18;1704658218;70;Third
07/01/2024 21:10:18;1704658218;72;Second
07/01/2024 21:10:19;1704658219;63;First
07/01/2024 21:10:20;1704658220;68;Third
07/01/2024 21:10:20;1704658220;71;Second
07/01/2024 21:10:21;1704658221;66;First
07/01/2024 21:10:21;1704658221;71;Third
07/01/2024 21:10:21;1704658221;73;Second
07/01/2024 21:10:23;1704658223;64;First
07/01/2024 21:10:23;1704658223;67;Third
07/01/2024 21:10:23;1704658223;69;Second
07/01/2024 21:10:25;1704658225;67;First
07/01/2024 21:10:25;1704658225;67;Third
07/01/2024 21:10:25;1704658225;72;Second
07/01/2024 21:10:27;1704658227;66;First
07/01/2024 21:10:27;1704658227;69;Third
07/01/2024 21:10:27;1704658227;74;Second
07/01/2024 21:10:29;1704658229;68;First
07/01/2024 21:10:30;1704658230;73;Second
07/01/2024 21:10:36;1704658236;300;Third
07/01/2024 21:10:38;1704658238;68;First
07/01/2024 21:10:38;1704658238;69;Third
07/01/2024 21:10:38;1704658238;72;Second
07/01/2024 21:10:41;1704658241;70;First
07/01/2024 21:10:41;1704658241;71;Third
07/01/2024 21:10:41;1704658241;73;Second
07/01/2024 21:10:43;1704658243;67;First
07/01/2024 21:10:43;1704658243;68;Third
07/01/2024 21:10:43;1704658243;72;Second
07/01/2024 21:10:45;1704658245;68;First
07/01/2024 21:10:46;1704658246;71;Third
07/01/2024 21:10:46;1704658246;72;Second
07/01/2024 21:10:47;1704658247;65;First
07/01/2024 21:10:48;1704658248;69;Third
07/01/2024 21:10:48;1704658248;70;Second
07/01/2024 21:10:50;1704658250;66;First
07/01/2024 21:10:50;1704658250;66;Third
07/01/2024 21:10:50;1704658250;72;Second
07/01/2024 21:10:52;1704658252;67;First
07/01/2024 21:10:52;1704658252;71;Second
07/01/2024 21:10:52;1704658252;74;Third
07/01/2024 21:10:54;1704658254;66;First
07/01/2024 21:10:54;1704658254;69;Third
07/01/2024 21:10:54;1704658254;73;Second
07/01/2024 21:10:56;1704658256;64;First
07/01/2024 21:10:56;1704658256;73;Second
07/01/2024 21:10:56;1704658256;80;Third
07/01/2024 21:10:59;1704658259;75;First
07/01/2024 21:10:59;1704658259;78;Third
07/01/2024 21:10:59;1704658259;82;Second
07/01/2024 21:11:01;1704658261;65;Third
07/01/2024 21:11:01;1704658261;71;First
07/01/2024 21:11:01;1704658261;71;Second
07/01/2024 21:11:03;1704658263;71;First
07/01/2024 21:11:03;1704658263;72;Third
07/01/2024 21:11:03;1704658263;77;Second
07/01/2024 21:11:06;1704658266;70;First
07/01/2024 21:11:06;1704658266;73;Third
07/01/2024 21:11:06;1704658266;94;Second
07/01/2024 21:11:09;1704658269;66;First
07/01/2024 21:11:10;1704658270;67;Third
07/01/2024 21:11:11;1704658271;101;Second
07/01/2024 21:11:13;1704658273;66;First
07/01/2024 21:11:13;1704658273;69;Second
07/01/2024 21:11:13;1704658273;73;Third
07/01/2024 21:11:15;1704658275;68;First
07/01/2024 21:11:15;1704658275;69;Third
07/01/2024 21:11:15;1704658275;74;Second
07/01/2024 21:11:18;1704658278;72;First
07/01/2024 21:11:18;1704658278;74;Third
07/01/2024 21:11:22;1704658282;300;Second
07/01/2024 21:11:24;1704658284;70;First
07/01/2024 21:11:24;1704658284;74;Second
07/01/2024 21:11:24;1704658284;76;Third
07/01/2024 21:11:26;1704658286;64;First
07/01/2024 21:11:26;1704658286;68;Third
07/01/2024 21:11:26;1704658286;74;Second
07/01/2024 21:11:28;1704658288;66;First
07/01/2024 21:11:28;1704658288;72;Third
07/01/2024 21:11:33;1704658293;300;Second
07/01/2024 21:11:35;1704658295;66;First
07/01/2024 21:11:35;1704658295;69;Second
07/01/2024 21:11:35;1704658295;76;Third
07/01/2024 21:11:36;1704658296;63;First
07/01/2024 21:11:37;1704658297;67;Second
07/01/2024 21:11:37;1704658297;74;Third
07/01/2024 21:11:39;1704658299;71;Second
07/01/2024 21:11:39;1704658299;76;First
07/01/2024 21:11:39;1704658299;81;Third
