{
    "Pedone": {
        "checkpoints": [
            {
                "steps": 1199999,
                "file_path": "results\\CV_BASE_ANGLE_45_2\\Pedone\\Pedone-1199999.onnx",
                "reward": 0.019875957685358384,
                "creation_time": 1702307525.3018465
            },
            {
                "steps": 1299958,
                "file_path": "results\\CV_BASE_ANGLE_45_2\\Pedone\\Pedone-1299958.onnx",
                "reward": 1.7074778477350872,
                "creation_time": 1702307705.7857492
            },
            {
                "steps": 1399995,
                "file_path": "results\\CV_BASE_ANGLE_45_2\\Pedone\\Pedone-1399995.onnx",
                "reward": 5.145649313926697,
                "creation_time": 1702307921.3685343
            },
            {
                "steps": 1499989,
                "file_path": "results\\CV_BASE_ANGLE_45_2\\Pedone\\Pedone-1499989.onnx",
                "reward": 4.11631341233398,
                "creation_time": 1702308097.5970166
            },
            {
                "steps": 1599977,
                "file_path": "results\\CV_BASE_ANGLE_45_2\\Pedone\\Pedone-1599977.onnx",
                "reward": null,
                "creation_time": 1702308266.101263
            },
            {
                "steps": 1699967,
                "file_path": "results\\CV_BASE_ANGLE_45_2\\Pedone\\Pedone-1699967.onnx",
                "reward": 3.949996747289385,
                "creation_time": 1702308431.5510457
            },
            {
                "steps": 1799971,
                "file_path": "results\\CV_BASE_ANGLE_45_2\\Pedone\\Pedone-1799971.onnx",
                "reward": 2.7094213702739816,
                "creation_time": 1702308597.1454306
            },
            {
                "steps": 1899984,
                "file_path": "results\\CV_BASE_ANGLE_45_2\\Pedone\\Pedone-1899984.onnx",
                "reward": 3.484366257985433,
                "creation_time": 1702308769.831762
            },
            {
                "steps": 1999979,
                "file_path": "results\\CV_BASE_ANGLE_45_2\\Pedone\\Pedone-1999979.onnx",
                "reward": 5.811716077228387,
                "creation_time": 1702308982.7023993
            },
            {
                "steps": 2041299,
                "file_path": "results\\CV_BASE_ANGLE_45_2\\Pedone\\Pedone-2041299.onnx",
                "reward": 11.29724525863474,
                "creation_time": 1702309150.7692542
            }
        ],
        "final_checkpoint": {
            "steps": 2041299,
            "file_path": "results\\CV_BASE_ANGLE_45_2\\Pedone.onnx",
            "reward": 11.29724525863474,
            "creation_time": 1702309150.7692542
        }
    },
    "metadata": {
        "stats_format_version": "0.2.0",
        "mlagents_version": "0.25.0",
        "torch_version": "1.7.1+cpu"
    }
}