{
    "Pedone": {
        "checkpoints": [
            {
                "steps": 2099970,
                "file_path": "results\\CV_BASE_DEFINITIVO\\Pedone\\Pedone-2099970.onnx",
                "reward": 3.1659119725227356,
                "creation_time": 1702405572.0309546
            },
            {
                "steps": 2199992,
                "file_path": "results\\CV_BASE_DEFINITIVO\\Pedone\\Pedone-2199992.onnx",
                "reward": 3.832675853236155,
                "creation_time": 1702405728.969758
            },
            {
                "steps": 2299989,
                "file_path": "results\\CV_BASE_DEFINITIVO\\Pedone\\Pedone-2299989.onnx",
                "reward": 3.064152240753174,
                "creation_time": 1702405961.1115596
            },
            {
                "steps": 2399998,
                "file_path": "results\\CV_BASE_DEFINITIVO\\Pedone\\Pedone-2399998.onnx",
                "reward": 4.819871694372411,
                "creation_time": 1702406115.6357334
            },
            {
                "steps": 2499977,
                "file_path": "results\\CV_BASE_DEFINITIVO\\Pedone\\Pedone-2499977.onnx",
                "reward": 4.1313168503946125,
                "creation_time": 1702406270.9265437
            },
            {
                "steps": 2599971,
                "file_path": "results\\CV_BASE_DEFINITIVO\\Pedone\\Pedone-2599971.onnx",
                "reward": 4.026271181447165,
                "creation_time": 1702406427.4837677
            },
            {
                "steps": 2699973,
                "file_path": "results\\CV_BASE_DEFINITIVO\\Pedone\\Pedone-2699973.onnx",
                "reward": 4.826791732309146,
                "creation_time": 1702406581.7980106
            },
            {
                "steps": 2799993,
                "file_path": "results\\CV_BASE_DEFINITIVO\\Pedone\\Pedone-2799993.onnx",
                "reward": 4.444799714929918,
                "creation_time": 1702406741.1284363
            },
            {
                "steps": 2899941,
                "file_path": "results\\CV_BASE_DEFINITIVO\\Pedone\\Pedone-2899941.onnx",
                "reward": 15.145366774664986,
                "creation_time": 1702407038.127189
            },
            {
                "steps": 2900835,
                "file_path": "results\\CV_BASE_DEFINITIVO\\Pedone\\Pedone-2900835.onnx",
                "reward": 14.901453912258148,
                "creation_time": 1702407041.5458815
            }
        ],
        "final_checkpoint": {
            "steps": 2900835,
            "file_path": "results\\CV_BASE_DEFINITIVO\\Pedone.onnx",
            "reward": 14.901453912258148,
            "creation_time": 1702407041.5458815
        }
    },
    "metadata": {
        "stats_format_version": "0.2.0",
        "mlagents_version": "0.25.0",
        "torch_version": "1.7.1+cpu"
    }
}