07/01/2024 19:34:30;1704652470;32952;2;5,99535
07/01/2024 19:34:30;1704652470;32967;6;3,479549
07/01/2024 19:34:31;1704652471;32982;6;5,223501
07/01/2024 19:34:31;1704652471;32996;6;4,473134
07/01/2024 19:34:32;1704652472;33011;6;5,150966
07/01/2024 19:34:32;1704652472;33026;6;3,151701
07/01/2024 19:34:33;1704652473;33041;6;4,651367
07/01/2024 19:34:33;1704652473;33055;6;4,5679
07/01/2024 19:34:34;1704652474;33069;6;5,30865
07/01/2024 19:34:34;1704652474;33084;6;3,2342
07/01/2024 19:34:35;1704652475;33098;6;5,477067
07/01/2024 19:34:35;1704652475;33114;6;4,896118
07/01/2024 19:34:36;1704652476;33129;6;4,730384
07/01/2024 19:34:36;1704652476;33147;6;3,480232
07/01/2024 19:34:37;1704652477;33161;6;5,057784
07/01/2024 19:34:37;1704652477;33176;6;3,153416
07/01/2024 19:34:38;1704652478;33189;6;4,724317
07/01/2024 19:34:38;1704652478;33204;6;3,229666
07/01/2024 19:34:39;1704652479;33218;6;3,32165
07/01/2024 19:34:39;1704652479;33232;6;4,562968
07/01/2024 19:34:40;1704652480;33245;6;6,1424
07/01/2024 19:34:40;1704652480;33260;6;5,2306
07/01/2024 19:34:41;1704652481;33273;6;5,3972
07/01/2024 19:34:41;1704652481;33285;6;2,969116
07/01/2024 19:34:42;1704652482;33302;6;2,7352
07/01/2024 19:34:42;1704652482;33315;6;5,312617
07/01/2024 19:34:43;1704652483;33329;6;4,396334
07/01/2024 19:34:43;1704652483;33343;6;5,152217
07/01/2024 19:34:44;1704652484;33356;6;5,644683
07/01/2024 19:34:48;1704652488;33656;6;-81,28998
07/01/2024 19:34:53;1704652493;33955;6;-82,28931
07/01/2024 19:34:53;1704652493;33970;6;3,730816
07/01/2024 19:34:54;1704652494;33986;6;1,137532
07/01/2024 19:34:54;1704652494;34001;6;2,900182
07/01/2024 19:34:55;1704652495;34015;6;4,4004
07/01/2024 19:34:55;1704652495;34029;6;4,892
07/01/2024 19:34:56;1704652496;34044;6;3,313951
07/01/2024 19:34:57;1704652497;34060;6;4,319565
07/01/2024 19:34:57;1704652497;34077;6;0,4008648
07/01/2024 19:34:58;1704652498;34095;6;0,978282
07/01/2024 19:34:58;1704652498;34108;6;5,7213
07/01/2024 19:34:59;1704652499;34122;6;5,22775
07/01/2024 19:35:00;1704652500;34137;6;3,224951
07/01/2024 19:35:00;1704652500;34151;6;3,308716
07/01/2024 19:35:01;1704652501;34166;6;5,0654
07/01/2024 19:35:01;1704652501;34179;6;5,130549
07/01/2024 19:35:02;1704652502;34193;6;5,0724
07/01/2024 19:35:02;1704652502;34208;6;2,734867
07/01/2024 19:35:03;1704652503;34222;6;3,900351
07/01/2024 19:35:03;1704652503;34236;6;2,817382
07/01/2024 19:35:04;1704652504;34250;6;4,398983
07/01/2024 19:35:04;1704652504;34265;6;3,816184
07/01/2024 19:35:05;1704652505;34278;6;2,644416
07/01/2024 19:35:05;1704652505;34293;6;4,731884
07/01/2024 19:35:06;1704652506;34308;6;4,486684
07/01/2024 19:35:06;1704652506;34322;6;3,894234
07/01/2024 19:35:07;1704652507;34336;6;4,563485
07/01/2024 19:35:07;1704652507;34351;6;2,894466
07/01/2024 19:35:08;1704652508;34366;6;4,397352
07/01/2024 19:35:09;1704652509;34383;6;-0,01543506
07/01/2024 19:35:09;1704652509;34398;6;5,236067
07/01/2024 19:35:10;1704652510;34412;6;4,556267
07/01/2024 19:35:10;1704652510;34426;6;4,9002
07/01/2024 19:35:11;1704652511;34441;6;5,650433
07/01/2024 19:35:11;1704652511;34456;6;5,226067
07/01/2024 19:35:12;1704652512;34471;6;2,894483
07/01/2024 19:35:12;1704652512;34486;6;3,058083
07/01/2024 19:35:13;1704652513;34502;6;3,730333
07/01/2024 19:35:13;1704652513;34517;6;4,399568
07/01/2024 19:35:14;1704652514;34532;6;2,901583
07/01/2024 19:35:14;1704652514;34547;6;5,480166
07/01/2024 19:35:15;1704652515;34564;6;2,397633
07/01/2024 19:35:15;1704652515;34578;6;4,314683
07/01/2024 19:35:16;1704652516;34592;6;3,727218
07/01/2024 19:35:16;1704652516;34606;6;3,900151
07/01/2024 19:35:17;1704652517;34621;6;3,065498
07/01/2024 19:35:18;1704652518;34636;6;3,059735
07/01/2024 19:35:18;1704652518;34651;6;4,226784
07/01/2024 19:35:19;1704652519;34667;6;4,5684
07/01/2024 19:35:19;1704652519;34684;6;3,234467
07/01/2024 19:35:20;1704652520;34698;6;4,146184
07/01/2024 19:35:20;1704652520;34713;6;4,732749
07/01/2024 19:35:21;1704652521;34729;6;2,725833
07/01/2024 19:35:22;1704652522;34743;6;5,057551
07/01/2024 19:35:22;1704652522;34757;6;3,142233
07/01/2024 19:35:23;1704652523;34774;6;0,3977977
07/01/2024 19:35:24;1704652524;34787;6;5,396782
07/01/2024 19:35:24;1704652524;34801;6;5,562666
07/01/2024 19:35:25;1704652525;34816;6;4,734717
07/01/2024 19:35:25;1704652525;34830;6;3,317783
07/01/2024 19:35:26;1704652526;34845;6;3,475899
07/01/2024 19:35:26;1704652526;34859;6;4,0686
07/01/2024 19:35:27;1704652527;34875;6;3,401833
07/01/2024 19:35:27;1704652527;34889;6;4,477735
07/01/2024 19:35:28;1704652528;34905;6;2,731783
07/01/2024 19:35:28;1704652528;34919;6;4,47705
07/01/2024 19:35:29;1704652529;34934;6;5,39415
07/01/2024 19:35:29;1704652529;34947;6;4,639534
07/01/2024 19:35:30;1704652530;34963;6;3,310666
07/01/2024 19:35:30;1704652530;34978;6;5,309751
