07/01/2024 23:21:42;1704666102;0;First
07/01/2024 23:21:42;1704666102;0;First
07/01/2024 23:21:42;1704666102;0;Second
07/01/2024 23:21:42;1704666102;0;Second
07/01/2024 23:21:43;1704666103;10;Second
07/01/2024 23:21:43;1704666103;10;First
07/01/2024 23:21:43;1704666103;12;First
07/01/2024 23:21:43;1704666103;12;Second
07/01/2024 23:21:43;1704666103;11;Second
07/01/2024 23:21:43;1704666103;12;First
07/01/2024 23:21:43;1704666103;13;First
07/01/2024 23:21:43;1704666103;14;Second
07/01/2024 23:21:44;1704666104;11;Second
07/01/2024 23:21:44;1704666104;11;First
07/01/2024 23:21:44;1704666104;12;Second
07/01/2024 23:21:44;1704666104;13;First
07/01/2024 23:21:44;1704666104;11;Second
07/01/2024 23:21:44;1704666104;11;First
07/01/2024 23:21:44;1704666104;12;First
07/01/2024 23:21:44;1704666104;13;Second
07/01/2024 23:21:45;1704666105;11;Second
07/01/2024 23:21:45;1704666105;13;First
07/01/2024 23:21:45;1704666105;14;Second
07/01/2024 23:21:45;1704666105;15;First
07/01/2024 23:21:46;1704666106;11;Second
07/01/2024 23:21:46;1704666106;13;First
07/01/2024 23:21:46;1704666106;14;Second
07/01/2024 23:21:46;1704666106;15;First
07/01/2024 23:21:46;1704666106;11;First
07/01/2024 23:21:46;1704666106;11;Second
07/01/2024 23:21:46;1704666106;13;First
07/01/2024 23:21:46;1704666106;14;Second
07/01/2024 23:21:46;1704666106;11;Second
07/01/2024 23:21:46;1704666106;12;First
07/01/2024 23:21:46;1704666106;13;Second
07/01/2024 23:21:46;1704666106;13;First
07/01/2024 23:21:47;1704666107;10;First
07/01/2024 23:21:47;1704666107;11;Second
07/01/2024 23:21:47;1704666107;13;First
07/01/2024 23:21:47;1704666107;13;Second
07/01/2024 23:21:47;1704666107;11;Second
07/01/2024 23:21:47;1704666107;12;First
07/01/2024 23:21:47;1704666107;13;Second
07/01/2024 23:21:47;1704666107;14;First
07/01/2024 23:21:48;1704666108;11;Second
07/01/2024 23:21:48;1704666108;11;First
07/01/2024 23:21:48;1704666108;12;Second
07/01/2024 23:21:48;1704666108;13;First
07/01/2024 23:21:48;1704666108;11;Second
07/01/2024 23:21:48;1704666108;12;First
07/01/2024 23:21:48;1704666108;13;Second
07/01/2024 23:21:48;1704666108;13;First
07/01/2024 23:21:48;1704666108;11;Second
07/01/2024 23:21:48;1704666108;11;First
07/01/2024 23:21:48;1704666108;12;Second
07/01/2024 23:21:48;1704666108;13;First
07/01/2024 23:21:49;1704666109;10;First
07/01/2024 23:21:49;1704666109;11;Second
07/01/2024 23:21:49;1704666109;12;First
07/01/2024 23:21:49;1704666109;13;Second
07/01/2024 23:21:49;1704666109;10;First
07/01/2024 23:21:49;1704666109;11;Second
07/01/2024 23:21:49;1704666109;12;First
07/01/2024 23:21:49;1704666109;13;Second
07/01/2024 23:21:50;1704666110;10;Second
07/01/2024 23:21:50;1704666110;10;First
07/01/2024 23:21:50;1704666110;12;First
07/01/2024 23:21:50;1704666110;13;Second
07/01/2024 23:21:50;1704666110;11;First
07/01/2024 23:21:50;1704666110;11;Second
07/01/2024 23:21:50;1704666110;12;First
07/01/2024 23:21:50;1704666110;13;Second
07/01/2024 23:21:51;1704666111;12;First
07/01/2024 23:21:51;1704666111;13;Second
07/01/2024 23:21:51;1704666111;13;First
07/01/2024 23:21:51;1704666111;14;Second
07/01/2024 23:21:51;1704666111;10;First
07/01/2024 23:21:51;1704666111;11;Second
07/01/2024 23:21:51;1704666111;12;First
07/01/2024 23:21:51;1704666111;13;Second
07/01/2024 23:21:52;1704666112;13;Second
07/01/2024 23:21:52;1704666112;16;First
07/01/2024 23:21:52;1704666112;18;First
07/01/2024 23:21:52;1704666112;19;Second
07/01/2024 23:21:52;1704666112;11;Second
07/01/2024 23:21:52;1704666112;11;First
07/01/2024 23:21:52;1704666112;12;Second
07/01/2024 23:21:52;1704666112;12;First
07/01/2024 23:21:52;1704666112;11;First
07/01/2024 23:21:52;1704666112;12;Second
07/01/2024 23:21:53;1704666113;12;First
07/01/2024 23:21:53;1704666113;13;Second
07/01/2024 23:21:53;1704666113;11;First
07/01/2024 23:21:53;1704666113;13;Second
07/01/2024 23:21:53;1704666113;13;First
07/01/2024 23:21:53;1704666113;14;Second
07/01/2024 23:21:54;1704666114;11;First
07/01/2024 23:21:54;1704666114;12;First
07/01/2024 23:21:54;1704666114;12;Second
07/01/2024 23:21:54;1704666114;14;Second
07/01/2024 23:21:54;1704666114;11;Second
07/01/2024 23:21:54;1704666114;11;First
07/01/2024 23:21:54;1704666114;13;Second
07/01/2024 23:21:54;1704666114;14;First
07/01/2024 23:21:54;1704666114;10;Second
07/01/2024 23:21:54;1704666114;10;First
07/01/2024 23:21:54;1704666114;12;First
07/01/2024 23:21:54;1704666114;13;Second
07/01/2024 23:21:55;1704666115;11;First
07/01/2024 23:21:55;1704666115;12;Second
07/01/2024 23:21:55;1704666115;13;Second
07/01/2024 23:21:55;1704666115;13;First
07/01/2024 23:21:55;1704666115;10;Second
07/01/2024 23:21:55;1704666115;11;First
07/01/2024 23:21:55;1704666115;12;First
07/01/2024 23:21:55;1704666115;13;Second
07/01/2024 23:21:55;1704666115;11;First
07/01/2024 23:21:56;1704666116;12;Second
07/01/2024 23:21:56;1704666116;13;First
07/01/2024 23:21:56;1704666116;14;Second
07/01/2024 23:21:56;1704666116;10;Second
07/01/2024 23:21:56;1704666116;11;First
07/01/2024 23:21:56;1704666116;13;Second
07/01/2024 23:21:56;1704666116;13;First
07/01/2024 23:21:56;1704666116;11;Second
07/01/2024 23:21:56;1704666116;11;First
07/01/2024 23:21:56;1704666116;13;Second
07/01/2024 23:21:56;1704666116;13;First
07/01/2024 23:21:57;1704666117;11;Second
07/01/2024 23:21:57;1704666117;11;First
07/01/2024 23:21:57;1704666117;12;Second
07/01/2024 23:21:57;1704666117;13;First
07/01/2024 23:21:57;1704666117;11;Second
07/01/2024 23:21:57;1704666117;12;First
07/01/2024 23:21:57;1704666117;13;Second
07/01/2024 23:21:57;1704666117;13;First
07/01/2024 23:21:58;1704666118;12;Second
07/01/2024 23:21:58;1704666118;13;First
07/01/2024 23:21:58;1704666118;13;Second
07/01/2024 23:21:58;1704666118;14;First
07/01/2024 23:21:58;1704666118;12;Second
07/01/2024 23:21:58;1704666118;12;First
07/01/2024 23:21:58;1704666118;13;Second
07/01/2024 23:21:58;1704666118;14;First
07/01/2024 23:21:58;1704666118;11;First
07/01/2024 23:21:58;1704666118;12;Second
07/01/2024 23:21:59;1704666119;13;Second
07/01/2024 23:21:59;1704666119;13;First
07/01/2024 23:21:59;1704666119;12;First
07/01/2024 23:21:59;1704666119;12;Second
07/01/2024 23:21:59;1704666119;13;First
07/01/2024 23:21:59;1704666119;13;Second
07/01/2024 23:21:59;1704666119;11;Second
07/01/2024 23:21:59;1704666119;12;First
07/01/2024 23:21:59;1704666119;13;First
07/01/2024 23:21:59;1704666119;14;Second
07/01/2024 23:22:00;1704666120;11;Second
07/01/2024 23:22:00;1704666120;12;First
07/01/2024 23:22:00;1704666120;13;Second
07/01/2024 23:22:00;1704666120;14;First
07/01/2024 23:22:00;1704666120;10;First
07/01/2024 23:22:00;1704666120;11;Second
07/01/2024 23:22:00;1704666120;12;First
07/01/2024 23:22:00;1704666120;13;Second
07/01/2024 23:22:01;1704666121;11;Second
07/01/2024 23:22:01;1704666121;12;First
07/01/2024 23:22:01;1704666121;14;Second
07/01/2024 23:22:01;1704666121;14;First
07/01/2024 23:22:01;1704666121;10;First
07/01/2024 23:22:01;1704666121;11;Second
07/01/2024 23:22:01;1704666121;12;First
07/01/2024 23:22:01;1704666121;12;Second
07/01/2024 23:22:01;1704666121;10;First
07/01/2024 23:22:01;1704666121;11;Second
07/01/2024 23:22:01;1704666121;12;First
07/01/2024 23:22:01;1704666121;13;Second
07/01/2024 23:22:02;1704666122;10;First
07/01/2024 23:22:02;1704666122;10;Second
07/01/2024 23:22:02;1704666122;11;Second
07/01/2024 23:22:02;1704666122;13;First
07/01/2024 23:22:02;1704666122;10;First
07/01/2024 23:22:02;1704666122;11;Second
07/01/2024 23:22:02;1704666122;12;First
07/01/2024 23:22:02;1704666122;12;Second
07/01/2024 23:22:03;1704666123;11;First
07/01/2024 23:22:03;1704666123;12;Second
07/01/2024 23:22:03;1704666123;13;First
07/01/2024 23:22:03;1704666123;14;Second
07/01/2024 23:22:03;1704666123;10;First
07/01/2024 23:22:03;1704666123;10;Second
07/01/2024 23:22:03;1704666123;11;First
07/01/2024 23:22:03;1704666123;12;Second
07/01/2024 23:22:03;1704666123;12;First
07/01/2024 23:22:03;1704666123;12;Second
07/01/2024 23:22:03;1704666123;13;First
07/01/2024 23:22:03;1704666123;14;Second
07/01/2024 23:22:04;1704666124;12;First
07/01/2024 23:22:04;1704666124;12;Second
07/01/2024 23:22:04;1704666124;13;Second
07/01/2024 23:22:04;1704666124;14;First
07/01/2024 23:22:04;1704666124;11;Second
07/01/2024 23:22:04;1704666124;12;First
07/01/2024 23:22:04;1704666124;12;Second
07/01/2024 23:22:04;1704666124;13;First
07/01/2024 23:22:05;1704666125;10;Second
07/01/2024 23:22:05;1704666125;11;First
07/01/2024 23:22:05;1704666125;12;Second
07/01/2024 23:22:05;1704666125;13;First
07/01/2024 23:22:05;1704666125;10;Second
07/01/2024 23:22:05;1704666125;10;First
07/01/2024 23:22:05;1704666125;12;First
07/01/2024 23:22:05;1704666125;13;Second
07/01/2024 23:22:06;1704666126;12;Second
07/01/2024 23:22:06;1704666126;12;First
07/01/2024 23:22:06;1704666126;13;Second
07/01/2024 23:22:06;1704666126;14;First
07/01/2024 23:22:06;1704666126;11;First
07/01/2024 23:22:06;1704666126;11;Second
07/01/2024 23:22:06;1704666126;12;Second
07/01/2024 23:22:06;1704666126;13;First
07/01/2024 23:22:07;1704666127;10;First
07/01/2024 23:22:07;1704666127;12;Second
07/01/2024 23:22:07;1704666127;13;Second
07/01/2024 23:22:07;1704666127;14;First
07/01/2024 23:22:07;1704666127;10;First
07/01/2024 23:22:07;1704666127;11;Second
07/01/2024 23:22:07;1704666127;12;First
07/01/2024 23:22:07;1704666127;13;Second
07/01/2024 23:22:08;1704666128;11;First
07/01/2024 23:22:08;1704666128;11;Second
07/01/2024 23:22:08;1704666128;12;First
07/01/2024 23:22:08;1704666128;12;Second
07/01/2024 23:22:08;1704666128;10;First
07/01/2024 23:22:08;1704666128;11;Second
07/01/2024 23:22:08;1704666128;13;Second
07/01/2024 23:22:08;1704666128;13;First
07/01/2024 23:22:08;1704666128;12;Second
07/01/2024 23:22:08;1704666128;12;First
07/01/2024 23:22:08;1704666128;13;First
07/01/2024 23:22:08;1704666128;14;Second
07/01/2024 23:22:09;1704666129;11;First
07/01/2024 23:22:09;1704666129;11;Second
07/01/2024 23:22:09;1704666129;12;Second
07/01/2024 23:22:09;1704666129;13;First
07/01/2024 23:22:09;1704666129;10;Second
07/01/2024 23:22:09;1704666129;10;First
07/01/2024 23:22:09;1704666129;12;First
07/01/2024 23:22:09;1704666129;12;Second
07/01/2024 23:22:09;1704666129;11;First
07/01/2024 23:22:09;1704666129;12;Second
07/01/2024 23:22:10;1704666130;13;Second
07/01/2024 23:22:10;1704666130;13;First
07/01/2024 23:22:10;1704666130;12;First
07/01/2024 23:22:10;1704666130;12;Second
07/01/2024 23:22:10;1704666130;13;First
07/01/2024 23:22:10;1704666130;13;Second
07/01/2024 23:22:10;1704666130;11;Second
07/01/2024 23:22:10;1704666130;12;First
07/01/2024 23:22:10;1704666130;13;Second
07/01/2024 23:22:10;1704666130;13;First
07/01/2024 23:22:11;1704666131;11;Second
07/01/2024 23:22:11;1704666131;12;First
07/01/2024 23:22:11;1704666131;13;Second
07/01/2024 23:22:11;1704666131;14;First
07/01/2024 23:22:11;1704666131;11;Second
07/01/2024 23:22:11;1704666131;11;First
07/01/2024 23:22:11;1704666131;12;Second
07/01/2024 23:22:11;1704666131;13;First
07/01/2024 23:22:12;1704666132;10;First
07/01/2024 23:22:12;1704666132;11;Second
07/01/2024 23:22:12;1704666132;12;Second
07/01/2024 23:22:12;1704666132;12;First
07/01/2024 23:22:12;1704666132;11;Second
07/01/2024 23:22:12;1704666132;12;First
07/01/2024 23:22:12;1704666132;12;Second
07/01/2024 23:22:12;1704666132;13;First
07/01/2024 23:22:13;1704666133;11;Second
07/01/2024 23:22:13;1704666133;12;First
07/01/2024 23:22:13;1704666133;13;Second
07/01/2024 23:22:13;1704666133;13;First
07/01/2024 23:22:13;1704666133;11;First
07/01/2024 23:22:13;1704666133;11;Second
07/01/2024 23:22:13;1704666133;13;Second
07/01/2024 23:22:13;1704666133;13;First
07/01/2024 23:22:14;1704666134;12;Second
07/01/2024 23:22:14;1704666134;15;Second
07/01/2024 23:22:14;1704666134;15;First
07/01/2024 23:22:14;1704666134;17;First
07/01/2024 23:22:14;1704666134;10;Second
07/01/2024 23:22:14;1704666134;11;First
07/01/2024 23:22:14;1704666134;12;Second
07/01/2024 23:22:14;1704666134;13;First
07/01/2024 23:22:14;1704666134;12;Second
07/01/2024 23:22:14;1704666134;13;First
07/01/2024 23:22:14;1704666134;14;Second
07/01/2024 23:22:15;1704666135;14;First
07/01/2024 23:22:15;1704666135;11;Second
07/01/2024 23:22:15;1704666135;12;First
07/01/2024 23:22:15;1704666135;13;Second
07/01/2024 23:22:15;1704666135;14;First
07/01/2024 23:22:15;1704666135;11;Second
07/01/2024 23:22:15;1704666135;12;Second
07/01/2024 23:22:15;1704666135;13;First
07/01/2024 23:22:15;1704666135;13;First
07/01/2024 23:22:16;1704666136;11;Second
07/01/2024 23:22:16;1704666136;11;First
07/01/2024 23:22:16;1704666136;13;Second
07/01/2024 23:22:16;1704666136;13;First
07/01/2024 23:22:16;1704666136;11;First
07/01/2024 23:22:16;1704666136;11;Second
07/01/2024 23:22:16;1704666136;12;First
07/01/2024 23:22:16;1704666136;12;Second
07/01/2024 23:22:17;1704666137;11;Second
07/01/2024 23:22:17;1704666137;13;First
07/01/2024 23:22:17;1704666137;13;Second
07/01/2024 23:22:17;1704666137;14;First
07/01/2024 23:22:17;1704666137;11;Second
07/01/2024 23:22:17;1704666137;12;First
07/01/2024 23:22:17;1704666137;13;Second
07/01/2024 23:22:17;1704666137;15;First
07/01/2024 23:22:18;1704666138;10;Second
07/01/2024 23:22:18;1704666138;11;First
07/01/2024 23:22:18;1704666138;12;Second
07/01/2024 23:22:18;1704666138;12;First
07/01/2024 23:22:18;1704666138;10;Second
07/01/2024 23:22:18;1704666138;11;First
07/01/2024 23:22:18;1704666138;13;Second
07/01/2024 23:22:18;1704666138;13;First
07/01/2024 23:22:18;1704666138;12;First
07/01/2024 23:22:19;1704666139;12;Second
07/01/2024 23:22:19;1704666139;13;Second
07/01/2024 23:22:19;1704666139;14;First
07/01/2024 23:22:19;1704666139;11;First
07/01/2024 23:22:19;1704666139;11;Second
07/01/2024 23:22:19;1704666139;13;First
07/01/2024 23:22:19;1704666139;13;Second
07/01/2024 23:22:19;1704666139;11;First
07/01/2024 23:22:19;1704666139;11;Second
07/01/2024 23:22:20;1704666140;12;Second
07/01/2024 23:22:20;1704666140;13;First
07/01/2024 23:22:20;1704666140;11;First
07/01/2024 23:22:20;1704666140;11;Second
07/01/2024 23:22:20;1704666140;13;First
07/01/2024 23:22:20;1704666140;13;Second
07/01/2024 23:22:20;1704666140;11;First
07/01/2024 23:22:20;1704666140;12;Second
07/01/2024 23:22:20;1704666140;13;Second
07/01/2024 23:22:20;1704666140;13;First
07/01/2024 23:22:21;1704666141;11;First
07/01/2024 23:22:21;1704666141;12;Second
07/01/2024 23:22:21;1704666141;12;Second
07/01/2024 23:22:21;1704666141;14;First
07/01/2024 23:22:21;1704666141;10;First
07/01/2024 23:22:21;1704666141;11;Second
07/01/2024 23:22:22;1704666142;12;First
07/01/2024 23:22:22;1704666142;13;Second
07/01/2024 23:22:22;1704666142;12;Second
07/01/2024 23:22:22;1704666142;13;First
07/01/2024 23:22:22;1704666142;13;First
07/01/2024 23:22:22;1704666142;13;Second
07/01/2024 23:22:23;1704666143;11;Second
07/01/2024 23:22:23;1704666143;11;First
07/01/2024 23:22:23;1704666143;13;First
07/01/2024 23:22:23;1704666143;13;Second
07/01/2024 23:22:23;1704666143;11;Second
07/01/2024 23:22:23;1704666143;12;First
07/01/2024 23:22:23;1704666143;13;First
07/01/2024 23:22:23;1704666143;14;Second
07/01/2024 23:22:23;1704666143;11;Second
07/01/2024 23:22:23;1704666143;11;First
07/01/2024 23:22:24;1704666144;13;Second
07/01/2024 23:22:24;1704666144;13;First
07/01/2024 23:22:24;1704666144;11;First
07/01/2024 23:22:24;1704666144;12;Second
07/01/2024 23:22:24;1704666144;13;Second
07/01/2024 23:22:24;1704666144;13;First
07/01/2024 23:22:24;1704666144;12;Second
07/01/2024 23:22:24;1704666144;12;First
07/01/2024 23:22:24;1704666144;13;First
07/01/2024 23:22:24;1704666144;14;Second
07/01/2024 23:22:25;1704666145;10;First
07/01/2024 23:22:25;1704666145;11;Second
07/01/2024 23:22:25;1704666145;12;Second
07/01/2024 23:22:25;1704666145;13;First
07/01/2024 23:22:25;1704666145;12;Second
07/01/2024 23:22:25;1704666145;12;First
07/01/2024 23:22:25;1704666145;13;First
07/01/2024 23:22:25;1704666145;14;Second
07/01/2024 23:22:26;1704666146;11;First
07/01/2024 23:22:26;1704666146;12;Second
07/01/2024 23:22:26;1704666146;13;Second
07/01/2024 23:22:26;1704666146;13;First
07/01/2024 23:22:26;1704666146;11;Second
07/01/2024 23:22:26;1704666146;11;First
07/01/2024 23:22:26;1704666146;13;Second
07/01/2024 23:22:26;1704666146;13;First
07/01/2024 23:22:26;1704666146;11;First
07/01/2024 23:22:26;1704666146;12;Second
07/01/2024 23:22:26;1704666146;12;Second
07/01/2024 23:22:26;1704666146;13;First
07/01/2024 23:22:27;1704666147;11;Second
07/01/2024 23:22:27;1704666147;13;First
07/01/2024 23:22:27;1704666147;13;Second
07/01/2024 23:22:27;1704666147;15;First
