07/01/2024 19:42:01;1704652921;14402;3;-0,3181302
07/01/2024 19:42:02;1704652922;14424;13;3,020786
07/01/2024 19:42:03;1704652923;14441;13;4,551961
07/01/2024 19:42:04;1704652924;14463;13;4,172808
07/01/2024 19:42:04;1704652924;14483;13;4,983415
07/01/2024 19:42:05;1704652925;14504;13;4,596676
07/01/2024 19:42:06;1704652926;14524;13;5,481592
07/01/2024 19:42:07;1704652927;14541;13;4,903531
07/01/2024 19:42:08;1704652928;14561;13;4,829731
07/01/2024 19:42:08;1704652928;14580;13;4,856954
07/01/2024 19:42:09;1704652929;14602;13;5,671723
07/01/2024 19:42:10;1704652930;14624;13;5,286615
07/01/2024 19:42:11;1704652931;14645;13;5,781785
07/01/2024 19:42:12;1704652932;14665;13;5,630754
07/01/2024 19:42:13;1704652933;14686;13;4,592808
07/01/2024 19:42:13;1704652933;14704;13;5,759285
07/01/2024 19:42:14;1704652934;14726;13;5,5972
07/01/2024 19:42:15;1704652935;14745;13;4,215561
07/01/2024 19:42:16;1704652936;14763;13;5,6576
07/01/2024 19:42:16;1704652936;14781;13;4,210908
07/01/2024 19:42:17;1704652937;14798;13;3,739469
07/01/2024 19:42:18;1704652938;14818;13;4,862369
07/01/2024 19:42:19;1704652939;14837;13;5,662738
07/01/2024 19:42:20;1704652940;14856;13;4,32563
07/01/2024 19:42:20;1704652940;14873;13;5,2459
07/01/2024 19:42:21;1704652941;14892;13;5,250353
07/01/2024 19:42:22;1704652942;14909;13;3,856892
07/01/2024 19:42:23;1704652943;14929;13;5,4859
07/01/2024 19:42:24;1704652944;14948;13;4,785892
07/01/2024 19:42:24;1704652944;14966;13;4,354031
07/01/2024 19:42:25;1704652945;14985;13;4,825708
07/01/2024 19:42:26;1704652946;15004;13;5,3242
07/01/2024 19:42:27;1704652947;15024;13;5,205962
07/01/2024 19:42:28;1704652948;15047;13;3,281206
07/01/2024 19:42:29;1704652949;15067;13;5,361984
07/01/2024 19:42:30;1704652950;15089;13;3,582291
07/01/2024 19:42:31;1704652951;15106;13;4,593907
07/01/2024 19:42:31;1704652951;15126;13;4,980507
07/01/2024 19:42:32;1704652952;15146;13;4,243216
07/01/2024 19:42:33;1704652953;15166;13;4,518615
07/01/2024 19:42:34;1704652954;15187;13;5,173992
07/01/2024 19:42:35;1704652955;15209;13;2,135706
07/01/2024 19:42:36;1704652956;15227;13;5,440539
07/01/2024 19:42:37;1704652957;15248;13;4,671277
07/01/2024 19:42:38;1704652958;15268;13;4,431407
07/01/2024 19:42:38;1704652958;15288;13;5,560576
07/01/2024 19:42:39;1704652959;15308;13;4,929077
07/01/2024 19:42:40;1704652960;15328;13;5,901746
07/01/2024 19:42:41;1704652961;15348;13;4,741792
07/01/2024 19:42:42;1704652962;15369;13;4,180484
07/01/2024 19:42:43;1704652963;15390;13;5,597245
07/01/2024 19:42:43;1704652963;15411;13;5,873977
07/01/2024 19:42:44;1704652964;15429;13;4,906937
07/01/2024 19:42:45;1704652965;15449;13;5,557115
07/01/2024 19:42:46;1704652966;15471;13;5,872553
07/01/2024 19:42:47;1704652967;15490;13;5,096723
07/01/2024 19:42:47;1704652967;15508;13;5,007246
07/01/2024 19:42:49;1704652969;15553;13;1,046528
07/01/2024 19:42:50;1704652970;15574;13;4,828532
07/01/2024 19:42:51;1704652971;15598;13;5,752685
07/01/2024 19:42:51;1704652971;15617;13;4,28313
07/01/2024 19:42:52;1704652972;15637;13;4,8232
07/01/2024 19:42:53;1704652973;15657;13;5,201307
07/01/2024 19:42:54;1704652974;15674;13;2,290869
07/01/2024 19:42:55;1704652975;15694;13;4,779907
07/01/2024 19:42:56;1704652976;15717;13;5,407807
07/01/2024 19:42:57;1704652977;15735;13;3,89733
07/01/2024 19:42:57;1704652977;15756;13;4,250476
07/01/2024 19:42:58;1704652978;15776;13;5,327316
07/01/2024 19:42:59;1704652979;15795;13;4,123916
07/01/2024 19:43:00;1704652980;15814;13;5,866969
07/01/2024 19:43:01;1704652981;15834;13;5,060369
07/01/2024 19:43:02;1704652982;15857;13;3,794392
07/01/2024 19:43:02;1704652982;15876;13;5,094938
07/01/2024 19:43:03;1704652983;15897;13;5,405077
07/01/2024 19:43:04;1704652984;15919;13;5,445538
07/01/2024 19:43:05;1704652985;15937;13;3,709607
07/01/2024 19:43:05;1704652985;15956;13;4,822709
07/01/2024 19:43:06;1704652986;15977;13;5,627653
07/01/2024 19:43:07;1704652987;15996;13;4,744585
07/01/2024 19:43:08;1704652988;16014;13;5,660223
07/01/2024 19:43:09;1704652989;16034;13;5,092685
07/01/2024 19:43:10;1704652990;16053;13;3,364978
07/01/2024 19:43:10;1704652990;16075;13;5,593562
07/01/2024 19:43:11;1704652991;16092;13;5,327477
07/01/2024 19:43:12;1704652992;16110;13;4,940408
07/01/2024 19:43:13;1704652993;16131;13;5,510969
07/01/2024 19:43:14;1704652994;16150;13;5,446846
07/01/2024 19:43:15;1704652995;16172;13;4,973523
07/01/2024 19:43:15;1704652995;16192;13;4,33
07/01/2024 19:43:16;1704652996;16212;13;5,133893
07/01/2024 19:43:17;1704652997;16231;13;5,836515
07/01/2024 19:43:18;1704652998;16251;13;4,936615
07/01/2024 19:43:19;1704652999;16271;13;5,519
07/01/2024 19:43:19;1704652999;16290;13;3,014622
07/01/2024 19:43:20;1704653000;16310;13;5,397015
07/01/2024 19:43:21;1704653001;16348;13;1,172774
07/01/2024 19:43:22;1704653002;16372;13;4,905969
07/01/2024 19:43:23;1704653003;16391;13;5,520331
07/01/2024 19:43:24;1704653004;16410;13;5,286761
