07/01/2024 19:23:59;1704651839;0;First
07/01/2024 19:23:59;1704651839;31;First
07/01/2024 19:24:00;1704651840;31;First
07/01/2024 19:24:00;1704651840;32;First
07/01/2024 19:24:00;1704651840;29;First
07/01/2024 19:24:01;1704651841;33;First
07/01/2024 19:24:01;1704651841;30;First
07/01/2024 19:24:02;1704651842;29;First
07/01/2024 19:24:02;1704651842;29;First
07/01/2024 19:24:03;1704651843;30;First
07/01/2024 19:24:03;1704651843;32;First
07/01/2024 19:24:03;1704651843;31;First
07/01/2024 19:24:04;1704651844;31;First
07/01/2024 19:24:04;1704651844;30;First
07/01/2024 19:24:05;1704651845;29;First
07/01/2024 19:24:05;1704651845;30;First
07/01/2024 19:24:06;1704651846;34;First
07/01/2024 19:24:06;1704651846;31;First
07/01/2024 19:24:06;1704651846;28;First
07/01/2024 19:24:07;1704651847;31;First
07/01/2024 19:24:07;1704651847;32;First
07/01/2024 19:24:08;1704651848;33;First
07/01/2024 19:24:08;1704651848;30;First
07/01/2024 19:24:09;1704651849;33;First
07/01/2024 19:24:09;1704651849;29;First
07/01/2024 19:24:10;1704651850;27;First
07/01/2024 19:24:10;1704651850;30;First
07/01/2024 19:24:10;1704651850;30;First
07/01/2024 19:24:11;1704651851;31;First
07/01/2024 19:24:11;1704651851;30;First
07/01/2024 19:24:12;1704651852;30;First
07/01/2024 19:24:12;1704651852;30;First
07/01/2024 19:24:13;1704651853;32;First
07/01/2024 19:24:13;1704651853;31;First
07/01/2024 19:24:13;1704651853;30;First
07/01/2024 19:24:14;1704651854;30;First
07/01/2024 19:24:14;1704651854;32;First
07/01/2024 19:24:15;1704651855;32;First
07/01/2024 19:24:15;1704651855;32;First
07/01/2024 19:24:16;1704651856;30;First
07/01/2024 19:24:16;1704651856;30;First
07/01/2024 19:24:16;1704651856;34;First
07/01/2024 19:24:17;1704651857;30;First
07/01/2024 19:24:17;1704651857;32;First
07/01/2024 19:24:18;1704651858;31;First
07/01/2024 19:24:18;1704651858;32;First
07/01/2024 19:24:19;1704651859;32;First
07/01/2024 19:24:19;1704651859;30;First
07/01/2024 19:24:19;1704651859;31;First
07/01/2024 19:24:20;1704651860;31;First
07/01/2024 19:24:20;1704651860;29;First
07/01/2024 19:24:21;1704651861;30;First
07/01/2024 19:24:21;1704651861;29;First
07/01/2024 19:24:22;1704651862;30;First
07/01/2024 19:24:22;1704651862;30;First
07/01/2024 19:24:22;1704651862;30;First
07/01/2024 19:24:23;1704651863;34;First
07/01/2024 19:24:23;1704651863;32;First
07/01/2024 19:24:24;1704651864;28;First
07/01/2024 19:24:24;1704651864;32;First
07/01/2024 19:24:25;1704651865;32;First
07/01/2024 19:24:25;1704651865;29;First
07/01/2024 19:24:25;1704651865;28;First
07/01/2024 19:24:26;1704651866;34;First
07/01/2024 19:24:26;1704651866;32;First
07/01/2024 19:24:27;1704651867;32;First
07/01/2024 19:24:27;1704651867;35;First
07/01/2024 19:24:28;1704651868;29;First
07/01/2024 19:24:28;1704651868;30;First
07/01/2024 19:24:28;1704651868;30;First
07/01/2024 19:24:29;1704651869;33;First
07/01/2024 19:24:29;1704651869;29;First
07/01/2024 19:24:30;1704651870;30;First
07/01/2024 19:24:30;1704651870;32;First
07/01/2024 19:24:31;1704651871;31;First
07/01/2024 19:24:31;1704651871;28;First
07/01/2024 19:24:32;1704651872;30;First
07/01/2024 19:24:32;1704651872;31;First
07/01/2024 19:24:33;1704651873;34;First
07/01/2024 19:24:33;1704651873;29;First
07/01/2024 19:24:34;1704651874;30;First
07/01/2024 19:24:34;1704651874;32;First
07/01/2024 19:24:34;1704651874;31;First
07/01/2024 19:24:35;1704651875;30;First
07/01/2024 19:24:35;1704651875;30;First
07/01/2024 19:24:36;1704651876;32;First
07/01/2024 19:24:36;1704651876;30;First
07/01/2024 19:24:37;1704651877;33;First
07/01/2024 19:24:37;1704651877;32;First
07/01/2024 19:24:37;1704651877;31;First
07/01/2024 19:24:38;1704651878;31;First
07/01/2024 19:24:38;1704651878;32;First
07/01/2024 19:24:39;1704651879;32;First
07/01/2024 19:24:39;1704651879;32;First
07/01/2024 19:24:40;1704651880;28;First
07/01/2024 19:24:40;1704651880;32;First
07/01/2024 19:24:40;1704651880;29;First
07/01/2024 19:24:41;1704651881;29;First
07/01/2024 19:24:41;1704651881;33;First
07/01/2024 19:24:42;1704651882;33;First
07/01/2024 19:24:42;1704651882;29;First
