07/01/2024 19:16:37;1704651397;0;First
07/01/2024 19:16:37;1704651397;0;First
07/01/2024 19:16:37;1704651397;0;First
07/01/2024 19:16:37;1704651397;0;First
07/01/2024 19:16:37;1704651397;0;Second
07/01/2024 19:16:37;1704651397;0;Second
07/01/2024 19:16:37;1704651397;0;Second
07/01/2024 19:16:37;1704651397;0;Second
07/01/2024 19:16:38;1704651398;16;Second
07/01/2024 19:16:38;1704651398;17;First
07/01/2024 19:16:38;1704651398;19;Second
07/01/2024 19:16:39;1704651399;24;First
07/01/2024 19:16:39;1704651399;25;Second
07/01/2024 19:16:39;1704651399;28;First
07/01/2024 19:16:39;1704651399;41;First
07/01/2024 19:16:39;1704651399;45;Second
07/01/2024 19:16:40;1704651400;16;Second
07/01/2024 19:16:40;1704651400;18;Second
07/01/2024 19:16:40;1704651400;19;First
07/01/2024 19:16:40;1704651400;20;Second
07/01/2024 19:16:40;1704651400;22;First
07/01/2024 19:16:40;1704651400;22;First
07/01/2024 19:16:40;1704651400;22;Second
07/01/2024 19:16:40;1704651400;26;First
07/01/2024 19:16:41;1704651401;16;First
07/01/2024 19:16:41;1704651401;16;Second
07/01/2024 19:16:41;1704651401;19;Second
07/01/2024 19:16:41;1704651401;20;First
07/01/2024 19:16:41;1704651401;21;Second
07/01/2024 19:16:41;1704651401;22;Second
07/01/2024 19:16:41;1704651401;23;First
07/01/2024 19:16:41;1704651401;25;First
07/01/2024 19:16:42;1704651402;16;Second
07/01/2024 19:16:42;1704651402;17;First
07/01/2024 19:16:43;1704651403;21;First
07/01/2024 19:16:43;1704651403;22;Second
07/01/2024 19:16:43;1704651403;24;First
07/01/2024 19:16:43;1704651403;25;Second
07/01/2024 19:16:43;1704651403;26;Second
07/01/2024 19:16:43;1704651403;28;First
07/01/2024 19:16:44;1704651404;16;Second
07/01/2024 19:16:44;1704651404;17;First
07/01/2024 19:16:44;1704651404;17;Second
07/01/2024 19:16:44;1704651404;20;Second
07/01/2024 19:16:44;1704651404;21;First
07/01/2024 19:16:44;1704651404;22;First
07/01/2024 19:16:44;1704651404;23;Second
07/01/2024 19:16:44;1704651404;26;First
07/01/2024 19:16:45;1704651405;17;Second
07/01/2024 19:16:45;1704651405;18;First
07/01/2024 19:16:45;1704651405;20;Second
07/01/2024 19:16:45;1704651405;21;First
07/01/2024 19:16:45;1704651405;21;Second
07/01/2024 19:16:45;1704651405;22;First
07/01/2024 19:16:45;1704651405;23;First
07/01/2024 19:16:45;1704651405;24;Second
07/01/2024 19:16:46;1704651406;18;Second
07/01/2024 19:16:46;1704651406;19;First
07/01/2024 19:16:46;1704651406;19;Second
07/01/2024 19:16:46;1704651406;20;First
07/01/2024 19:16:46;1704651406;22;Second
07/01/2024 19:16:46;1704651406;23;First
07/01/2024 19:16:46;1704651406;27;First
07/01/2024 19:16:46;1704651406;27;Second
07/01/2024 19:16:47;1704651407;17;First
07/01/2024 19:16:47;1704651407;19;Second
07/01/2024 19:16:47;1704651407;19;First
07/01/2024 19:16:47;1704651407;21;Second
07/01/2024 19:16:47;1704651407;22;First
07/01/2024 19:16:47;1704651407;22;Second
07/01/2024 19:16:48;1704651408;24;First
07/01/2024 19:16:48;1704651408;25;Second
07/01/2024 19:16:48;1704651408;18;Second
07/01/2024 19:16:48;1704651408;18;First
07/01/2024 19:16:49;1704651409;20;Second
07/01/2024 19:16:49;1704651409;21;First
07/01/2024 19:16:49;1704651409;23;First
07/01/2024 19:16:49;1704651409;23;Second
07/01/2024 19:16:49;1704651409;26;First
07/01/2024 19:16:49;1704651409;28;Second
07/01/2024 19:16:50;1704651410;16;Second
07/01/2024 19:16:50;1704651410;18;First
07/01/2024 19:16:50;1704651410;19;Second
07/01/2024 19:16:50;1704651410;20;First
07/01/2024 19:16:50;1704651410;21;Second
07/01/2024 19:16:50;1704651410;23;First
07/01/2024 19:16:50;1704651410;25;Second
07/01/2024 19:16:50;1704651410;25;First
07/01/2024 19:16:51;1704651411;17;Second
07/01/2024 19:16:51;1704651411;19;Second
07/01/2024 19:16:51;1704651411;19;First
07/01/2024 19:16:51;1704651411;21;First
07/01/2024 19:16:51;1704651411;21;Second
07/01/2024 19:16:51;1704651411;23;First
07/01/2024 19:16:51;1704651411;25;Second
07/01/2024 19:16:51;1704651411;25;First
07/01/2024 19:16:52;1704651412;16;Second
07/01/2024 19:16:52;1704651412;20;First
07/01/2024 19:16:52;1704651412;20;Second
07/01/2024 19:16:52;1704651412;21;First
07/01/2024 19:16:52;1704651412;21;Second
07/01/2024 19:16:52;1704651412;24;First
07/01/2024 19:16:52;1704651412;24;Second
07/01/2024 19:16:52;1704651412;26;First
07/01/2024 19:16:53;1704651413;16;Second
07/01/2024 19:16:53;1704651413;18;First
07/01/2024 19:16:53;1704651413;19;Second
07/01/2024 19:16:53;1704651413;20;First
07/01/2024 19:16:53;1704651413;22;Second
07/01/2024 19:16:53;1704651413;22;Second
07/01/2024 19:16:53;1704651413;22;First
07/01/2024 19:16:53;1704651413;24;First
07/01/2024 19:16:54;1704651414;17;Second
07/01/2024 19:16:54;1704651414;19;First
07/01/2024 19:16:54;1704651414;21;Second
07/01/2024 19:16:54;1704651414;21;First
07/01/2024 19:16:55;1704651415;25;Second
07/01/2024 19:16:55;1704651415;26;First
07/01/2024 19:16:55;1704651415;36;First
07/01/2024 19:16:55;1704651415;37;Second
07/01/2024 19:16:56;1704651416;16;Second
07/01/2024 19:16:56;1704651416;16;First
07/01/2024 19:16:56;1704651416;19;Second
07/01/2024 19:16:56;1704651416;19;First
07/01/2024 19:16:56;1704651416;21;First
07/01/2024 19:16:56;1704651416;21;Second
07/01/2024 19:16:56;1704651416;23;First
07/01/2024 19:16:56;1704651416;26;Second
07/01/2024 19:16:57;1704651417;17;Second
07/01/2024 19:16:57;1704651417;18;First
07/01/2024 19:16:57;1704651417;19;Second
07/01/2024 19:16:57;1704651417;22;First
07/01/2024 19:16:57;1704651417;24;Second
07/01/2024 19:16:57;1704651417;24;First
07/01/2024 19:16:57;1704651417;29;Second
07/01/2024 19:16:57;1704651417;30;First
07/01/2024 19:16:58;1704651418;16;Second
07/01/2024 19:16:58;1704651418;17;First
07/01/2024 19:16:58;1704651418;18;Second
07/01/2024 19:16:58;1704651418;19;First
07/01/2024 19:16:58;1704651418;21;Second
07/01/2024 19:16:58;1704651418;22;First
07/01/2024 19:16:59;1704651419;23;Second
07/01/2024 19:16:59;1704651419;23;First
07/01/2024 19:16:59;1704651419;18;Second
07/01/2024 19:17:00;1704651420;19;First
07/01/2024 19:17:00;1704651420;20;Second
07/01/2024 19:17:00;1704651420;20;First
07/01/2024 19:17:00;1704651420;21;Second
07/01/2024 19:17:00;1704651420;23;First
07/01/2024 19:17:00;1704651420;24;First
07/01/2024 19:17:00;1704651420;24;Second
07/01/2024 19:17:01;1704651421;18;First
07/01/2024 19:17:01;1704651421;20;Second
07/01/2024 19:17:01;1704651421;21;First
07/01/2024 19:17:01;1704651421;22;First
07/01/2024 19:17:01;1704651421;23;Second
07/01/2024 19:17:01;1704651421;24;Second
07/01/2024 19:17:01;1704651421;26;Second
07/01/2024 19:17:01;1704651421;26;First
07/01/2024 19:17:02;1704651422;17;Second
07/01/2024 19:17:02;1704651422;18;First
07/01/2024 19:17:02;1704651422;19;First
07/01/2024 19:17:02;1704651422;20;Second
07/01/2024 19:17:02;1704651422;21;Second
07/01/2024 19:17:02;1704651422;22;First
07/01/2024 19:17:02;1704651422;22;Second
07/01/2024 19:17:02;1704651422;25;First
07/01/2024 19:17:03;1704651423;17;First
07/01/2024 19:17:03;1704651423;19;Second
07/01/2024 19:17:03;1704651423;21;First
07/01/2024 19:17:03;1704651423;21;Second
07/01/2024 19:17:03;1704651423;22;First
07/01/2024 19:17:03;1704651423;23;Second
07/01/2024 19:17:03;1704651423;23;First
07/01/2024 19:17:03;1704651423;25;Second
07/01/2024 19:17:04;1704651424;17;Second
07/01/2024 19:17:04;1704651424;19;First
07/01/2024 19:17:05;1704651425;21;Second
07/01/2024 19:17:05;1704651425;21;First
07/01/2024 19:17:05;1704651425;24;First
07/01/2024 19:17:05;1704651425;24;Second
07/01/2024 19:17:05;1704651425;32;First
07/01/2024 19:17:05;1704651425;34;Second
07/01/2024 19:17:06;1704651426;17;Second
07/01/2024 19:17:06;1704651426;17;First
07/01/2024 19:17:06;1704651426;18;Second
07/01/2024 19:17:06;1704651426;19;First
07/01/2024 19:17:06;1704651426;21;Second
07/01/2024 19:17:06;1704651426;22;First
07/01/2024 19:17:06;1704651426;22;First
07/01/2024 19:17:06;1704651426;24;Second
07/01/2024 19:17:07;1704651427;18;Second
07/01/2024 19:17:07;1704651427;18;First
07/01/2024 19:17:07;1704651427;20;First
07/01/2024 19:17:07;1704651427;22;Second
07/01/2024 19:17:07;1704651427;22;First
07/01/2024 19:17:07;1704651427;25;Second
07/01/2024 19:17:07;1704651427;26;First
07/01/2024 19:17:07;1704651427;29;Second
07/01/2024 19:17:08;1704651428;16;First
07/01/2024 19:17:08;1704651428;16;Second
07/01/2024 19:17:08;1704651428;17;First
07/01/2024 19:17:08;1704651428;19;Second
07/01/2024 19:17:08;1704651428;20;First
07/01/2024 19:17:08;1704651428;21;First
07/01/2024 19:17:08;1704651428;22;Second
07/01/2024 19:17:08;1704651428;25;Second
07/01/2024 19:17:09;1704651429;18;Second
07/01/2024 19:17:09;1704651429;18;First
07/01/2024 19:17:10;1704651430;20;First
07/01/2024 19:17:10;1704651430;22;Second
07/01/2024 19:17:10;1704651430;23;First
07/01/2024 19:17:10;1704651430;23;Second
07/01/2024 19:17:12;1704651432;76;First
07/01/2024 19:17:12;1704651432;76;Second
07/01/2024 19:17:13;1704651433;16;Second
07/01/2024 19:17:13;1704651433;19;First
07/01/2024 19:17:13;1704651433;21;Second
07/01/2024 19:17:13;1704651433;22;First
07/01/2024 19:17:13;1704651433;23;First
07/01/2024 19:17:13;1704651433;23;Second
07/01/2024 19:17:13;1704651433;26;Second
07/01/2024 19:17:13;1704651433;26;First
07/01/2024 19:17:14;1704651434;17;Second
07/01/2024 19:17:14;1704651434;19;First
07/01/2024 19:17:14;1704651434;19;Second
07/01/2024 19:17:14;1704651434;21;First
07/01/2024 19:17:14;1704651434;21;Second
07/01/2024 19:17:14;1704651434;23;First
07/01/2024 19:17:14;1704651434;24;Second
07/01/2024 19:17:14;1704651434;25;First
07/01/2024 19:17:15;1704651435;15;First
07/01/2024 19:17:15;1704651435;16;Second
07/01/2024 19:17:15;1704651435;19;Second
07/01/2024 19:17:15;1704651435;20;First
07/01/2024 19:17:15;1704651435;22;First
07/01/2024 19:17:15;1704651435;23;Second
07/01/2024 19:17:15;1704651435;25;First
07/01/2024 19:17:15;1704651435;26;Second
07/01/2024 19:17:17;1704651437;18;Second
07/01/2024 19:17:17;1704651437;20;First
07/01/2024 19:17:17;1704651437;21;Second
07/01/2024 19:17:17;1704651437;22;First
07/01/2024 19:17:17;1704651437;22;Second
07/01/2024 19:17:17;1704651437;24;First
07/01/2024 19:17:17;1704651437;26;Second
07/01/2024 19:17:17;1704651437;26;First
07/01/2024 19:17:18;1704651438;16;Second
07/01/2024 19:17:18;1704651438;17;First
07/01/2024 19:17:18;1704651438;19;Second
07/01/2024 19:17:18;1704651438;20;First
07/01/2024 19:17:18;1704651438;22;First
07/01/2024 19:17:18;1704651438;24;Second
07/01/2024 19:17:18;1704651438;25;First
07/01/2024 19:17:18;1704651438;25;Second
07/01/2024 19:17:19;1704651439;16;First
07/01/2024 19:17:19;1704651439;18;Second
07/01/2024 19:17:19;1704651439;20;First
07/01/2024 19:17:19;1704651439;20;Second
07/01/2024 19:17:19;1704651439;22;First
07/01/2024 19:17:19;1704651439;23;Second
07/01/2024 19:17:20;1704651440;25;First
07/01/2024 19:17:20;1704651440;26;Second
07/01/2024 19:17:21;1704651441;18;Second
07/01/2024 19:17:21;1704651441;18;First
07/01/2024 19:17:21;1704651441;19;Second
07/01/2024 19:17:21;1704651441;21;First
07/01/2024 19:17:21;1704651441;22;Second
07/01/2024 19:17:21;1704651441;24;First
07/01/2024 19:17:21;1704651441;24;Second
07/01/2024 19:17:21;1704651441;28;First
07/01/2024 19:17:22;1704651442;17;First
07/01/2024 19:17:22;1704651442;18;First
07/01/2024 19:17:22;1704651442;20;Second
07/01/2024 19:17:22;1704651442;20;Second
07/01/2024 19:17:22;1704651442;21;First
07/01/2024 19:17:22;1704651442;22;Second
07/01/2024 19:17:22;1704651442;25;Second
07/01/2024 19:17:22;1704651442;27;First
07/01/2024 19:17:23;1704651443;17;Second
07/01/2024 19:17:24;1704651444;18;First
07/01/2024 19:17:24;1704651444;22;Second
07/01/2024 19:17:25;1704651445;42;First
07/01/2024 19:17:25;1704651445;42;Second
07/01/2024 19:17:25;1704651445;44;First
07/01/2024 19:17:25;1704651445;44;Second
07/01/2024 19:17:25;1704651445;48;First
07/01/2024 19:17:26;1704651446;16;First
07/01/2024 19:17:26;1704651446;16;Second
07/01/2024 19:17:26;1704651446;18;First
07/01/2024 19:17:26;1704651446;20;Second
07/01/2024 19:17:26;1704651446;21;First
07/01/2024 19:17:26;1704651446;22;Second
07/01/2024 19:17:26;1704651446;23;First
07/01/2024 19:17:27;1704651447;24;Second
07/01/2024 19:17:28;1704651448;17;Second
07/01/2024 19:17:28;1704651448;18;First
07/01/2024 19:17:28;1704651448;20;First
07/01/2024 19:17:28;1704651448;21;Second
07/01/2024 19:17:28;1704651448;23;First
07/01/2024 19:17:28;1704651448;24;Second
07/01/2024 19:17:28;1704651448;32;First
07/01/2024 19:17:28;1704651448;32;Second
07/01/2024 19:17:29;1704651449;16;Second
07/01/2024 19:17:29;1704651449;18;First
07/01/2024 19:17:29;1704651449;20;Second
07/01/2024 19:17:29;1704651449;21;Second
07/01/2024 19:17:29;1704651449;21;First
07/01/2024 19:17:29;1704651449;24;Second
07/01/2024 19:17:29;1704651449;24;First
07/01/2024 19:17:29;1704651449;28;First
07/01/2024 19:17:30;1704651450;17;First
07/01/2024 19:17:30;1704651450;19;Second
07/01/2024 19:17:30;1704651450;20;First
07/01/2024 19:17:30;1704651450;21;Second
07/01/2024 19:17:30;1704651450;22;First
07/01/2024 19:17:30;1704651450;22;Second
07/01/2024 19:17:30;1704651450;24;First
07/01/2024 19:17:30;1704651450;26;Second
07/01/2024 19:17:31;1704651451;16;Second
07/01/2024 19:17:31;1704651451;18;First
07/01/2024 19:17:31;1704651451;20;Second
07/01/2024 19:17:32;1704651452;20;First
07/01/2024 19:17:32;1704651452;23;Second
07/01/2024 19:17:32;1704651452;23;First
07/01/2024 19:17:32;1704651452;25;First
07/01/2024 19:17:32;1704651452;25;Second
07/01/2024 19:17:33;1704651453;18;First
07/01/2024 19:17:33;1704651453;18;Second
07/01/2024 19:17:33;1704651453;19;Second
07/01/2024 19:17:33;1704651453;20;First
07/01/2024 19:17:33;1704651453;21;Second
07/01/2024 19:17:33;1704651453;22;First
07/01/2024 19:17:33;1704651453;23;Second
07/01/2024 19:17:33;1704651453;24;First
07/01/2024 19:17:34;1704651454;18;Second
07/01/2024 19:17:34;1704651454;21;Second
07/01/2024 19:17:34;1704651454;23;First
07/01/2024 19:17:34;1704651454;23;Second
07/01/2024 19:17:34;1704651454;23;First
07/01/2024 19:17:34;1704651454;24;Second
07/01/2024 19:17:34;1704651454;26;First
07/01/2024 19:17:34;1704651454;29;First
07/01/2024 19:17:35;1704651455;17;Second
07/01/2024 19:17:35;1704651455;17;First
07/01/2024 19:17:35;1704651455;19;Second
07/01/2024 19:17:35;1704651455;21;First
07/01/2024 19:17:35;1704651455;22;Second
07/01/2024 19:17:35;1704651455;22;First
07/01/2024 19:17:35;1704651455;23;Second
07/01/2024 19:17:35;1704651455;26;First
07/01/2024 19:17:36;1704651456;16;Second
07/01/2024 19:17:37;1704651457;17;First
07/01/2024 19:17:37;1704651457;20;Second
07/01/2024 19:17:37;1704651457;22;First
07/01/2024 19:17:37;1704651457;24;Second
07/01/2024 19:17:37;1704651457;25;First
07/01/2024 19:17:37;1704651457;26;Second
07/01/2024 19:17:37;1704651457;27;First
07/01/2024 19:17:38;1704651458;16;Second
07/01/2024 19:17:38;1704651458;20;First
07/01/2024 19:17:38;1704651458;20;Second
07/01/2024 19:17:38;1704651458;22;Second
07/01/2024 19:17:38;1704651458;22;First
07/01/2024 19:17:38;1704651458;26;First
07/01/2024 19:17:38;1704651458;26;Second
07/01/2024 19:17:38;1704651458;27;First
07/01/2024 19:17:39;1704651459;17;Second
07/01/2024 19:17:39;1704651459;18;First
07/01/2024 19:17:39;1704651459;21;Second
07/01/2024 19:17:39;1704651459;21;First
07/01/2024 19:17:39;1704651459;22;Second
07/01/2024 19:17:39;1704651459;23;First
07/01/2024 19:17:39;1704651459;24;Second
07/01/2024 19:17:39;1704651459;26;First
07/01/2024 19:17:40;1704651460;18;First
07/01/2024 19:17:41;1704651461;19;Second
07/01/2024 19:17:41;1704651461;20;First
07/01/2024 19:17:41;1704651461;21;First
07/01/2024 19:17:41;1704651461;21;Second
07/01/2024 19:17:41;1704651461;23;Second
07/01/2024 19:17:41;1704651461;23;First
07/01/2024 19:17:41;1704651461;26;Second
07/01/2024 19:17:42;1704651462;17;Second
07/01/2024 19:17:42;1704651462;17;First
07/01/2024 19:17:42;1704651462;20;Second
07/01/2024 19:17:42;1704651462;20;First
07/01/2024 19:17:42;1704651462;23;First
07/01/2024 19:17:42;1704651462;24;Second
07/01/2024 19:17:42;1704651462;25;First
07/01/2024 19:17:42;1704651462;27;Second
07/01/2024 19:17:43;1704651463;17;First
07/01/2024 19:17:43;1704651463;17;Second
07/01/2024 19:17:43;1704651463;19;Second
07/01/2024 19:17:43;1704651463;20;First
07/01/2024 19:17:43;1704651463;21;First
07/01/2024 19:17:43;1704651463;22;Second
07/01/2024 19:17:43;1704651463;23;Second
07/01/2024 19:17:43;1704651463;24;First
07/01/2024 19:17:44;1704651464;17;Second
07/01/2024 19:17:44;1704651464;19;First
07/01/2024 19:17:44;1704651464;20;Second
07/01/2024 19:17:44;1704651464;22;First
07/01/2024 19:17:44;1704651464;22;First
07/01/2024 19:17:44;1704651464;23;Second
07/01/2024 19:17:44;1704651464;25;Second
07/01/2024 19:17:44;1704651464;25;First
07/01/2024 19:17:45;1704651465;17;Second
07/01/2024 19:17:45;1704651465;17;First
07/01/2024 19:17:45;1704651465;19;Second
07/01/2024 19:17:45;1704651465;22;First
07/01/2024 19:17:46;1704651466;23;Second
07/01/2024 19:17:46;1704651466;24;First
07/01/2024 19:17:46;1704651466;26;Second
07/01/2024 19:17:46;1704651466;26;First
07/01/2024 19:17:46;1704651466;16;Second
07/01/2024 19:17:46;1704651466;17;Second
07/01/2024 19:17:46;1704651466;18;First
07/01/2024 19:17:47;1704651467;20;Second
07/01/2024 19:17:47;1704651467;20;First
07/01/2024 19:17:47;1704651467;23;First
07/01/2024 19:17:47;1704651467;24;Second
07/01/2024 19:17:47;1704651467;25;First
07/01/2024 19:17:48;1704651468;17;First
07/01/2024 19:17:48;1704651468;18;Second
07/01/2024 19:17:48;1704651468;19;First
07/01/2024 19:17:48;1704651468;20;Second
07/01/2024 19:17:48;1704651468;20;Second
07/01/2024 19:17:48;1704651468;22;First
07/01/2024 19:17:48;1704651468;24;Second
07/01/2024 19:17:48;1704651468;25;First
07/01/2024 19:17:49;1704651469;16;First
07/01/2024 19:17:49;1704651469;17;Second
07/01/2024 19:17:49;1704651469;18;First
07/01/2024 19:17:49;1704651469;20;Second
07/01/2024 19:17:49;1704651469;22;Second
07/01/2024 19:17:49;1704651469;22;First
07/01/2024 19:17:49;1704651469;24;Second
07/01/2024 19:17:49;1704651469;25;First
07/01/2024 19:17:50;1704651470;17;First
07/01/2024 19:17:50;1704651470;17;Second
07/01/2024 19:17:50;1704651470;19;Second
07/01/2024 19:17:50;1704651470;20;First
07/01/2024 19:17:50;1704651470;21;Second
07/01/2024 19:17:50;1704651470;22;First
07/01/2024 19:17:50;1704651470;24;Second
07/01/2024 19:17:50;1704651470;26;First
07/01/2024 19:17:51;1704651471;17;First
07/01/2024 19:17:51;1704651471;17;Second
07/01/2024 19:17:51;1704651471;22;Second
07/01/2024 19:17:51;1704651471;22;First
07/01/2024 19:17:51;1704651471;25;Second
07/01/2024 19:17:51;1704651471;25;First
07/01/2024 19:17:51;1704651471;27;First
07/01/2024 19:17:51;1704651471;27;Second
07/01/2024 19:17:52;1704651472;16;Second
07/01/2024 19:17:52;1704651472;17;First
07/01/2024 19:17:52;1704651472;18;Second
07/01/2024 19:17:52;1704651472;19;First
07/01/2024 19:17:52;1704651472;21;Second
07/01/2024 19:17:52;1704651472;22;First
07/01/2024 19:17:52;1704651472;24;Second
07/01/2024 19:17:52;1704651472;25;First
07/01/2024 19:17:53;1704651473;16;Second
07/01/2024 19:17:53;1704651473;18;First
07/01/2024 19:17:54;1704651474;18;First
07/01/2024 19:17:54;1704651474;20;Second
07/01/2024 19:17:54;1704651474;21;First
07/01/2024 19:17:54;1704651474;22;Second
07/01/2024 19:17:54;1704651474;30;Second
07/01/2024 19:17:54;1704651474;34;First
07/01/2024 19:17:55;1704651475;17;Second
07/01/2024 19:17:55;1704651475;17;First
07/01/2024 19:17:55;1704651475;19;Second
07/01/2024 19:17:55;1704651475;20;Second
07/01/2024 19:17:55;1704651475;21;First
07/01/2024 19:17:55;1704651475;22;First
07/01/2024 19:17:55;1704651475;22;Second
07/01/2024 19:17:55;1704651475;25;First
07/01/2024 19:17:56;1704651476;15;Second
07/01/2024 19:17:56;1704651476;17;Second
07/01/2024 19:17:56;1704651476;18;First
07/01/2024 19:17:56;1704651476;19;Second
07/01/2024 19:17:56;1704651476;20;First
07/01/2024 19:17:56;1704651476;22;Second
07/01/2024 19:17:56;1704651476;24;First
07/01/2024 19:17:56;1704651476;26;First
07/01/2024 19:17:57;1704651477;18;Second
07/01/2024 19:17:58;1704651478;21;First
07/01/2024 19:17:58;1704651478;22;Second
07/01/2024 19:17:58;1704651478;25;Second
07/01/2024 19:17:58;1704651478;30;Second
07/01/2024 19:17:58;1704651478;30;First
07/01/2024 19:17:58;1704651478;32;First
07/01/2024 19:17:58;1704651478;34;First
07/01/2024 19:17:59;1704651479;16;First
07/01/2024 19:17:59;1704651479;18;Second
07/01/2024 19:17:59;1704651479;20;First
07/01/2024 19:17:59;1704651479;21;Second
07/01/2024 19:17:59;1704651479;22;Second
07/01/2024 19:17:59;1704651479;22;First
07/01/2024 19:17:59;1704651479;23;Second
07/01/2024 19:17:59;1704651479;25;First
07/01/2024 19:18:00;1704651480;17;Second
07/01/2024 19:18:00;1704651480;17;First
07/01/2024 19:18:00;1704651480;19;Second
07/01/2024 19:18:00;1704651480;20;First
07/01/2024 19:18:00;1704651480;21;First
07/01/2024 19:18:00;1704651480;22;Second
07/01/2024 19:18:00;1704651480;23;Second
07/01/2024 19:18:00;1704651480;24;First
07/01/2024 19:18:01;1704651481;17;Second
07/01/2024 19:18:01;1704651481;18;First
07/01/2024 19:18:01;1704651481;19;Second
07/01/2024 19:18:01;1704651481;20;First
07/01/2024 19:18:01;1704651481;21;Second
07/01/2024 19:18:01;1704651481;22;First
07/01/2024 19:18:01;1704651481;23;Second
07/01/2024 19:18:01;1704651481;25;First
07/01/2024 19:18:02;1704651482;16;Second
07/01/2024 19:18:02;1704651482;17;First
07/01/2024 19:18:02;1704651482;20;First
07/01/2024 19:18:02;1704651482;20;Second
07/01/2024 19:18:02;1704651482;21;First
07/01/2024 19:18:02;1704651482;22;Second
07/01/2024 19:18:02;1704651482;24;First
07/01/2024 19:18:02;1704651482;26;Second
07/01/2024 19:18:03;1704651483;16;Second
07/01/2024 19:18:03;1704651483;19;Second
07/01/2024 19:18:03;1704651483;19;First
07/01/2024 19:18:03;1704651483;21;Second
07/01/2024 19:18:03;1704651483;22;First
07/01/2024 19:18:03;1704651483;23;First
07/01/2024 19:18:04;1704651484;24;First
07/01/2024 19:18:04;1704651484;25;Second
07/01/2024 19:18:04;1704651484;16;First
07/01/2024 19:18:04;1704651484;17;Second
07/01/2024 19:18:04;1704651484;18;Second
07/01/2024 19:18:04;1704651484;20;First
07/01/2024 19:18:05;1704651485;21;Second
07/01/2024 19:18:05;1704651485;22;First
07/01/2024 19:18:05;1704651485;23;Second
07/01/2024 19:18:05;1704651485;24;First
07/01/2024 19:18:05;1704651485;16;Second
07/01/2024 19:18:05;1704651485;16;First
07/01/2024 19:18:06;1704651486;19;Second
07/01/2024 19:18:06;1704651486;20;First
07/01/2024 19:18:06;1704651486;22;Second
07/01/2024 19:18:06;1704651486;22;First
07/01/2024 19:18:06;1704651486;24;First
07/01/2024 19:18:06;1704651486;25;Second
07/01/2024 19:18:07;1704651487;17;Second
07/01/2024 19:18:07;1704651487;19;Second
07/01/2024 19:18:07;1704651487;20;First
07/01/2024 19:18:07;1704651487;22;Second
07/01/2024 19:18:07;1704651487;22;First
07/01/2024 19:18:07;1704651487;23;First
07/01/2024 19:18:07;1704651487;26;Second
07/01/2024 19:18:07;1704651487;27;First
07/01/2024 19:18:09;1704651489;19;Second
07/01/2024 19:18:09;1704651489;20;First
07/01/2024 19:18:09;1704651489;22;First
07/01/2024 19:18:09;1704651489;22;First
07/01/2024 19:18:09;1704651489;24;Second
07/01/2024 19:18:09;1704651489;25;Second
07/01/2024 19:18:09;1704651489;26;First
07/01/2024 19:18:09;1704651489;26;Second
07/01/2024 19:18:10;1704651490;16;Second
07/01/2024 19:18:10;1704651490;20;First
07/01/2024 19:18:10;1704651490;21;Second
07/01/2024 19:18:10;1704651490;21;First
07/01/2024 19:18:10;1704651490;23;First
07/01/2024 19:18:10;1704651490;24;Second
07/01/2024 19:18:10;1704651490;25;First
07/01/2024 19:18:10;1704651490;25;Second
07/01/2024 19:18:11;1704651491;16;Second
07/01/2024 19:18:11;1704651491;18;First
07/01/2024 19:18:11;1704651491;20;Second
07/01/2024 19:18:11;1704651491;21;Second
07/01/2024 19:18:11;1704651491;22;First
07/01/2024 19:18:11;1704651491;23;First
07/01/2024 19:18:11;1704651491;24;Second
07/01/2024 19:18:11;1704651491;26;First
07/01/2024 19:18:13;1704651493;18;First
07/01/2024 19:18:13;1704651493;18;Second
07/01/2024 19:18:13;1704651493;20;Second
07/01/2024 19:18:13;1704651493;21;First
07/01/2024 19:18:13;1704651493;22;Second
07/01/2024 19:18:13;1704651493;24;First
07/01/2024 19:18:13;1704651493;25;Second
07/01/2024 19:18:13;1704651493;27;First
07/01/2024 19:18:14;1704651494;17;First
07/01/2024 19:18:14;1704651494;17;Second
07/01/2024 19:18:14;1704651494;20;Second
07/01/2024 19:18:14;1704651494;20;First
07/01/2024 19:18:14;1704651494;21;First
07/01/2024 19:18:14;1704651494;23;Second
07/01/2024 19:18:14;1704651494;23;First
07/01/2024 19:18:14;1704651494;26;Second
07/01/2024 19:18:15;1704651495;16;Second
07/01/2024 19:18:15;1704651495;16;First
07/01/2024 19:18:15;1704651495;18;Second
07/01/2024 19:18:15;1704651495;18;First
07/01/2024 19:18:15;1704651495;20;Second
07/01/2024 19:18:15;1704651495;21;Second
07/01/2024 19:18:15;1704651495;22;First
07/01/2024 19:18:15;1704651495;25;First
07/01/2024 19:18:16;1704651496;19;Second
07/01/2024 19:18:17;1704651497;21;Second
07/01/2024 19:18:17;1704651497;23;First
07/01/2024 19:18:17;1704651497;25;First
07/01/2024 19:18:17;1704651497;28;First
07/01/2024 19:18:17;1704651497;29;Second
07/01/2024 19:18:17;1704651497;31;Second
07/01/2024 19:18:17;1704651497;33;First
07/01/2024 19:18:18;1704651498;16;Second
07/01/2024 19:18:18;1704651498;18;First
07/01/2024 19:18:18;1704651498;19;Second
07/01/2024 19:18:18;1704651498;19;First
07/01/2024 19:18:18;1704651498;19;Second
07/01/2024 19:18:18;1704651498;22;Second
07/01/2024 19:18:18;1704651498;23;First
07/01/2024 19:18:18;1704651498;24;First
07/01/2024 19:18:19;1704651499;17;First
07/01/2024 19:18:19;1704651499;17;Second
07/01/2024 19:18:19;1704651499;18;First
07/01/2024 19:18:19;1704651499;19;Second
07/01/2024 19:18:19;1704651499;21;First
07/01/2024 19:18:19;1704651499;22;Second
07/01/2024 19:18:19;1704651499;23;Second
07/01/2024 19:18:19;1704651499;25;First
07/01/2024 19:18:20;1704651500;17;Second
07/01/2024 19:18:20;1704651500;19;First
07/01/2024 19:18:20;1704651500;20;Second
07/01/2024 19:18:20;1704651500;22;First
07/01/2024 19:18:21;1704651501;25;First
07/01/2024 19:18:21;1704651501;25;Second
07/01/2024 19:18:21;1704651501;40;First
07/01/2024 19:18:21;1704651501;41;Second
07/01/2024 19:18:22;1704651502;16;Second
07/01/2024 19:18:22;1704651502;18;First
07/01/2024 19:18:22;1704651502;18;Second
07/01/2024 19:18:22;1704651502;20;First
07/01/2024 19:18:22;1704651502;21;Second
07/01/2024 19:18:22;1704651502;21;First
07/01/2024 19:18:22;1704651502;24;First
07/01/2024 19:18:22;1704651502;25;Second
07/01/2024 19:18:23;1704651503;16;Second
07/01/2024 19:18:23;1704651503;16;First
07/01/2024 19:18:23;1704651503;19;Second
07/01/2024 19:18:23;1704651503;19;First
07/01/2024 19:18:23;1704651503;22;First
07/01/2024 19:18:23;1704651503;23;Second
07/01/2024 19:18:23;1704651503;24;First
07/01/2024 19:18:23;1704651503;25;Second
07/01/2024 19:18:24;1704651504;16;Second
07/01/2024 19:18:24;1704651504;19;First
07/01/2024 19:18:24;1704651504;19;Second
07/01/2024 19:18:24;1704651504;21;Second
07/01/2024 19:18:24;1704651504;22;First
07/01/2024 19:18:24;1704651504;24;First
07/01/2024 19:18:24;1704651504;24;Second
07/01/2024 19:18:24;1704651504;26;First
07/01/2024 19:18:25;1704651505;16;Second
07/01/2024 19:18:25;1704651505;18;First
07/01/2024 19:18:25;1704651505;20;First
07/01/2024 19:18:25;1704651505;20;Second
07/01/2024 19:18:25;1704651505;21;First
07/01/2024 19:18:25;1704651505;21;Second
07/01/2024 19:18:25;1704651505;22;First
07/01/2024 19:18:25;1704651505;25;Second
07/01/2024 19:18:27;1704651507;19;First
07/01/2024 19:18:27;1704651507;21;First
07/01/2024 19:18:27;1704651507;23;Second
07/01/2024 19:18:27;1704651507;24;Second
07/01/2024 19:18:28;1704651508;27;First
07/01/2024 19:18:28;1704651508;29;Second
07/01/2024 19:18:32;1704651512;136;Second
07/01/2024 19:18:32;1704651512;138;First
07/01/2024 19:18:33;1704651513;17;Second
07/01/2024 19:18:33;1704651513;18;First
07/01/2024 19:18:33;1704651513;20;Second
07/01/2024 19:18:33;1704651513;21;First
07/01/2024 19:18:33;1704651513;22;Second
07/01/2024 19:18:33;1704651513;23;First
07/01/2024 19:18:33;1704651513;25;First
07/01/2024 19:18:33;1704651513;27;Second
07/01/2024 19:18:34;1704651514;16;First
07/01/2024 19:18:34;1704651514;18;Second
07/01/2024 19:18:34;1704651514;18;Second
07/01/2024 19:18:34;1704651514;19;First
07/01/2024 19:18:34;1704651514;21;First
07/01/2024 19:18:34;1704651514;21;Second
07/01/2024 19:18:34;1704651514;24;First
07/01/2024 19:18:34;1704651514;24;Second
07/01/2024 19:18:36;1704651516;18;Second
07/01/2024 19:18:36;1704651516;20;Second
07/01/2024 19:18:36;1704651516;21;First
07/01/2024 19:18:36;1704651516;22;First
07/01/2024 19:18:36;1704651516;24;First
07/01/2024 19:18:36;1704651516;25;Second
07/01/2024 19:18:36;1704651516;28;Second
07/01/2024 19:18:36;1704651516;29;First
07/01/2024 19:18:37;1704651517;17;First
07/01/2024 19:18:37;1704651517;18;Second
07/01/2024 19:18:37;1704651517;19;First
07/01/2024 19:18:37;1704651517;20;First
07/01/2024 19:18:37;1704651517;22;Second
07/01/2024 19:18:37;1704651517;23;First
07/01/2024 19:18:37;1704651517;25;Second
07/01/2024 19:18:37;1704651517;27;Second
07/01/2024 19:18:38;1704651518;16;First
07/01/2024 19:18:38;1704651518;17;Second
07/01/2024 19:18:38;1704651518;20;Second
07/01/2024 19:18:38;1704651518;20;First
07/01/2024 19:18:38;1704651518;23;First
07/01/2024 19:18:39;1704651519;30;Second
07/01/2024 19:18:41;1704651521;89;Second
07/01/2024 19:18:41;1704651521;90;First
07/01/2024 19:18:42;1704651522;17;Second
07/01/2024 19:18:42;1704651522;20;First
07/01/2024 19:18:42;1704651522;21;Second
07/01/2024 19:18:42;1704651522;22;First
07/01/2024 19:18:42;1704651522;23;First
07/01/2024 19:18:42;1704651522;24;Second
07/01/2024 19:18:42;1704651522;25;First
07/01/2024 19:18:42;1704651522;27;Second
07/01/2024 19:18:43;1704651523;16;First
07/01/2024 19:18:43;1704651523;17;Second
07/01/2024 19:18:44;1704651524;20;First
07/01/2024 19:18:44;1704651524;21;Second
07/01/2024 19:18:44;1704651524;24;First
07/01/2024 19:18:44;1704651524;24;Second
07/01/2024 19:18:44;1704651524;26;Second
07/01/2024 19:18:44;1704651524;27;First
07/01/2024 19:18:45;1704651525;17;Second
07/01/2024 19:18:45;1704651525;17;First
07/01/2024 19:18:45;1704651525;20;Second
07/01/2024 19:18:45;1704651525;21;First
07/01/2024 19:18:45;1704651525;22;Second
07/01/2024 19:18:45;1704651525;24;First
07/01/2024 19:18:45;1704651525;25;Second
07/01/2024 19:18:45;1704651525;25;First
07/01/2024 19:18:46;1704651526;18;Second
07/01/2024 19:18:47;1704651527;20;First
07/01/2024 19:18:47;1704651527;23;First
07/01/2024 19:18:47;1704651527;26;First
07/01/2024 19:18:47;1704651527;27;Second
07/01/2024 19:18:47;1704651527;29;Second
07/01/2024 19:18:47;1704651527;29;First
07/01/2024 19:18:47;1704651527;32;Second
07/01/2024 19:18:49;1704651529;20;First
07/01/2024 19:18:49;1704651529;20;Second
07/01/2024 19:18:49;1704651529;21;First
07/01/2024 19:18:49;1704651529;26;Second
07/01/2024 19:18:49;1704651529;26;First
07/01/2024 19:18:49;1704651529;28;First
07/01/2024 19:18:49;1704651529;30;Second
07/01/2024 19:18:49;1704651529;33;Second
07/01/2024 19:18:50;1704651530;17;Second
07/01/2024 19:18:50;1704651530;17;First
07/01/2024 19:18:50;1704651530;20;First
07/01/2024 19:18:50;1704651530;20;Second
07/01/2024 19:18:50;1704651530;22;Second
07/01/2024 19:18:50;1704651530;22;First
07/01/2024 19:18:50;1704651530;24;Second
07/01/2024 19:18:50;1704651530;24;First
07/01/2024 19:18:51;1704651531;17;First
07/01/2024 19:18:51;1704651531;18;Second
07/01/2024 19:18:51;1704651531;19;First
07/01/2024 19:18:51;1704651531;20;Second
07/01/2024 19:18:51;1704651531;20;First
07/01/2024 19:18:51;1704651531;22;Second
07/01/2024 19:18:51;1704651531;26;Second
07/01/2024 19:18:51;1704651531;26;First
07/01/2024 19:18:52;1704651532;15;First
07/01/2024 19:18:52;1704651532;16;Second
07/01/2024 19:18:52;1704651532;17;Second
07/01/2024 19:18:52;1704651532;20;First
07/01/2024 19:18:52;1704651532;21;Second
07/01/2024 19:18:52;1704651532;21;First
07/01/2024 19:18:52;1704651532;22;Second
07/01/2024 19:18:52;1704651532;23;First
07/01/2024 19:18:53;1704651533;16;Second
07/01/2024 19:18:54;1704651534;18;First
07/01/2024 19:18:54;1704651534;20;Second
07/01/2024 19:18:54;1704651534;22;Second
07/01/2024 19:18:54;1704651534;23;First
07/01/2024 19:18:54;1704651534;26;First
07/01/2024 19:19:06;1704651546;299;First
07/01/2024 19:19:06;1704651546;299;Second
07/01/2024 19:19:07;1704651547;16;Second
07/01/2024 19:19:07;1704651547;19;First
07/01/2024 19:19:07;1704651547;20;Second
07/01/2024 19:19:07;1704651547;22;First
07/01/2024 19:19:07;1704651547;22;Second
07/01/2024 19:19:07;1704651547;27;First
07/01/2024 19:19:08;1704651548;30;First
07/01/2024 19:19:08;1704651548;31;Second
07/01/2024 19:19:08;1704651548;15;Second
07/01/2024 19:19:08;1704651548;18;First
07/01/2024 19:19:08;1704651548;19;Second
07/01/2024 19:19:08;1704651548;19;First
07/01/2024 19:19:08;1704651548;21;First
07/01/2024 19:19:08;1704651548;21;Second
07/01/2024 19:19:09;1704651549;24;Second
07/01/2024 19:19:09;1704651549;24;First
