07/01/2024 21:26:03;1704659163;300
07/01/2024 21:26:03;1704659163;13
07/01/2024 21:26:04;1704659164;14
07/01/2024 21:26:05;1704659165;12
07/01/2024 21:26:06;1704659166;31
07/01/2024 21:26:07;1704659167;15
07/01/2024 21:26:08;1704659168;22
07/01/2024 21:26:08;1704659168;14
07/01/2024 21:26:09;1704659169;19
07/01/2024 21:26:10;1704659170;21
07/01/2024 21:26:11;1704659171;12
07/01/2024 21:26:11;1704659171;14
07/01/2024 21:26:12;1704659172;13
07/01/2024 21:26:12;1704659172;14
07/01/2024 21:26:13;1704659173;15
07/01/2024 21:26:14;1704659174;13
07/01/2024 21:26:15;1704659175;13
07/01/2024 21:26:15;1704659175;15
07/01/2024 21:26:16;1704659176;21
07/01/2024 21:26:17;1704659177;14
07/01/2024 21:26:18;1704659178;14
07/01/2024 21:26:18;1704659178;16
07/01/2024 21:26:19;1704659179;24
07/01/2024 21:26:20;1704659180;13
07/01/2024 21:26:20;1704659180;14
07/01/2024 21:26:21;1704659181;15
07/01/2024 21:26:22;1704659182;14
07/01/2024 21:26:23;1704659183;17
07/01/2024 21:26:24;1704659184;13
07/01/2024 21:26:24;1704659184;15
07/01/2024 21:26:25;1704659185;15
07/01/2024 21:26:31;1704659191;299
07/01/2024 21:26:32;1704659192;15
07/01/2024 21:26:32;1704659192;12
07/01/2024 21:26:33;1704659193;21
07/01/2024 21:26:34;1704659194;18
07/01/2024 21:26:35;1704659195;25
07/01/2024 21:26:36;1704659196;26
07/01/2024 21:26:37;1704659197;14
07/01/2024 21:26:38;1704659198;16
07/01/2024 21:26:39;1704659199;16
07/01/2024 21:26:40;1704659200;26
07/01/2024 21:26:41;1704659201;24
07/01/2024 21:26:42;1704659202;14
07/01/2024 21:26:42;1704659202;12
07/01/2024 21:26:43;1704659203;21
07/01/2024 21:26:44;1704659204;15
07/01/2024 21:26:45;1704659205;14
07/01/2024 21:26:46;1704659206;14
07/01/2024 21:26:47;1704659207;19
07/01/2024 21:26:48;1704659208;21
07/01/2024 21:26:48;1704659208;13
07/01/2024 21:26:49;1704659209;19
07/01/2024 21:26:50;1704659210;13
07/01/2024 21:26:51;1704659211;13
07/01/2024 21:26:52;1704659212;21
07/01/2024 21:26:53;1704659213;16
07/01/2024 21:26:53;1704659213;14
07/01/2024 21:26:54;1704659214;21
07/01/2024 21:26:55;1704659215;19
07/01/2024 21:26:55;1704659215;18
07/01/2024 21:26:56;1704659216;14
07/01/2024 21:26:57;1704659217;16
07/01/2024 21:26:58;1704659218;14
07/01/2024 21:26:58;1704659218;14
07/01/2024 21:27:00;1704659220;22
07/01/2024 21:27:01;1704659221;21
07/01/2024 21:27:02;1704659222;16
07/01/2024 21:27:03;1704659223;15
07/01/2024 21:27:03;1704659223;14
07/01/2024 21:27:04;1704659224;25
07/01/2024 21:27:05;1704659225;15
07/01/2024 21:27:11;1704659231;299
07/01/2024 21:27:11;1704659231;14
07/01/2024 21:27:12;1704659232;14
07/01/2024 21:27:13;1704659233;15
07/01/2024 21:27:14;1704659234;15
07/01/2024 21:27:16;1704659236;52
07/01/2024 21:27:17;1704659237;14
07/01/2024 21:27:18;1704659238;15
07/01/2024 21:27:19;1704659239;15
07/01/2024 21:27:20;1704659240;14
07/01/2024 21:27:21;1704659241;21
07/01/2024 21:27:22;1704659242;16
07/01/2024 21:27:23;1704659243;13
07/01/2024 21:27:23;1704659243;13
07/01/2024 21:27:25;1704659245;23
07/01/2024 21:27:26;1704659246;16
07/01/2024 21:27:26;1704659246;22
07/01/2024 21:27:28;1704659248;29
07/01/2024 21:27:28;1704659248;13
07/01/2024 21:27:29;1704659249;15
07/01/2024 21:27:30;1704659250;14
07/01/2024 21:27:30;1704659250;13
07/01/2024 21:27:31;1704659251;13
07/01/2024 21:27:33;1704659253;31
07/01/2024 21:27:33;1704659253;12
07/01/2024 21:27:34;1704659254;14
07/01/2024 21:27:35;1704659255;15
07/01/2024 21:27:36;1704659256;13
