05/01/2024 22:24:27;1704489867;16
05/01/2024 22:24:27;1704489867;11
05/01/2024 22:24:28;1704489868;11
05/01/2024 22:24:28;1704489868;11
05/01/2024 22:24:28;1704489868;11
05/01/2024 22:24:28;1704489868;10
05/01/2024 22:24:28;1704489868;11
05/01/2024 22:24:29;1704489869;11
05/01/2024 22:24:29;1704489869;11
05/01/2024 22:24:29;1704489869;10
05/01/2024 22:24:29;1704489869;11
05/01/2024 22:24:29;1704489869;11
05/01/2024 22:24:30;1704489870;11
05/01/2024 22:24:30;1704489870;10
05/01/2024 22:24:30;1704489870;11
05/01/2024 22:24:30;1704489870;11
05/01/2024 22:24:30;1704489870;10
05/01/2024 22:24:31;1704489871;11
05/01/2024 22:24:31;1704489871;11
05/01/2024 22:24:31;1704489871;10
05/01/2024 22:24:31;1704489871;10
05/01/2024 22:24:31;1704489871;11
05/01/2024 22:24:32;1704489872;11
05/01/2024 22:24:32;1704489872;11
05/01/2024 22:24:32;1704489872;10
05/01/2024 22:24:32;1704489872;11
05/01/2024 22:24:32;1704489872;11
05/01/2024 22:24:32;1704489872;11
05/01/2024 22:24:33;1704489873;10
05/01/2024 22:24:33;1704489873;12
