07/01/2024 20:58:14;1704657494;38
07/01/2024 20:58:14;1704657494;13
07/01/2024 20:58:14;1704657494;14
07/01/2024 20:58:15;1704657495;13
07/01/2024 20:58:15;1704657495;15
07/01/2024 20:58:15;1704657495;15
07/01/2024 20:58:15;1704657495;14
07/01/2024 20:58:16;1704657496;14
07/01/2024 20:58:16;1704657496;14
07/01/2024 20:58:16;1704657496;15
07/01/2024 20:58:16;1704657496;15
07/01/2024 20:58:16;1704657496;15
07/01/2024 20:58:17;1704657497;14
07/01/2024 20:58:17;1704657497;14
07/01/2024 20:58:17;1704657497;15
07/01/2024 20:58:17;1704657497;15
07/01/2024 20:58:18;1704657498;14
07/01/2024 20:58:18;1704657498;14
07/01/2024 20:58:18;1704657498;15
07/01/2024 20:58:18;1704657498;14
07/01/2024 20:58:18;1704657498;14
07/01/2024 20:58:19;1704657499;15
07/01/2024 20:58:19;1704657499;16
07/01/2024 20:58:19;1704657499;14
07/01/2024 20:58:19;1704657499;14
07/01/2024 20:58:20;1704657500;15
07/01/2024 20:58:20;1704657500;13
07/01/2024 20:58:20;1704657500;13
07/01/2024 20:58:20;1704657500;15
07/01/2024 20:58:21;1704657501;14
07/01/2024 20:58:21;1704657501;15
07/01/2024 20:58:21;1704657501;15
07/01/2024 20:58:21;1704657501;14
07/01/2024 20:58:21;1704657501;15
07/01/2024 20:58:22;1704657502;15
07/01/2024 20:58:22;1704657502;15
07/01/2024 20:58:22;1704657502;14
07/01/2024 20:58:22;1704657502;16
07/01/2024 20:58:23;1704657503;14
07/01/2024 20:58:23;1704657503;14
07/01/2024 20:58:23;1704657503;14
07/01/2024 20:58:23;1704657503;15
07/01/2024 20:58:23;1704657503;15
07/01/2024 20:58:24;1704657504;14
07/01/2024 20:58:24;1704657504;14
07/01/2024 20:58:24;1704657504;13
07/01/2024 20:58:24;1704657504;14
07/01/2024 20:58:25;1704657505;15
07/01/2024 20:58:25;1704657505;15
07/01/2024 20:58:25;1704657505;14
07/01/2024 20:58:25;1704657505;14
07/01/2024 20:58:25;1704657505;14
07/01/2024 20:58:26;1704657506;14
07/01/2024 20:58:26;1704657506;12
07/01/2024 20:58:26;1704657506;14
07/01/2024 20:58:26;1704657506;15
07/01/2024 20:58:27;1704657507;15
07/01/2024 20:58:27;1704657507;14
07/01/2024 20:58:27;1704657507;15
07/01/2024 20:58:27;1704657507;16
07/01/2024 20:58:28;1704657508;16
07/01/2024 20:58:28;1704657508;13
07/01/2024 20:58:28;1704657508;14
07/01/2024 20:58:28;1704657508;15
07/01/2024 20:58:28;1704657508;16
07/01/2024 20:58:29;1704657509;15
07/01/2024 20:58:29;1704657509;14
07/01/2024 20:58:29;1704657509;14
07/01/2024 20:58:29;1704657509;13
07/01/2024 20:58:30;1704657510;15
07/01/2024 20:58:30;1704657510;15
07/01/2024 20:58:30;1704657510;13
07/01/2024 20:58:30;1704657510;16
07/01/2024 20:58:31;1704657511;14
07/01/2024 20:58:31;1704657511;15
07/01/2024 20:58:31;1704657511;16
07/01/2024 20:58:31;1704657511;16
07/01/2024 20:58:32;1704657512;14
07/01/2024 20:58:32;1704657512;14
07/01/2024 20:58:32;1704657512;15
07/01/2024 20:58:32;1704657512;14
07/01/2024 20:58:33;1704657513;14
07/01/2024 20:58:33;1704657513;13
07/01/2024 20:58:33;1704657513;14
07/01/2024 20:58:33;1704657513;14
07/01/2024 20:58:34;1704657514;14
07/01/2024 20:58:34;1704657514;15
07/01/2024 20:58:34;1704657514;14
07/01/2024 20:58:35;1704657515;15
07/01/2024 20:58:35;1704657515;15
07/01/2024 20:58:35;1704657515;13
07/01/2024 20:58:35;1704657515;14
07/01/2024 20:58:36;1704657516;16
07/01/2024 20:58:36;1704657516;14
07/01/2024 20:58:36;1704657516;13
07/01/2024 20:58:36;1704657516;15
07/01/2024 20:58:37;1704657517;14
07/01/2024 20:58:37;1704657517;14
07/01/2024 20:58:37;1704657517;15
07/01/2024 20:58:38;1704657518;15
