%YAML 1.1
%TAG !u! tag:unity3d.com,2011:
--- !u!64 &7305388085036936187
MeshCollider:
  m_ObjectHideFlags: 0
  m_CorrespondingSourceObject: {fileID: 0}
  m_PrefabInstance: {fileID: 0}
  m_PrefabAsset: {fileID: 0}
  m_GameObject: {fileID: 2547057161076192025}
  m_Material: {fileID: 0}
  m_IsTrigger: 0
  m_Enabled: 1
  serializedVersion: 3
  m_Convex: 0
  m_CookingOptions: 30
  m_Mesh: {fileID: -4442912307722685990, guid: a3dc25435161d549f956bb7f2dd6ed26, type: 3}
--- !u!1001 &5798696679846767120
PrefabInstance:
  m_ObjectHideFlags: 0
  serializedVersion: 2
  m_Modification:
    m_TransformParent: {fileID: 0}
    m_Modifications:
    - target: {fileID: -4216859302048453862, guid: a3dc25435161d549f956bb7f2dd6ed26,
        type: 3}
      propertyPath: m_LocalPosition.x
      value: -0
      objectReference: {fileID: 0}
    - target: {fileID: -4216859302048453862, guid: a3dc25435161d549f956bb7f2dd6ed26,
        type: 3}
      propertyPath: m_LocalPosition.y
      value: 0
      objectReference: {fileID: 0}
    - target: {fileID: -4216859302048453862, guid: a3dc25435161d549f956bb7f2dd6ed26,
        type: 3}
      propertyPath: m_LocalPosition.z
      value: 0
      objectReference: {fileID: 0}
    - target: {fileID: -4216859302048453862, guid: a3dc25435161d549f956bb7f2dd6ed26,
        type: 3}
      propertyPath: m_LocalRotation.x
      value: 0.000000021855694
      objectReference: {fileID: 0}
    - target: {fileID: -4216859302048453862, guid: a3dc25435161d549f956bb7f2dd6ed26,
        type: 3}
      propertyPath: m_LocalRotation.y
      value: -0
      objectReference: {fileID: 0}
    - target: {fileID: -4216859302048453862, guid: a3dc25435161d549f956bb7f2dd6ed26,
        type: 3}
      propertyPath: m_LocalRotation.z
      value: -0
      objectReference: {fileID: 0}
    - target: {fileID: -4216859302048453862, guid: a3dc25435161d549f956bb7f2dd6ed26,
        type: 3}
      propertyPath: m_LocalRotation.w
      value: 1
      objectReference: {fileID: 0}
    - target: {fileID: -4216859302048453862, guid: a3dc25435161d549f956bb7f2dd6ed26,
        type: 3}
      propertyPath: m_RootOrder
      value: 0
      objectReference: {fileID: 0}
    - target: {fileID: -4216859302048453862, guid: a3dc25435161d549f956bb7f2dd6ed26,
        type: 3}
      propertyPath: m_LocalEulerAnglesHint.x
      value: 0
      objectReference: {fileID: 0}
    - target: {fileID: -4216859302048453862, guid: a3dc25435161d549f956bb7f2dd6ed26,
        type: 3}
      propertyPath: m_LocalEulerAnglesHint.y
      value: 0
      objectReference: {fileID: 0}
    - target: {fileID: -4216859302048453862, guid: a3dc25435161d549f956bb7f2dd6ed26,
        type: 3}
      propertyPath: m_LocalEulerAnglesHint.z
      value: 0
      objectReference: {fileID: 0}
    - target: {fileID: -927199367670048503, guid: a3dc25435161d549f956bb7f2dd6ed26,
        type: 3}
      propertyPath: m_Name
      value: Carla
      objectReference: {fileID: 0}
    - target: {fileID: 1427550505242414805, guid: a3dc25435161d549f956bb7f2dd6ed26,
        type: 3}
      propertyPath: m_Materials.Array.data[0]
      value: 
      objectReference: {fileID: 2100000, guid: dbf94e33b1e1f62979506feb65fb5159, type: 2}
    m_RemovedComponents: []
  m_SourcePrefab: {fileID: 100100000, guid: a3dc25435161d549f956bb7f2dd6ed26, type: 3}
--- !u!1 &2547057161076192025 stripped
GameObject:
  m_CorrespondingSourceObject: {fileID: -927199367670048503, guid: a3dc25435161d549f956bb7f2dd6ed26,
    type: 3}
  m_PrefabInstance: {fileID: 5798696679846767120}
  m_PrefabAsset: {fileID: 0}
