^C:\USERS\ПК\SOURCE\REPOS\HPC_LAB_2\DEBUG\HPC_LAB_2.OBJ
C:\USERS\пк\SOURCE\REPOS\HPC_LAB_2\DEBUG\HPC_LAB_2.EXE
C:\USERS\пк\SOURCE\REPOS\HPC_LAB_2\DEBUG\HPC_LAB_2.ILK
C:\USERS\ПК\SOURCE\REPOS\HPC_LAB_2\DEBUG\HPC_LAB_2.PDB
