{
  "name": "Fatturazione",
  "fields": [],
  "relationships": [
    {
      "relationshipType": "one-to-one",
      "otherEntityName": "fattura",
      "otherEntityRelationshipName": "fatturazione",
      "relationshipName": "fattura",
      "otherEntityField": "id",
      "ownerSide": true
    }
  ],
  "changelogDate": "20210311112459",
  "entityTableName": "fatturazione",
  "dto": "no",
  "pagination": "no",
  "service": "no",
  "jpaMetamodelFiltering": false,
  "fluentMethods": true,
  "readOnly": false,
  "embedded": false,
  "clientRootFolder": "",
  "applications": "*"
}
