id;tipo
1;HTTP generate
2;cross-platform CSS Marketing
3;Berkshire
4;Program New Caledonia
5;Avon
6;Auto Loan Account groupware
7;transmitting schemas Run
8;indigo
9;West Virginia compress
10;virtual Mobility
