{
  "fluentMethods": true,
  "clientRootFolder": "",
  "relationships": [
    {
      "relationshipName": "user",
      "otherEntityName": "user",
      "relationshipType": "many-to-one",
      "otherEntityField": "login",
      "ownerSide": true,
      "otherEntityRelationshipName": "bloodPressure"
    }
  ],
  "fields": [
    {
      "fieldName": "date",
      "fieldType": "LocalDate",
      "fieldValidateRules": ["required"]
    },
    {
      "fieldName": "systolic",
      "fieldType": "Integer"
    },
    {
      "fieldName": "diastolic",
      "fieldType": "Integer"
    }
  ],
  "changelogDate": "20210114145910",
  "dto": "no",
  "searchEngine": "elasticsearch",
  "service": "serviceClass",
  "entityTableName": "blood_pressure",
  "databaseType": "sql",
  "readOnly": false,
  "jpaMetamodelFiltering": false,
  "pagination": "pagination"
}
