{
	"info": {
		"_postman_id": "5712c177-224b-464a-a358-16d64e02e7a8",
		"name": "Demo Quarkus Interceptor",
		"schema": "https://schema.getpostman.com/json/collection/v2.1.0/collection.json"
	},
	"item": [
		{
			"name": "hello_withoutException",
			"request": {
				"method": "GET",
				"header": [],
				"url": {
					"raw": "http://localhost:8080/v1/hello?exceptionLevel=0",
					"protocol": "http",
					"host": [
						"localhost"
					],
					"port": "8080",
					"path": [
						"v1",
						"hello"
					],
					"query": [
						{
							"key": "exceptionLevel",
							"value": "0"
						}
					]
				}
			},
			"response": []
		},
		{
			"name": "hello_withoutException",
			"request": {
				"method": "POST",
				"header": [],
				"body": {
					"mode": "raw",
					"raw": "{\r\n\t\"nome\": \"aaaaa\"\r\n}",
					"options": {
						"raw": {
							"language": "json"
						}
					}
				},
				"url": {
					"raw": "http://localhost:8080/v1/hello?exceptionLevel=0",
					"protocol": "http",
					"host": [
						"localhost"
					],
					"port": "8080",
					"path": [
						"v1",
						"hello"
					],
					"query": [
						{
							"key": "exceptionLevel",
							"value": "0"
						}
					]
				}
			},
			"response": []
		},
		{
			"name": "hello_exceptionLevel",
			"request": {
				"method": "GET",
				"header": [],
				"url": {
					"raw": "http://localhost:8080/v1/hello?exceptionLevel=1",
					"protocol": "http",
					"host": [
						"localhost"
					],
					"port": "8080",
					"path": [
						"v1",
						"hello"
					],
					"query": [
						{
							"key": "exceptionLevel",
							"value": "1"
						},
						{
							"key": "exceptionLevel",
							"value": "2",
							"disabled": true
						},
						{
							"key": "exceptionLevel",
							"value": "3",
							"disabled": true
						}
					]
				}
			},
			"response": []
		},
		{
			"name": "hello_exceptionLevel",
			"request": {
				"method": "POST",
				"header": [],
				"body": {
					"mode": "raw",
					"raw": "{\r\n\t\"nome\": \"aaaaa\"\r\n}",
					"options": {
						"raw": {
							"language": "json"
						}
					}
				},
				"url": {
					"raw": "http://localhost:8080/v1/hello?exceptionLevel=1",
					"protocol": "http",
					"host": [
						"localhost"
					],
					"port": "8080",
					"path": [
						"v1",
						"hello"
					],
					"query": [
						{
							"key": "exceptionLevel",
							"value": "1"
						},
						{
							"key": "exceptionLevel",
							"value": "2",
							"disabled": true
						},
						{
							"key": "exceptionLevel",
							"value": "3",
							"disabled": true
						}
					]
				}
			},
			"response": []
		},
		{
			"name": "hello_exception_validationJsonInput",
			"request": {
				"method": "POST",
				"header": [],
				"body": {
					"mode": "raw",
					"raw": "{\r\n\t\"nome\": \"\"\r\n}",
					"options": {
						"raw": {
							"language": "json"
						}
					}
				},
				"url": {
					"raw": "http://localhost:8080/v1/hello?exceptionLevel=1",
					"protocol": "http",
					"host": [
						"localhost"
					],
					"port": "8080",
					"path": [
						"v1",
						"hello"
					],
					"query": [
						{
							"key": "exceptionLevel",
							"value": "1"
						},
						{
							"key": "exceptionLevel",
							"value": "2",
							"disabled": true
						},
						{
							"key": "exceptionLevel",
							"value": "3",
							"disabled": true
						}
					]
				}
			},
			"response": []
		},
		{
			"name": "hello_bis",
			"request": {
				"method": "GET",
				"header": [],
				"url": {
					"raw": "http://localhost:8080/v1/helloBis",
					"protocol": "http",
					"host": [
						"localhost"
					],
					"port": "8080",
					"path": [
						"v1",
						"helloBis"
					]
				}
			},
			"response": []
		},
		{
			"name": "hello_bis",
			"request": {
				"method": "POST",
				"header": [],
				"body": {
					"mode": "raw",
					"raw": "{\r\n\t\"nome\": \"aaaa\"\r\n}",
					"options": {
						"raw": {
							"language": "json"
						}
					}
				},
				"url": {
					"raw": "http://localhost:8080/v1/helloBis",
					"protocol": "http",
					"host": [
						"localhost"
					],
					"port": "8080",
					"path": [
						"v1",
						"helloBis"
					]
				}
			},
			"response": []
		}
	]
}