------ Animal TOO LARGE ----
folder=PosixPath('/media/frederic/DATA/Frederic_MAD/2024_image_datasets/train/DBCA_WA_humpback_whales_aerial_V_50')
file_name='170913-115523-AbovePhoto-061858.JPG'
annotation['bbox']=[2277, 1682, 2526, 2282]
------ Animal TOO LARGE ----
folder=PosixPath('/media/frederic/DATA/Frederic_MAD/2024_image_datasets/train/DBCA_WA_humpback_whales_aerial_V_50')
file_name='170913-163538-AbovePhoto-080897.JPG'
annotation['bbox']=[1752, 5265, 2352, 5654]
------ Animal TOO LARGE ----
folder=PosixPath('/media/frederic/DATA/Frederic_MAD/2024_image_datasets/train/DBCA_WA_humpback_whales_aerial_V_50')
file_name='170915-122742-AbovePhotography-022A2756.JPG'
annotation['bbox']=[507, 3360, 1063, 3960]
------ Animal TOO LARGE ----
folder=PosixPath('/media/frederic/DATA/Frederic_MAD/2024_image_datasets/train/DBCA_WA_humpback_whales_aerial_V_50')
file_name='170915-123034-AbovePhotography-0K2A9887.JPG'
annotation['bbox']=[2112, 1746, 2703, 2346]
------ Animal TOO LARGE ----
folder=PosixPath('/media/frederic/DATA/Frederic_MAD/2024_image_datasets/train/DBCA_WA_humpback_whales_aerial_V_50')
file_name='170915-124020-AbovePhotography-0K2A0509.JPG'
annotation['bbox']=[166, 12, 427, 612]
------ Animal TOO LARGE ----
folder=PosixPath('/media/frederic/DATA/Frederic_MAD/2024_image_datasets/train/DBCA_WA_humpback_whales_aerial_V_50')
file_name='170915-130516-AbovePhotography-ABVE6438.JPG'
annotation['bbox']=[1537, 1095, 1884, 1695]
------ Animal TOO LARGE ----
folder=PosixPath('/media/frederic/DATA/Frederic_MAD/2024_image_datasets/train/DBCA_WA_humpback_whales_aerial_V_50')
file_name='170915-172438-AbovePhotography-ABVE1101.JPG'
annotation['bbox']=[2466, 973, 2915, 1573]
------ Animal TOO LARGE ----
folder=PosixPath('/media/frederic/DATA/Frederic_MAD/2024_image_datasets/train/DBCA_WA_humpback_whales_aerial_V_50')
file_name='170915-172510-AbovePhotography-ABVE1157.JPG'
annotation['bbox']=[1432, 2469, 1824, 3069]
------ Animal TOO LARGE ----
folder=PosixPath('/media/frederic/DATA/Frederic_MAD/2024_image_datasets/train/DBCA_WA_humpback_whales_aerial_V_50')
file_name='170915-173808-AbovePhotography-ABVE2157.JPG'
annotation['bbox']=[100, 653, 321, 1253]
------ Animal TOO LARGE ----
folder=PosixPath('/media/frederic/DATA/Frederic_MAD/2024_image_datasets/train/DBCA_WA_humpback_whales_aerial_V_50')
file_name='170915-173941-AbovePhotography-ABVE2320.JPG'
annotation['bbox']=[1573, 1567, 2173, 2066]
------ Animal TOO LARGE ----
folder=PosixPath('/media/frederic/DATA/Frederic_MAD/2024_image_datasets/train/DBCA_WA_humpback_whales_aerial_V_50')
file_name='170915-173943-AbovePhotography-ABVE2323.JPG'
annotation['bbox']=[1097, 1624, 1380, 2224]
------ Animal TOO LARGE ----
folder=PosixPath('/media/frederic/DATA/Frederic_MAD/2024_image_datasets/train/DBCA_WA_humpback_whales_aerial_V_50')
file_name='170915-174012-AbovePhotography-022A2225.JPG'
annotation['bbox']=[2534, 3427, 2847, 4027]
------ Animal TOO LARGE ----
folder=PosixPath('/media/frederic/DATA/Frederic_MAD/2024_image_datasets/train/DBCA_WA_humpback_whales_aerial_V_50')
file_name='170915-174206-AbovePhotography-022A2423.JPG'
annotation['bbox']=[717, 1071, 1317, 1360]
------ Animal TOO LARGE ----
folder=PosixPath('/media/frederic/DATA/Frederic_MAD/2024_image_datasets/train/images_42')
file_name='230609-122734-Star-3261.JPG'
annotation['bbox']=[1518, 3710, 2516, 4358]
------ Animal TOO LARGE ----
folder=PosixPath('/media/frederic/DATA/Frederic_MAD/2024_image_datasets/train/images_42')
file_name='230609-122734-Star-3262.JPG'
annotation['bbox']=[3953, 3544, 4944, 4164]
------ Animal TOO LARGE ----
folder=PosixPath('/media/frederic/DATA/Frederic_MAD/2024_image_datasets/train/images_42')
file_name='230609-122735-Star-3263.JPG'
annotation['bbox']=[6404, 3331, 7317, 3963]
------ Animal TOO LARGE ----
folder=PosixPath('/media/frederic/DATA/Frederic_MAD/2024_image_datasets/train/Tassie_Minke_whales_T_57')
file_name='TAS_01_09_Wpt2_DSC_0009.JPG'
annotation['bbox']=[372, 369, 517, 969]
------ Animal TOO LARGE ----
folder=PosixPath('/media/frederic/DATA/Frederic_MAD/2024_image_datasets/train/Tassie_Minke_whales_T_57')
file_name='TAS_01_09_Wpt2_DSC_0011.JPG'
annotation['bbox']=[424, 459, 629, 1059]
------ Animal TOO LARGE ----
folder=PosixPath('/media/frederic/DATA/Frederic_MAD/2024_image_datasets/train/Tassie_Minke_whales_T_57')
file_name='TAS_01_09_Wpt2_DSC_0012.JPG'
annotation['bbox']=[402, 828, 581, 1428]
------ Animal TOO LARGE ----
folder=PosixPath('/media/frederic/DATA/Frederic_MAD/2024_image_datasets/train/Tassie_Minke_whales_T_57')
file_name='TAS_01_09_Wpt2_DSC_0021.JPG'
annotation['bbox']=[478, 307, 657, 907]
------ Animal TOO LARGE ----
folder=PosixPath('/media/frederic/DATA/Frederic_MAD/2024_image_datasets/train/Tassie_Minke_whales_T_57')
file_name='TAS_01_09_Wpt2_DSC_0022.JPG'
annotation['bbox']=[618, 558, 795, 1158]
------ Animal TOO LARGE ----
folder=PosixPath('/media/frederic/DATA/Frederic_MAD/2024_image_datasets/train/Tassie_Minke_whales_T_57')
file_name='TAS_01_09_Wpt2_DSC_0023.JPG'
annotation['bbox']=[603, 824, 877, 1424]
------ Animal TOO LARGE ----
folder=PosixPath('/media/frederic/DATA/Frederic_MAD/2024_image_datasets/train/Tassie_Minke_whales_T_57')
file_name='TAS_01_09_Wpt2_DSC_0024.JPG'
annotation['bbox']=[684, 859, 947, 1459]
------ Animal TOO LARGE ----
folder=PosixPath('/media/frederic/DATA/Frederic_MAD/2024_image_datasets/train/Tassie_Minke_whales_T_57')
file_name='TAS_01_09_Wpt2_DSC_0030.JPG'
annotation['bbox']=[486, 742, 725, 1342]
------ Animal TOO LARGE ----
folder=PosixPath('/media/frederic/DATA/Frederic_MAD/2024_image_datasets/train/Tassie_Minke_whales_T_57')
file_name='TAS_01_09_Wpt2_DSC_0032.JPG'
annotation['bbox']=[528, 772, 824, 1372]
------ Animal TOO LARGE ----
folder=PosixPath('/media/frederic/DATA/Frederic_MAD/2024_image_datasets/train/Tassie_Minke_whales_T_57')
file_name='TAS_01_09_Wpt2_DSC_0033.JPG'
annotation['bbox']=[612, 838, 890, 1438]
------ Animal TOO LARGE ----
folder=PosixPath('/media/frederic/DATA/Frederic_MAD/2024_image_datasets/train/Tassie_Minke_whales_T_57')
file_name='TAS_01_09_Wpt2_DSC_0034.JPG'
annotation['bbox']=[438, 849, 740, 1449]
------ Animal TOO LARGE ----
folder=PosixPath('/media/frederic/DATA/Frederic_MAD/2024_image_datasets/train/Tassie_Minke_whales_T_57')
file_name='TAS_01_09_Wpt2_DSC_0035.JPG'
annotation['bbox']=[521, 979, 857, 1579]
------ Animal TOO LARGE ----
folder=PosixPath('/media/frederic/DATA/Frederic_MAD/2024_image_datasets/train/Tassie_Minke_whales_T_57')
file_name='TAS_01_09_Wpt2_DSC_0036.JPG'
annotation['bbox']=[611, 870, 980, 1470]
------ Animal TOO LARGE ----
folder=PosixPath('/media/frederic/DATA/Frederic_MAD/2024_image_datasets/train/Tassie_Minke_whales_T_57')
file_name='TAS_01_09_Wpt2_DSC_0037.JPG'
annotation['bbox']=[878, 1122, 1299, 1722]
------ Animal TOO LARGE ----
folder=PosixPath('/media/frederic/DATA/Frederic_MAD/2024_image_datasets/train/Tassie_Minke_whales_T_57')
file_name='TAS_01_09_Wpt2_DSC_0038.JPG'
annotation['bbox']=[880, 1404, 1383, 2004]
------ Animal TOO LARGE ----
folder=PosixPath('/media/frederic/DATA/Frederic_MAD/2024_image_datasets/train/Tassie_Minke_whales_T_57')
file_name='TAS_01_09_Wpt2_DSC_0039.JPG'
annotation['bbox']=[1308, 1465, 1843, 2065]
------ Animal TOO LARGE ----
folder=PosixPath('/media/frederic/DATA/Frederic_MAD/2024_image_datasets/train/Tassie_Minke_whales_T_57')
file_name='TAS_01_10_Wpt2_DSC_0001.JPG'
annotation['bbox']=[445, 315, 785, 915]
------ Animal TOO LARGE ----
folder=PosixPath('/media/frederic/DATA/Frederic_MAD/2024_image_datasets/train/Tassie_Minke_whales_T_57')
file_name='TAS_01_10_Wpt2_DSC_0002.JPG'
annotation['bbox']=[510, 497, 959, 1097]
------ Animal TOO LARGE ----
folder=PosixPath('/media/frederic/DATA/Frederic_MAD/2024_image_datasets/train/Tassie_Minke_whales_T_57')
file_name='TAS_01_10_Wpt2_DSC_0004.JPG'
annotation['bbox']=[504, 312, 637, 912]
------ Animal TOO LARGE ----
folder=PosixPath('/media/frederic/DATA/Frederic_MAD/2024_image_datasets/train/Tassie_Minke_whales_T_57')
file_name='TAS_01_10_Wpt2_DSC_0005.JPG'
annotation['bbox']=[514, 409, 629, 1009]
------ Animal TOO LARGE ----
folder=PosixPath('/media/frederic/DATA/Frederic_MAD/2024_image_datasets/train/Tassie_Minke_whales_T_57')
file_name='TAS_03_09_Wpt4_DSC_0006.JPG'
annotation['bbox']=[489, 456, 602, 1056]
------ Animal TOO LARGE ----
folder=PosixPath('/media/frederic/DATA/Frederic_MAD/2024_image_datasets/train/Tassie_Minke_whales_T_57')
file_name='TAS_06_08_Wpt1_DSC_0013.JPG'
annotation['bbox']=[228, 594, 386, 1194]
------ Animal TOO LARGE ----
folder=PosixPath('/media/frederic/DATA/Frederic_MAD/2024_image_datasets/train/Tassie_Minke_whales_T_57')
file_name='TAS_06_08_Wpt1_DSC_0019.JPG'
annotation['bbox']=[497, 47, 627, 647]
------ Animal TOO LARGE ----
folder=PosixPath('/media/frederic/DATA/Frederic_MAD/2024_image_datasets/train/Tassie_Minke_whales_T_57')
file_name='TAS_06_08_Wpt1_DSC_0020.JPG'
annotation['bbox']=[356, 256, 499, 856]
------ Animal TOO LARGE ----
folder=PosixPath('/media/frederic/DATA/Frederic_MAD/2024_image_datasets/train/Tassie_Minke_whales_V_3')
file_name='TAS_01_09_Wpt2_DSC_0029.JPG'
annotation['bbox']=[449, 690, 644, 1290]
------ Animal TOO LARGE ----
folder=PosixPath('/media/frederic/DATA/Frederic_MAD/2024_image_datasets/train/Tassie_Minke_whales_V_3')
file_name='TAS_01_10_Wpt2_DSC_0003.JPG'
annotation['bbox']=[558, 673, 1158, 1261]
------ Animal TOO LARGE ----
folder=PosixPath('/media/frederic/DATA/Frederic_MAD/2024_image_datasets/train/Tassie_Minke_whales_V_3')
file_name='TAS_03_09_Wpt4_DSC_0007.JPG'
annotation['bbox']=[316, 224, 528, 824]
------ Animal TOO LARGE ----
folder=PosixPath('/media/frederic/DATA/Frederic_MAD/2024_image_datasets/train/DBCA_WA_humpback_whales_aerial_T_0')
file_name='170913-112118-AbovePhoto-048761.JPG'
annotation['bbox']=[3289, 2190, 3546, 2790]
------ Animal TOO LARGE ----
folder=PosixPath('/media/frederic/DATA/Frederic_MAD/2024_image_datasets/train/DBCA_WA_humpback_whales_aerial_T_0')
file_name='170913-112118-AbovePhoto-048762.JPG'
annotation['bbox']=[2347, 1483, 2733, 2083]
------ Animal TOO LARGE ----
folder=PosixPath('/media/frederic/DATA/Frederic_MAD/2024_image_datasets/train/DBCA_WA_humpback_whales_aerial_T_0')
file_name='170913-112119-AbovePhoto-048763.JPG'
annotation['bbox']=[1608, 1469, 2002, 2069]
------ Animal TOO LARGE ----
folder=PosixPath('/media/frederic/DATA/Frederic_MAD/2024_image_datasets/train/DBCA_WA_humpback_whales_aerial_T_0')
file_name='170913-112119-AbovePhoto-048764.JPG'
annotation['bbox']=[828, 1394, 1194, 1994]
------ Animal TOO LARGE ----
folder=PosixPath('/media/frederic/DATA/Frederic_MAD/2024_image_datasets/train/DBCA_WA_humpback_whales_aerial_T_0')
file_name='170913-112119-AbovePhoto-048765.JPG'
annotation['bbox']=[52, 1393, 463, 1993]
------ Animal TOO LARGE ----
folder=PosixPath('/media/frederic/DATA/Frederic_MAD/2024_image_datasets/train/DBCA_WA_humpback_whales_aerial_T_0')
file_name='170913-115523-AbovePhoto-061859.JPG'
annotation['bbox']=[1723, 1712, 1992, 2312]
------ Animal TOO LARGE ----
folder=PosixPath('/media/frederic/DATA/Frederic_MAD/2024_image_datasets/train/DBCA_WA_humpback_whales_aerial_T_0')
file_name='170913-115523-AbovePhoto-069359.JPG'
annotation['bbox']=[2163, 1568, 2403, 2168]
------ Animal TOO LARGE ----
folder=PosixPath('/media/frederic/DATA/Frederic_MAD/2024_image_datasets/train/DBCA_WA_humpback_whales_aerial_T_0')
file_name='170913-115523-AbovePhoto-069360.JPG'
annotation['bbox']=[1761, 1754, 2029, 2354]
------ Animal TOO LARGE ----
folder=PosixPath('/media/frederic/DATA/Frederic_MAD/2024_image_datasets/train/DBCA_WA_humpback_whales_aerial_T_0')
file_name='170913-115524-AbovePhoto-061860.JPG'
annotation['bbox']=[1105, 1584, 1363, 2184]
------ Animal TOO LARGE ----
folder=PosixPath('/media/frederic/DATA/Frederic_MAD/2024_image_datasets/train/DBCA_WA_humpback_whales_aerial_T_0')
file_name='170913-115524-AbovePhoto-061861.JPG'
annotation['bbox']=[558, 1630, 812, 2230]
------ Animal TOO LARGE ----
folder=PosixPath('/media/frederic/DATA/Frederic_MAD/2024_image_datasets/train/DBCA_WA_humpback_whales_aerial_T_0')
file_name='170913-115524-AbovePhoto-061862.JPG'
annotation['bbox']=[4, 1688, 261, 2288]
------ Animal TOO LARGE ----
folder=PosixPath('/media/frederic/DATA/Frederic_MAD/2024_image_datasets/train/DBCA_WA_humpback_whales_aerial_T_0')
file_name='170913-115524-AbovePhoto-069361.JPG'
annotation['bbox']=[1061, 1504, 1299, 2104]
------ Animal TOO LARGE ----
folder=PosixPath('/media/frederic/DATA/Frederic_MAD/2024_image_datasets/train/DBCA_WA_humpback_whales_aerial_T_0')
file_name='170913-115524-AbovePhoto-069362.JPG'
annotation['bbox']=[565, 1676, 899, 2276]
------ Animal TOO LARGE ----
folder=PosixPath('/media/frederic/DATA/Frederic_MAD/2024_image_datasets/train/DBCA_WA_humpback_whales_aerial_T_0')
file_name='170913-120608-AbovePhoto-048901.JPG'
annotation['bbox']=[1935, 4184, 2237, 4784]
------ Animal TOO LARGE ----
folder=PosixPath('/media/frederic/DATA/Frederic_MAD/2024_image_datasets/train/DBCA_WA_humpback_whales_aerial_T_0')
file_name='170913-120609-AbovePhoto-048902.JPG'
annotation['bbox']=[1071, 5017, 1379, 5617]
------ Animal TOO LARGE ----
folder=PosixPath('/media/frederic/DATA/Frederic_MAD/2024_image_datasets/train/DBCA_WA_humpback_whales_aerial_T_0')
file_name='170913-120610-AbovePhoto-063734.JPG'
annotation['bbox']=[651, 40, 941, 640]
------ Animal TOO LARGE ----
folder=PosixPath('/media/frederic/DATA/Frederic_MAD/2024_image_datasets/train/DBCA_WA_humpback_whales_aerial_T_0')
file_name='170913-160337-AbovePhoto-056353.JPG'
annotation['bbox']=[1980, 2680, 2395, 3280]
------ Animal TOO LARGE ----
folder=PosixPath('/media/frederic/DATA/Frederic_MAD/2024_image_datasets/train/DBCA_WA_humpback_whales_aerial_T_0')
file_name='170913-160337-AbovePhoto-056354.JPG'
annotation['bbox']=[1390, 3448, 1785, 4048]
------ Animal TOO LARGE ----
folder=PosixPath('/media/frederic/DATA/Frederic_MAD/2024_image_datasets/train/DBCA_WA_humpback_whales_aerial_T_0')
file_name='170913-162201-AbovePhoto-078465.JPG'
annotation['bbox']=[599, 6854, 1199, 7025]
------ Animal TOO LARGE ----
folder=PosixPath('/media/frederic/DATA/Frederic_MAD/2024_image_datasets/train/DBCA_WA_humpback_whales_aerial_T_0')
file_name='170913-163209-AbovePhoto-080276.JPG'
annotation['bbox']=[2569, 908, 2832, 1508]
------ Animal TOO LARGE ----
folder=PosixPath('/media/frederic/DATA/Frederic_MAD/2024_image_datasets/train/DBCA_WA_humpback_whales_aerial_T_0')
file_name='170913-163209-AbovePhoto-080277.JPG'
annotation['bbox']=[1715, 964, 1995, 1564]
------ Animal TOO LARGE ----
folder=PosixPath('/media/frederic/DATA/Frederic_MAD/2024_image_datasets/train/DBCA_WA_humpback_whales_aerial_T_0')
file_name='170913-163210-AbovePhoto-080278.JPG'
annotation['bbox']=[844, 976, 1109, 1576]
------ Animal TOO LARGE ----
folder=PosixPath('/media/frederic/DATA/Frederic_MAD/2024_image_datasets/train/DBCA_WA_humpback_whales_aerial_T_0')
file_name='170913-163210-AbovePhoto-080279.JPG'
annotation['bbox']=[19, 1061, 280, 1661]
------ Animal TOO LARGE ----
folder=PosixPath('/media/frederic/DATA/Frederic_MAD/2024_image_datasets/train/DBCA_WA_humpback_whales_aerial_T_0')
file_name='170913-163300-AbovePhoto-080428.JPG'
annotation['bbox']=[3272, 4460, 3696, 5060]
------ Animal TOO LARGE ----
folder=PosixPath('/media/frederic/DATA/Frederic_MAD/2024_image_datasets/train/DBCA_WA_humpback_whales_aerial_T_0')
file_name='170913-163300-AbovePhoto-080427.JPG'
annotation['bbox']=[3675, 3368, 4103, 3968]
------ Animal TOO LARGE ----
folder=PosixPath('/media/frederic/DATA/Frederic_MAD/2024_image_datasets/train/DBCA_WA_humpback_whales_aerial_T_0')
file_name='170913-163301-AbovePhoto-080429.JPG'
annotation['bbox']=[1924, 4284, 2371, 4884]
------ Animal TOO LARGE ----
folder=PosixPath('/media/frederic/DATA/Frederic_MAD/2024_image_datasets/train/DBCA_WA_humpback_whales_aerial_T_0')
file_name='170913-163301-AbovePhoto-080430.JPG'
annotation['bbox']=[599, 4125, 1118, 4725]
------ Animal TOO LARGE ----
folder=PosixPath('/media/frederic/DATA/Frederic_MAD/2024_image_datasets/train/DBCA_WA_humpback_whales_aerial_T_0')
file_name='170913-163537-AbovePhoto-080896.JPG'
annotation['bbox']=[2478, 4864, 2968, 5464]
------ Animal TOO LARGE ----
folder=PosixPath('/media/frederic/DATA/Frederic_MAD/2024_image_datasets/train/DBCA_WA_humpback_whales_aerial_T_0')
file_name='170913-163538-AbovePhoto-080898.JPG'
annotation['bbox']=[740, 6605, 1340, 6996]
------ Animal TOO LARGE ----
folder=PosixPath('/media/frederic/DATA/Frederic_MAD/2024_image_datasets/train/DBCA_WA_humpback_whales_aerial_T_0')
file_name='170915-122741-AbovePhotography-022A2755.JPG'
annotation['bbox']=[2320, 3770, 2861, 4370]
------ Animal TOO LARGE ----
folder=PosixPath('/media/frederic/DATA/Frederic_MAD/2024_image_datasets/train/DBCA_WA_humpback_whales_aerial_T_0')
file_name='170915-123035-AbovePhotography-0K2A9888.JPG'
annotation['bbox']=[356, 2119, 826, 2719]
------ Animal TOO LARGE ----
folder=PosixPath('/media/frederic/DATA/Frederic_MAD/2024_image_datasets/train/DBCA_WA_humpback_whales_aerial_T_0')
file_name='170915-124014-AbovePhotography-ABVE4103.JPG'
annotation['bbox']=[1267, 3988, 1597, 4588]
------ Animal TOO LARGE ----
folder=PosixPath('/media/frederic/DATA/Frederic_MAD/2024_image_datasets/train/DBCA_WA_humpback_whales_aerial_T_0')
file_name='170915-130517-AbovePhotography-ABVE6439.JPG'
annotation['bbox']=[776, 1444, 1100, 2044]
------ Animal TOO LARGE ----
folder=PosixPath('/media/frederic/DATA/Frederic_MAD/2024_image_datasets/train/DBCA_WA_humpback_whales_aerial_T_0')
file_name='170915-130517-AbovePhotography-ABVE6440.JPG'
annotation['bbox']=[43, 1967, 334, 2567]
------ Animal TOO LARGE ----
folder=PosixPath('/media/frederic/DATA/Frederic_MAD/2024_image_datasets/train/DBCA_WA_humpback_whales_aerial_T_0')
file_name='170915-171517-AbovePhotography-022A0263.JPG'
annotation['bbox']=[795, 13, 1395, 417]
------ Animal TOO LARGE ----
folder=PosixPath('/media/frederic/DATA/Frederic_MAD/2024_image_datasets/train/DBCA_WA_humpback_whales_aerial_T_0')
file_name='170915-171522-AbovePhotography-0K2A4889.JPG'
annotation['bbox']=[3299, 5416, 3899, 5826]
------ Animal TOO LARGE ----
folder=PosixPath('/media/frederic/DATA/Frederic_MAD/2024_image_datasets/train/DBCA_WA_humpback_whales_aerial_T_0')
file_name='170915-171523-AbovePhotography-0K2A4890.JPG'
annotation['bbox']=[1089, 5053, 1689, 5423]
------ Animal TOO LARGE ----
folder=PosixPath('/media/frederic/DATA/Frederic_MAD/2024_image_datasets/train/DBCA_WA_humpback_whales_aerial_T_0')
file_name='170915-171529-AbovePhotography-022A0284.JPG'
annotation['bbox']=[959, 1821, 1472, 2421]
------ Animal TOO LARGE ----
folder=PosixPath('/media/frederic/DATA/Frederic_MAD/2024_image_datasets/train/DBCA_WA_humpback_whales_aerial_T_0')
file_name='170915-171542-AbovePhotography-ABVE0459.JPG'
annotation['bbox']=[1175, 3295, 1775, 3883]
------ Animal TOO LARGE ----
folder=PosixPath('/media/frederic/DATA/Frederic_MAD/2024_image_datasets/train/DBCA_WA_humpback_whales_aerial_T_0')
file_name='170915-171543-AbovePhotography-ABVE0460.JPG'
annotation['bbox']=[110, 3525, 710, 4114]
------ Animal TOO LARGE ----
folder=PosixPath('/media/frederic/DATA/Frederic_MAD/2024_image_datasets/train/DBCA_WA_humpback_whales_aerial_T_0')
file_name='170915-171548-AbovePhotography-0K2A4921.JPG'
annotation['bbox']=[955, 16, 1483, 616]
------ Animal TOO LARGE ----
folder=PosixPath('/media/frederic/DATA/Frederic_MAD/2024_image_datasets/train/DBCA_WA_humpback_whales_aerial_T_0')
file_name='170915-171619-AbovePhotography-ABVE0524.JPG'
annotation['bbox']=[2003, 1342, 2491, 1942]
------ Animal TOO LARGE ----
folder=PosixPath('/media/frederic/DATA/Frederic_MAD/2024_image_datasets/train/DBCA_WA_humpback_whales_aerial_T_0')
file_name='170915-171620-AbovePhotography-ABVE0525.JPG'
annotation['bbox']=[563, 1315, 1044, 1915]
------ Animal TOO LARGE ----
folder=PosixPath('/media/frederic/DATA/Frederic_MAD/2024_image_datasets/train/DBCA_WA_humpback_whales_aerial_T_0')
file_name='170915-172325-AbovePhotography-0K2A5269.JPG'
annotation['bbox']=[2410, 2946, 2927, 3546]
------ Animal TOO LARGE ----
folder=PosixPath('/media/frederic/DATA/Frederic_MAD/2024_image_datasets/train/DBCA_WA_humpback_whales_aerial_T_0')
file_name='170915-172326-AbovePhotography-0K2A5270.JPG'
annotation['bbox']=[1008, 3294, 1395, 3894]
------ Animal TOO LARGE ----
folder=PosixPath('/media/frederic/DATA/Frederic_MAD/2024_image_datasets/train/DBCA_WA_humpback_whales_aerial_T_0')
file_name='170915-172344-AbovePhotography-022A0853.JPG'
annotation['bbox']=[2574, 4550, 2970, 5150]
------ Animal TOO LARGE ----
folder=PosixPath('/media/frederic/DATA/Frederic_MAD/2024_image_datasets/train/DBCA_WA_humpback_whales_aerial_T_0')
file_name='170915-172344-AbovePhotography-022A0854.JPG'
annotation['bbox']=[1318, 5404, 1791, 6004]
------ Animal TOO LARGE ----
folder=PosixPath('/media/frederic/DATA/Frederic_MAD/2024_image_datasets/train/DBCA_WA_humpback_whales_aerial_T_0')
file_name='170915-172352-AbovePhotography-022A0868.JPG'
annotation['bbox']=[2146, 2486, 2571, 3086]
------ Animal TOO LARGE ----
folder=PosixPath('/media/frederic/DATA/Frederic_MAD/2024_image_datasets/train/DBCA_WA_humpback_whales_aerial_T_0')
file_name='170915-172352-AbovePhotography-022A0868.JPG'
annotation['bbox']=[2330, 2772, 2738, 3372]
------ Animal TOO LARGE ----
folder=PosixPath('/media/frederic/DATA/Frederic_MAD/2024_image_datasets/train/DBCA_WA_humpback_whales_aerial_T_0')
file_name='170915-172439-AbovePhotography-ABVE1102.JPG'
annotation['bbox']=[1094, 1016, 1563, 1616]
------ Animal TOO LARGE ----
folder=PosixPath('/media/frederic/DATA/Frederic_MAD/2024_image_datasets/train/DBCA_WA_humpback_whales_aerial_T_0')
file_name='170915-172511-AbovePhotography-ABVE1158.JPG'
annotation['bbox']=[148, 2527, 555, 3127]
------ Animal TOO LARGE ----
folder=PosixPath('/media/frederic/DATA/Frederic_MAD/2024_image_datasets/train/DBCA_WA_humpback_whales_aerial_T_0')
file_name='170915-173721-AbovePhotography-0K2A6035.JPG'
annotation['bbox']=[2024, 1148, 2624, 1483]
------ Animal TOO LARGE ----
folder=PosixPath('/media/frederic/DATA/Frederic_MAD/2024_image_datasets/train/DBCA_WA_humpback_whales_aerial_T_0')
file_name='170915-173722-AbovePhotography-0K2A6036.JPG'
annotation['bbox']=[348, 1365, 948, 1683]
------ Animal TOO LARGE ----
folder=PosixPath('/media/frederic/DATA/Frederic_MAD/2024_image_datasets/train/DBCA_WA_humpback_whales_aerial_T_0')
file_name='170915-173729-AbovePhotography-0K2A6044.JPG'
annotation['bbox']=[1854, 1520, 2454, 2033]
------ Animal TOO LARGE ----
folder=PosixPath('/media/frederic/DATA/Frederic_MAD/2024_image_datasets/train/DBCA_WA_humpback_whales_aerial_T_0')
file_name='170915-173730-AbovePhotography-0K2A6045.JPG'
annotation['bbox']=[171, 1515, 771, 2020]
------ Animal TOO LARGE ----
folder=PosixPath('/media/frederic/DATA/Frederic_MAD/2024_image_datasets/train/DBCA_WA_humpback_whales_aerial_T_0')
file_name='170915-173748-AbovePhotography-ABVE2122.JPG'
annotation['bbox']=[2315, 437, 2915, 827]
------ Animal TOO LARGE ----
folder=PosixPath('/media/frederic/DATA/Frederic_MAD/2024_image_datasets/train/DBCA_WA_humpback_whales_aerial_T_0')
file_name='170915-173748-AbovePhotography-ABVE2123.JPG'
annotation['bbox']=[1027, 588, 1627, 968]
------ Animal TOO LARGE ----
folder=PosixPath('/media/frederic/DATA/Frederic_MAD/2024_image_datasets/train/DBCA_WA_humpback_whales_aerial_T_0')
file_name='170915-173758-AbovePhotography-ABVE2140.JPG'
annotation['bbox']=[2216, 3230, 2816, 3745]
------ Animal TOO LARGE ----
folder=PosixPath('/media/frederic/DATA/Frederic_MAD/2024_image_datasets/train/DBCA_WA_humpback_whales_aerial_T_0')
file_name='170915-173759-AbovePhotography-ABVE2141.JPG'
annotation['bbox']=[262, 3338, 862, 3938]
------ Animal TOO LARGE ----
folder=PosixPath('/media/frederic/DATA/Frederic_MAD/2024_image_datasets/train/DBCA_WA_humpback_whales_aerial_T_0')
file_name='170915-173807-AbovePhotography-ABVE2155.JPG'
annotation['bbox']=[2523, 206, 2741, 806]
------ Animal TOO LARGE ----
folder=PosixPath('/media/frederic/DATA/Frederic_MAD/2024_image_datasets/train/DBCA_WA_humpback_whales_aerial_T_0')
file_name='170915-173807-AbovePhotography-ABVE2156.JPG'
annotation['bbox']=[1068, 300, 1308, 900]
------ Animal TOO LARGE ----
folder=PosixPath('/media/frederic/DATA/Frederic_MAD/2024_image_datasets/train/DBCA_WA_humpback_whales_aerial_T_0')
file_name='170915-173813-AbovePhotography-0K2A6097.JPG'
annotation['bbox']=[220, 4538, 699, 5138]
------ Animal TOO LARGE ----
folder=PosixPath('/media/frederic/DATA/Frederic_MAD/2024_image_datasets/train/DBCA_WA_humpback_whales_aerial_T_0')
file_name='170915-173942-AbovePhotography-ABVE2321.JPG'
annotation['bbox']=[96, 1592, 696, 2070]
------ Animal TOO LARGE ----
folder=PosixPath('/media/frederic/DATA/Frederic_MAD/2024_image_datasets/train/DBCA_WA_humpback_whales_aerial_T_0')
file_name='170915-173942-AbovePhotography-ABVE2322.JPG'
annotation['bbox']=[1289, 2968, 1532, 3568]
------ Animal TOO LARGE ----
folder=PosixPath('/media/frederic/DATA/Frederic_MAD/2024_image_datasets/train/DBCA_WA_humpback_whales_aerial_T_0')
file_name='170915-173944-AbovePhotography-ABVE2324.JPG'
annotation['bbox']=[110, 1392, 350, 1992]
------ Animal TOO LARGE ----
folder=PosixPath('/media/frederic/DATA/Frederic_MAD/2024_image_datasets/train/DBCA_WA_humpback_whales_aerial_T_0')
file_name='170915-173956-AbovePhotography-0K2A6222.JPG'
annotation['bbox']=[2358, 2843, 2958, 3312]
------ Animal TOO LARGE ----
folder=PosixPath('/media/frederic/DATA/Frederic_MAD/2024_image_datasets/train/DBCA_WA_humpback_whales_aerial_T_0')
file_name='170915-173957-AbovePhotography-0K2A6223.JPG'
annotation['bbox']=[454, 3045, 1054, 3548]
------ Animal TOO LARGE ----
folder=PosixPath('/media/frederic/DATA/Frederic_MAD/2024_image_datasets/train/DBCA_WA_humpback_whales_aerial_T_0')
file_name='170915-174013-AbovePhotography-022A2226.JPG'
annotation['bbox']=[1108, 3622, 1458, 4222]
------ Animal TOO LARGE ----
folder=PosixPath('/media/frederic/DATA/Frederic_MAD/2024_image_datasets/train/DBCA_WA_humpback_whales_aerial_T_0')
file_name='170915-174022-AbovePhotography-0K2A6254.JPG'
annotation['bbox']=[2725, 2626, 3325, 3021]
------ Animal TOO LARGE ----
folder=PosixPath('/media/frederic/DATA/Frederic_MAD/2024_image_datasets/train/DBCA_WA_humpback_whales_aerial_T_0')
file_name='170915-174023-AbovePhotography-0K2A6255.JPG'
annotation['bbox']=[392, 2348, 992, 2726]
------ Animal TOO LARGE ----
folder=PosixPath('/media/frederic/DATA/Frederic_MAD/2024_image_datasets/train/DBCA_WA_humpback_whales_aerial_T_0')
file_name='170915-174126-AbovePhotography-022A2353.JPG'
annotation['bbox']=[3216, 7689, 3816, 8010]
------ Animal TOO LARGE ----
folder=PosixPath('/media/frederic/DATA/Frederic_MAD/2024_image_datasets/train/DBCA_WA_humpback_whales_aerial_T_0')
file_name='170915-174138-AbovePhotography-022A2375.JPG'
annotation['bbox']=[3420, 6281, 4020, 6575]
------ Animal TOO LARGE ----
folder=PosixPath('/media/frederic/DATA/Frederic_MAD/2024_image_datasets/train/DBCA_WA_humpback_whales_aerial_T_0')
file_name='170915-174205-AbovePhotography-022A2422.JPG'
annotation['bbox']=[4540, 2893, 5140, 3292]
------ Animal TOO LARGE ----
folder=PosixPath('/media/frederic/DATA/Frederic_MAD/2024_image_datasets/train/DBCA_WA_humpback_whales_aerial_T_0')
file_name='170915-174225-AbovePhotography-ABVE2605.JPG'
annotation['bbox']=[2324, 5, 2924, 322]
------ Animal TOO LARGE ----
folder=PosixPath('/media/frederic/DATA/Frederic_MAD/2024_image_datasets/train/DBCA_WA_humpback_whales_aerial_T_0')
file_name='170915-174225-AbovePhotography-ABVE2606.JPG'
annotation['bbox']=[619, 13, 1219, 381]
------ Animal TOO LARGE ----
folder=PosixPath('/media/frederic/DATA/Frederic_MAD/2024_image_datasets/train/DBCA_WA_humpback_whales_aerial_T_0')
file_name='170915-174226-AbovePhotography-ABVE2607.JPG'
annotation['bbox']=[8, 265, 608, 673]
------ Animal TOO LARGE ----
folder=PosixPath('/media/frederic/DATA/Frederic_MAD/2024_image_datasets/train/DBCA_WA_humpback_whales_aerial_T_0')
file_name='170915-174311-AbovePhotography-ABVE2686.JPG'
annotation['bbox']=[1837, 340, 2263, 940]
