{
  "kind": "collectionType",
  "collectionName": "addresses",
  "info": {
    "name": "Address"
  },
  "options": {
    "increments": true,
    "timestamps": true,
    "draftAndPublish": true
  },
  "attributes": {
    "address_id": {
      "type": "uid"
    },
    "city": {
      "type": "string"
    },
    "region": {
      "type": "string"
    },
    "postal_code": {
      "type": "integer"
    },
    "country": {
      "type": "string"
    }
  }
}
