{
  "kind": "collectionType",
  "collectionName": "tables",
  "info": {
    "name": "Desks",
    "description": ""
  },
  "options": {
    "increments": true,
    "timestamps": true,
    "draftAndPublish": true
  },
  "attributes": {
    "Image": {
      "collection": "file",
      "via": "related",
      "allowedTypes": [
        "images",
        "files",
        "videos"
      ],
      "plugin": "upload",
      "required": false
    },
    "serial_number": {
      "type": "uid"
    },
    "name": {
      "type": "string"
    },
    "description": {
      "type": "text"
    },
    "acquisition_cost": {
      "type": "float"
    },
    "acquisition_date": {
      "type": "date"
    },
    "qr_code": {
      "collection": "file",
      "via": "related",
      "allowedTypes": [
        "images",
        "files",
        "videos"
      ],
      "plugin": "upload",
      "required": false
    },
    "official_receipts": {
      "collection": "file",
      "via": "related",
      "allowedTypes": [
        "images",
        "files",
        "videos"
      ],
      "plugin": "upload",
      "required": false
    },
    "brand": {
      "type": "string"
    },
    "models": {
      "collection": "models"
    },
    "status": {
      "model": "statuses"
    }
  }
}
