{
  "routes": [
    {
      "method": "GET",
      "path": "/mobile-phones",
      "handler": "mobile-phones.find",
      "config": {
        "policies": []
      }
    },
    {
      "method": "GET",
      "path": "/mobile-phones/count",
      "handler": "mobile-phones.count",
      "config": {
        "policies": []
      }
    },
    {
      "method": "GET",
      "path": "/mobile-phones/:id",
      "handler": "mobile-phones.findOne",
      "config": {
        "policies": []
      }
    },
    {
      "method": "POST",
      "path": "/mobile-phones",
      "handler": "mobile-phones.create",
      "config": {
        "policies": []
      }
    },
    {
      "method": "PUT",
      "path": "/mobile-phones/:id",
      "handler": "mobile-phones.update",
      "config": {
        "policies": []
      }
    },
    {
      "method": "DELETE",
      "path": "/mobile-phones/:id",
      "handler": "mobile-phones.delete",
      "config": {
        "policies": []
      }
    }
  ]
}
