{
  "kind": "collectionType",
  "collectionName": "borrowed_equipments",
  "info": {
    "name": "Borrowed Equipment"
  },
  "options": {
    "increments": true,
    "timestamps": true,
    "draftAndPublish": true
  },
  "attributes": {
    "date_borrowed": {
      "type": "date"
    },
    "return_date": {
      "type": "date"
    },
    "remarks": {
      "type": "text"
    }
  }
}
