<?xml version="1.0" encoding="utf-8"?>
<!-- Generator: Adobe Illustrator 21.1.0, SVG Export Plug-In . SVG Version: 6.00 Build 0)  -->
<svg version="1.1" id="Layer_1" xmlns="http://www.w3.org/2000/svg" xmlns:xlink="http://www.w3.org/1999/xlink" x="0px" y="0px"
	 viewBox="0 0 24 24" style="enable-background:new 0 0 24 24;" xml:space="preserve">
<style type="text/css">
	.st0{fill-rule:evenodd;clip-rule:evenodd;fill:#66BCCD;}
	.st1{fill:#66BCCD;}
	.st2{font-family:'MyriadPro-Semibold';}
	.st3{font-size:16.6646px;}
</style>
<title>Asset 1ldpi</title>
<g id="stats3">
	<g>
		<path class="st0" d="M12,0C5.4,0,0,5.4,0,12c0,6.6,5.4,12,12,12c6.6,0,12-5.4,12-12C24,5.4,18.7,0,12,0z M12,22
			C6.5,22,2,17.5,2,12C2,6.5,6.5,2,12,2c5.5,0,10,4.5,10,10C22,17.5,17.6,22,12,22z"/>
	</g>
</g>
<text transform="matrix(1 0 0 1 8.4695 17.4534)" class="st1 st2 st3">?</text>
</svg>
