\relax 
\gdef \LT@i {\LT@entry 
    {1}{36.94672pt}\LT@entry 
    {1}{353.43306pt}}
\@writefile{lot}{\contentsline {table}{\numberline {1}{\ignorespaces Das Jahr 1933 - Gleichschaltung der Weimarer Republik\relax }}{}{}\protected@file@percent }
\gdef \@abspage@last{1}
