\relax 
\gdef \LT@i {\LT@entry 
    {1}{50.72223pt}\LT@entry 
    {1}{353.43306pt}}
\@writefile{lot}{\contentsline {table}{\numberline {1}{\ignorespaces \relax }}{}{}\protected@file@percent }
\gdef \@abspage@last{1}
