\relax 
\providecommand\babel@aux[2]{}
\@nameuse{bbl@beforestart}
\catcode `"\active 
\gdef \LT@i {\LT@entry 
    {1}{38.16666pt}\LT@entry 
    {1}{353.43306pt}}
\babel@aux{ngerman}{}
\@writefile{lot}{\contentsline {table}{\numberline {1}{\ignorespaces Au"senpolitik des NS-Staats\relax }}{}{}\protected@file@percent }
\gdef \@abspage@last{1}
