D:\Universidad\5to Semestre\Ingenierķa de Software\Proyectos\Actividad Contenedor\demo\src\main\java\com\example\demo\controller\UsuarioCajeroController.java
D:\Universidad\5to Semestre\Ingenierķa de Software\Proyectos\Actividad Contenedor\demo\src\main\java\com\example\demo\controller\ProductoController.java
D:\Universidad\5to Semestre\Ingenierķa de Software\Proyectos\Actividad Contenedor\demo\src\main\java\com\example\demo\model\Merma.java
D:\Universidad\5to Semestre\Ingenierķa de Software\Proyectos\Actividad Contenedor\demo\src\main\java\com\example\demo\model\Producto.java
D:\Universidad\5to Semestre\Ingenierķa de Software\Proyectos\Actividad Contenedor\demo\src\main\java\com\example\demo\model\UsuarioReponedor.java
D:\Universidad\5to Semestre\Ingenierķa de Software\Proyectos\Actividad Contenedor\demo\src\main\java\com\example\demo\controller\MermaController.java
D:\Universidad\5to Semestre\Ingenierķa de Software\Proyectos\Actividad Contenedor\demo\src\main\java\com\example\demo\controller\UsuarioReponedorController.java
D:\Universidad\5to Semestre\Ingenierķa de Software\Proyectos\Actividad Contenedor\demo\src\main\java\com\example\demo\DemoContenedorApplication.java
D:\Universidad\5to Semestre\Ingenierķa de Software\Proyectos\Actividad Contenedor\demo\src\main\java\com\example\demo\model\UsuarioCajero.java
D:\Universidad\5to Semestre\Ingenierķa de Software\Proyectos\Actividad Contenedor\demo\src\main\java\com\example\demo\model\Usuario.java
