{
  "profiles": {
    "xAPI Definitions Parser CLI": {
      "commandName": "Project"
    },
    "Local Arguments": {
      "commandName": "Project",
      "commandLineArgs": "-source local -path \"D:\\test\\xapi-master\\definitions\" -lang CSharp -namespace xAPI -output \"D:\\test\\xAPI 2\\output\\CSharp\""
    },
    "GitLab Arguments": {
      "commandName": "Project",
      "commandLineArgs": "-source gitlab -path definitions -projectId 16349193 -branch \"master\" -privateKey glpat-x-z-38tnYLDYeNnTaP5Z -lang CSharp -namespace xAPI -output \"D:\\test\\xAPI 2\\output\\CSharp\""
    },
    "Compile CSharp": {
      "commandName": "Project",
      "commandLineArgs": "-source local -path \"D:\\test\\xapi-master\\definitions\" -lang CSharp -namespace xAPI -output \"D:\\test\\xAPI 2\\output\\CSharp\" -compile \"D:\\test\\xAPI.dll\" -dotnet 5.0 -refpath \"\""
    },
    "Compile Python": {
      "commandName": "Project",
      "commandLineArgs": "-source local -path \"D:\\test\\xapi-master\\definitions\" -lang Python -namespace xAPI -output \"D:\\test\\xAPI 2\\output\\Python\" -compile \"D:\\test\\xAPI 2\\output\\Python\""
    },
    "Compile JavaScript": {
      "commandName": "Project",
      "commandLineArgs": "-source local -path \"D:\\test\\xapi-master\\definitions\" -lang JavaScript -namespace xAPI -output \"D:\\test\\xAPI 2\\output\\JavaScript\" -compile \"D:\\test\\xAPI 2\\output\\JavaScript\""
    }
  }
}