{
    "name": {
        "de-DE": "interagiert nonverbal (zugewandte Körpersprache)"
    },
    "description": {
        "de-DE": "Subscore (5/5 bzw. ++) wenn ein Akteuer nonverbal interagiert (zugewandte Körpersprache)"
    },
    "result":{
        "score":{
          "min": 1,
          "max": 5
        }
    }
}