{
    "name": {
        "en-US": "tip",
        "de-DE": "Tipp"
    },
    "description": {
        "en-US": "A tip to overcome some ingame task.",
        "de-DE": "Ein Tipp um eine Aufgabe im Spiel zu lösen."
    }
}