{
    "name": {
        "en-US": "gamemode",
        "de-DE": "Spielmodus"
    },
    "description": {
        "en-US": "The result of a change of the gamemode. Can be a string or integer.",
        "de-DE": "Der neue Spielmodus der aus dem Ereignis hervorgeht."
    }
}