{
    "name": {
        "en-US": "locked",
        "de-DE": "verschloss"
    },
    "description": {
        "en-US": "An actor did some action to lock up some object. Could also be locked out of a progression path for example.",
        "de-DE": "Ein Akteur verschloss einen Gegenstand. Kann zum Beispiel aber auch ausschließen von einem Weg zu voran kommen sein."
    }
}
