^C:\USERS\FABIAN\SOURCE\REPOS\XAPI DEFINITIONS INTEGRATION\XAPI VS EXTENSION\XAPI_VS_EXTENSIONPACKAGE.VSCT
C:\USERS\FABIAN\SOURCE\REPOS\XAPI DEFINITIONS INTEGRATION\XAPI VS EXTENSION\XAPI_VS_EXTENSIONPACKAGE.VSCT
C:\USERS\FABIAN\SOURCE\REPOS\XAPI DEFINITIONS INTEGRATION\XAPI VS EXTENSION\RESOURCES\XAPI_EXTENSIONCOMMAND.PNG
C:\USERS\FABIAN\.NUGET\PACKAGES\MICROSOFT.VSSDK.BUILDTOOLS\16.11.35\TOOLS\VSSDK\INC\STDIDCMD.H
C:\USERS\FABIAN\.NUGET\PACKAGES\MICROSOFT.VSSDK.BUILDTOOLS\16.11.35\TOOLS\VSSDK\INC\VSSHLIDS.H
