{
    "name": {
        "de-DE": "behält stehts den Überblick"
    },
    "description": {
        "de-DE": "Subscore (5/5 bzw. ++) wenn ein Akteuer stehts den Überblick behält"
    },
    "result":{
        "score":{
          "min": 1,
          "max": 5
        }
    }
}