{
    "name": {
        "en-US": "video",
        "de-DE": "Video"
    },
    "description": {
        "en-US": "A video which can be watched inside the game.",
        "de-DE": "Ein Video welches im Spiel angeschaut werden kann."
    },
    "exactMatch": [
        "https://registry.tincanapi.com/#uri/activityType/79",
        "https://activitystrea.ms/schema/1.0/video"
    ]
}