{
    "name": {
        "de-DE": "visualisiert oder umschreibt Ideen"
    },
    "description": {
        "de-DE": "Subscore (5/5 bzw. ++) wenn ein Akteuer Ideen visualisiert oder umschreibt"
    },
    "result":{
        "score":{
          "min": 1,
          "max": 5
        }
    }
}