{
    "name": {
        "en-US": "left",
        "de-DE": "lies zurück"
    },
    "description": {
        "en-US": "An actor left behind some object.",
        "de-DE": "Ein Akteur lies einen Gegenstand zurück."
    },
    "exactMatch": [
        "https://registry.tincanapi.com/#uri/verb/121",
        "https://activitystrea.ms/schema/1.0/leave"
    ]
}
