{
    "name": {
        "en-US": "read",
        "de-DE": "las"
    },
    "description": {
        "en-US": "A actor read some text. Only use if it can be assured that the text is read.",
        "de-DE": "Ein Acteur las einen Text. Sollte nur genutzt werden wenn sichergestellt werden kann, dass der Text auch wirklich gelesen wurde."
    },
    "exactMatch": [
        "https://registry.tincanapi.com/#uri/verb/130",
        "https://activitystrea.ms/schema/1.0/read"
    ]
}