{
    "name": {
        "de-DE": "kann Maßstäbe im richtigen Verhältnis umsetzen (z.B. in Skizzen)"
    },
    "description": {
        "de-DE": "Subscore (5/5 bzw. ++) wenn ein Akteuer Maßstäbe im richtigen Verhältnis umsetzen kann (z.B. in Skizzen)"
    },
    "result":{
        "score":{
          "min": 1,
          "max": 5
        }
    }
}