{
"name": {
	"en-US": "reopened",
	"de-DE": "wiedereröffnet"
},
"description": {
	"en-US": "Actor reopened an activity (assignment submission, forum)",
	"de-DE": "Akteuer hat eine Aktivität (Aufgabenabgabe, Forum) wiedereröffnet"
},
"exactMatch": [
],
"relatedMatch": [
]
}
