{
    "name": {
        "en-US": "approved",
        "de-DE": "genehmigt"
    },
    "description": {
        "en-US": "Actor approved an object (in Moodle \"learning plan\")",
        "de-DE": "Akteur genehmigte ein Objekt (in Moodle \"Lernplan\")"
    },
    "exactMatch": [   
        "https://activitystrea.ms/registry/verbs/",
        "https://registry.tincanapi.com/#uri/verb/86"
    ],
    "relatedMatch": [
    ]
}