{
    "name": {
        "en-US": "button type",
        "de-DE": "Knopf Typ"
    },
    "description": {
        "en-US": "The type of button which was pressed. Has to be String.",
        "de-DE": "Der Typ des Knopfes der gedrückt wurde. Muss ein String sein."
    }
}