{
    "name": {
        "en-US": "tangible",
        "de-DE": "Tangible"
    },
    "description": {
        "en-US": "A device to interact with the game.",
        "de-DE": "Ein Gerät mit dem man mit dem Spiel interagieren kann."
    }
}