{
  "name": {
    "en-US": "interacted",
    "de-DE": "interagierte"
  },
  "description": {
    "en-US": "An actor interacted with the VR object in the VR environment.",
    "de-DE": "Eine Akteurin interagierte einem VR Objekt in der VR Umgebung."
  }
}