{
    "name": {
        "en-US": "duration"
    },
    "description": {
        "en-US": "The time taken to complete the experiment. This is captured from the system time of the local machine."
    }
}
