{
    "name": {
        "en-US": "dragged",
        "de-DE": "zog"
    },
    "description": {
        "en-US": "An actor dragged a draggable object across the screen.",
        "de-DE": "Ein Akteur zog ein ziehbares Objekt über den Bildschirm."
    }
}