
 _____                           _  __       
/  ___|                         (_)/ _|      
\ `--.  ___ _ __ _   _ _ __ ___  _| |_ _   _ 
 `--. \/ __| '__| | | | '_ ` _ \| |  _| | | |
/\__/ / (__| |  | |_| | | | | | | | | | |_| |
\____/ \___|_|   \__,_|_| |_| |_|_|_|  \__, |
                                        __/ |
                                       |___/ 