{
  "openapi": "3.0.0",
  "info": {
    "title": "Graph Integration",
    "version": "1.0.2"
  },
  "paths": {
    "/rest/hello": {
      "get": {
        "operationId": "helloQuery",
        "parameters": [],
        "responses": {
          "200": {
            "description": "",
            "content": {
              "application/json": {
                "schema": {
                  "type": "string"
                }
              }
            }
          }
        }
      }
    }
  },
  "components": {
    "schemas": {
      "Query": {
        "type": "object",
        "properties": {
          "hello": {
            "type": "string"
          }
        }
      }
    }
  }
}