{
    "content": "[{\"id\":625235,\"name\":\"iThingy\",\"type\":\"iphone\",\"serial\":\"E30A4DAE-8DDB-4E4D-B877-3E63D64A920A\",\"created\":\"2020-06-05T23:28:33.293067Z\",\"timezone\":\"Pacific/Auckland\",\"version\":\"9.5.1.88141004\"}]",
    "status": 200,
    "url": "https://labs.invoxia.io/devices/?type=iphone"
}
