@startuml

package "WebApp" {
  rectangle Chat
  rectangle ChatHub
  rectangle StockResponseMonitor
}

package ".Net Core BackgroundService" {
  control StockProcessorService
}

package "RabbitMQ" {
    queue StockRequests

    queue StockResponses  
}

actor "Chat User"

[Chat User] --> Chat
ChatHub --> [Chat User]

Chat --> ChatHub

package "SQLServer Express" {
    database chat_challenge_sql
}

WebApp -- chat_challenge_sql

Chat --> StockRequests : "Post Request"

StockProcessorService --> StockResponses

StockProcessorService <-- StockRequests

StockResponses --> StockResponseMonitor

StockResponseMonitor --> ChatHub

@enduml