{
  "locations": [
    {
      "id": 1,
      "label": "777 Brockton Avenue, Abington MA 2351"
    },
    {
      "id": 2,
      "label": "30 Memorial Drive, Avon MA 2322"
    },
    {
      "id": 3,
      "label": "250 Hartford Avenue, Bellingham MA 2019"
    },
    {
      "id": 4,
      "label": "700 Oak Street, Brockton MA 2301"
    },
    {
      "id": 5,
      "label": "66-4 Parkhurst Rd, Chelmsford MA 1824"
    },
    {
      "id": 6,
      "label": "591 Memorial Dr, Chicopee MA 1020"
    },
    {
      "id": 7,
      "label": "55 Brooksby Village Way, Danvers MA 1923"
    },
    {
      "id": 8,
      "label": "137 Teaticket Hwy, East Falmouth MA 2536"
    },
    {
      "id": 9,
      "label": "42 Fairhaven Commons Way, Fairhaven MA 2719"
    },
    {
      "id": 10,
      "label": "374 William S Canning Blvd, Fall River MA 2721"
    },
    {
      "id": 11,
      "label": "121 Worcester Rd, Framingham MA 1701"
    },
    {
      "id": 12,
      "label": "677 Timpany Blvd, Gardner MA 1440"
    },
    {
      "id": 13,
      "label": "337 Russell St, Hadley MA 1035"
    },
    {
      "id": 14,
      "label": "295 Plymouth Street, Halifax MA 2338"
    },
    {
      "id": 15,
      "label": "1775 Washington St, Hanover MA 2339"
    },
    {
      "id": 16,
      "label": "280 Washington Street, Hudson MA 1749"
    },
    {
      "id": 17,
      "label": "20 Soojian Dr, Leicester MA 1524"
    },
    {
      "id": 18,
      "label": "11 Jungle Road, Leominster MA 1453"
    },
    {
      "id": 19,
      "label": "301 Massachusetts Ave, Lunenburg MA 1462"
    },
    {
      "id": 20,
      "label": "780 Lynnway, Lynn MA 1905"
    },
    {
      "id": 21,
      "label": "70 Pleasant Valley Street, Methuen MA 1844"
    },
    {
      "id": 22,
      "label": "830 Curran Memorial Hwy, North Adams MA 1247"
    },
    {
      "id": 23,
      "label": "1470 S Washington St, North Attleboro MA 2760"
    },
    {
      "id": 24,
      "label": "506 State Road, North Dartmouth MA 2747"
    },
    {
      "id": 25,
      "label": "742 Main Street, North Oxford MA 1537"
    },
    {
      "id": 26,
      "label": "72 Main St, North Reading MA 1864"
    },
    {
      "id": 27,
      "label": "200 Otis Street, Northborough MA 1532"
    },
    {
      "id": 28,
      "label": "180 North King Street, Northhampton MA 1060"
    },
    {
      "id": 29,
      "label": "555 East Main St, Orange MA 1364"
    },
    {
      "id": 30,
      "label": "555 Hubbard Ave-Suite 12, Pittsfield MA 1201"
    },
    {
      "id": 31,
      "label": "300 Colony Place, Plymouth MA 2360"
    },
    {
      "id": 32,
      "label": "301 Falls Blvd, Quincy MA 2169"
    },
    {
      "id": 33,
      "label": "36 Paramount Drive, Raynham MA 2767"
    },
    {
      "id": 34,
      "label": "450 Highland Ave, Salem MA 1970"
    },
    {
      "id": 35,
      "label": "1180 Fall River Avenue, Seekonk MA 2771"
    },
    {
      "id": 36,
      "label": "1105 Boston Road, Springfield MA 1119"
    },
    {
      "id": 37,
      "label": "100 Charlton Road, Sturbridge MA 1566"
    },
    {
      "id": 38,
      "label": "262 Swansea Mall Dr, Swansea MA 2777"
    },
    {
      "id": 39,
      "label": "333 Main Street, Tewksbury MA 1876"
    },
    {
      "id": 40,
      "label": "550 Providence Hwy, Walpole MA 2081"
    },
    {
      "id": 41,
      "label": "352 Palmer Road, Ware MA 1082"
    },
    {
      "id": 42,
      "label": "3005 Cranberry Hwy Rt 6 28, Wareham MA 2538"
    },
    {
      "id": 43,
      "label": "250 Rt 59, Airmont NY 10901"
    },
    {
      "id": 44,
      "label": "141 Washington Ave Extension, Albany NY 12205"
    },
    {
      "id": 45,
      "label": "13858 Rt 31 W, Albion NY 14411"
    },
    {
      "id": 46,
      "label": "2055 Niagara Falls Blvd, Amherst NY 14228"
    },
    {
      "id": 47,
      "label": "101 Sanford Farm Shpg Center, Amsterdam NY 12010"
    },
    {
      "id": 48,
      "label": "297 Grant Avenue, Auburn NY 13021"
    },
    {
      "id": 49,
      "label": "4133 Veterans Memorial Drive, Batavia NY 14020"
    },
    {
      "id": 50,
      "label": "6265 Brockport Spencerport Rd, Brockport NY 14420"
    },
    {
      "id": 51,
      "label": "5399 W Genesse St, Camillus NY 13031"
    },
    {
      "id": 52,
      "label": "3191 County rd 10, Canandaigua NY 14424"
    },
    {
      "id": 53,
      "label": "30 Catskill, Catskill NY 12414"
    },
    {
      "id": 54,
      "label": "161 Centereach Mall, Centereach NY 11720"
    },
    {
      "id": 55,
      "label": "3018 East Ave, Central Square NY 13036"
    },
    {
      "id": 56,
      "label": "100 Thruway Plaza, Cheektowaga NY 14225"
    },
    {
      "id": 57,
      "label": "8064 Brewerton Rd, Cicero NY 13039"
    },
    {
      "id": 58,
      "label": "5033 Transit Road, Clarence NY 14031"
    },
    {
      "id": 59,
      "label": "3949 Route 31, Clay NY 13041"
    },
    {
      "id": 60,
      "label": "139 Merchant Place, Cobleskill NY 12043"
    },
    {
      "id": 61,
      "label": "85 Crooked Hill Road, Commack NY 11725"
    },
    {
      "id": 62,
      "label": "872 Route 13, Cortlandville NY 13045"
    },
    {
      "id": 63,
      "label": "279 Troy Road, East Greenbush NY 12061"
    },
    {
      "id": 64,
      "label": "2465 Hempstead Turnpike, East Meadow NY 11554"
    },
    {
      "id": 65,
      "label": "6438 Basile Rowe, East Syracuse NY 13057"
    },
    {
      "id": 66,
      "label": "25737 US Rt 11, Evans Mills NY 13637"
    },
    {
      "id": 67,
      "label": "901 Route 110, Farmingdale NY 11735"
    },
    {
      "id": 68,
      "label": "2400 Route 9, Fishkill NY 12524"
    },
    {
      "id": 69,
      "label": "10401 Bennett Road, Fredonia NY 14063"
    },
    {
      "id": 70,
      "label": "1818 State Route 3, Fulton NY 13069"
    },
    {
      "id": 71,
      "label": "4300 Lakeville Road, Geneseo NY 14454"
    },
    {
      "id": 72,
      "label": "990 Route 5 20, Geneva NY 14456"
    },
    {
      "id": 73,
      "label": "311 RT 9W, Glenmont NY 12077"
    },
    {
      "id": 74,
      "label": "200 Dutch Meadows Ln, Glenville NY 12302"
    },
    {
      "id": 75,
      "label": "100 Elm Ridge Center Dr, Greece NY 14626"
    },
    {
      "id": 76,
      "label": "1549 Rt 9, Halfmoon NY 12065"
    },
    {
      "id": 77,
      "label": "5360 Southwestern Blvd, Hamburg NY 14075"
    },
    {
      "id": 78,
      "label": "103 North Caroline St, Herkimer NY 13350"
    },
    {
      "id": 79,
      "label": "1000 State Route 36, Hornell NY 14843"
    },
    {
      "id": 80,
      "label": "1400 County Rd 64, Horseheads NY 14845"
    },
    {
      "id": 81,
      "label": "135 Fairgrounds Memorial Pkwy, Ithaca NY 14850"
    },
    {
      "id": 82,
      "label": "2 Gannett Dr, Johnson City NY 13790"
    },
    {
      "id": 83,
      "label": "233 5th Ave Ext, Johnstown NY 12095"
    },
    {
      "id": 84,
      "label": "601 Frank Stottile Blvd, Kingston NY 12401"
    },
    {
      "id": 85,
      "label": "350 E Fairmount Ave, Lakewood NY 14750"
    },
    {
      "id": 86,
      "label": "4975 Transit Rd, Lancaster NY 14086"
    },
    {
      "id": 87,
      "label": "579 Troy-Schenectady Road, Latham NY 12110"
    },
    {
      "id": 88,
      "label": "5783 So Transit Road, Lockport NY 14094"
    },
    {
      "id": 89,
      "label": "7155 State Rt 12 S, Lowville NY 13367"
    },
    {
      "id": 90,
      "label": "425 Route 31, Macedon NY 14502"
    },
    {
      "id": 91,
      "label": "3222 State Rt 11, Malone NY 12953"
    },
    {
      "id": 92,
      "label": "200 Sunrise Mall, Massapequa NY 11758"
    },
    {
      "id": 93,
      "label": "43 Stephenville St, Massena NY 13662"
    },
    {
      "id": 94,
      "label": "750 Middle Country Road, Middle Island NY 11953"
    },
    {
      "id": 95,
      "label": "470 Route 211 East, Middletown NY 10940"
    },
    {
      "id": 96,
      "label": "3133 E Main St, Mohegan Lake NY 10547"
    },
    {
      "id": 97,
      "label": "288 Larkin, Monroe NY 10950"
    },
    {
      "id": 98,
      "label": "41 Anawana Lake Road, Monticello NY 12701"
    },
    {
      "id": 99,
      "label": "4765 Commercial Drive, New Hartford NY 13413"
    },
    {
      "id": 100,
      "label": "1201 Rt 300, Newburgh NY 12550"
    }
  ],
  "items": [
    {
      "id": 1,
      "field1": "field 1 value 1",
      "field2": "field 2 value 1",
      "field3": "field 3 value 1",
      "field9": [
        {
          "id": 1,
          "sfield1": "sfield1 value 1",
          "sfield2": "sfield2 value 1"
        },
        {
          "id": 2,
          "sfield1": "sfield1 value 2",
          "sfield2": "sfield2 value 2"
        }
      ]
    },
    {
      "id": 2,
      "field1": "field 1 value 2",
      "field2": "field 2 value 2",
      "field3": "field 3 value 2"
    },
    {
      "id": 3,
      "type": "bigitem",
      "field1": "field 1 value 3",
      "field2": "field 2 value 3",
      "field3": "field 3 value 3"
    }
  ],
  "childitems": [
    {
      "id": 1,
      "itemId": 1,
      "cfield1": "1.1.1",
      "cfield2": "1.1.2"
    },
    {
      "id": 2,
      "itemId": 1,
      "cfield1": "1.2.1",
      "cfield2": "1.2.2"
    },
    {
      "id": 3,
      "itemId": 1,
      "cfield1": "1.3.1",
      "cfield2": "1.3.2"
    },
    {
      "id": 4,
      "itemId": 2,
      "cfield1": "2.1.1",
      "cfield2": "2.1.2"
    },
    {
      "id": 5,
      "itemId": 2,
      "cfield1": "2.2.1",
      "cfield2": "2.2.2"
    },
    {
      "id": 6,
      "itemId": 2,
      "cfield1": "2.3.1",
      "cfield2": "2.3.2"
    }
  ],
  "smallchilditems": [
    {
      "sfield1": "abc",
      "sfield2": "def"
    },
    {
      "sfield1": "ghi",
      "sfield2": "jkl"
    }
  ],
  "quotes": [
    {
      "id": "11590761-01",
      "quoteName": "Upgrade Quote",
      "quoteStatus": "Qualified Opportunity",
      "billingAccount": "Jonah's Trucking Company",
      "opportunityId": 1,
      "opportunity": "Q1 upgrades",
      "customerType": "Existing Business",
      "salesChannel": "Strategic",
      "salesTeam": "Daniel Curry",
      "totalMRC": 1710,
      "totalNRC": 1000,
      "primary": true,
      "smallTitle": "11590761-01"
    },
    {
      "id": "11590762-01",
      "quoteName": "Upgrade Quote - Low Cost",
      "quoteStatus": "Qualified Opportunity",
      "billingAccount": "Jonah's Trucking Company",
      "opportunityId": 1,
      "opportunity": "Q1 upgrades",
      "customerType": "Existing Business",
      "salesChannel": "Strategic",
      "salesTeam": "Daniel Curry",
      "totalMRC": 0,
      "totalNRC": 0,
      "primary": false
    },
    {
      "id": "11590763-02",
      "quoteName": "New Location Quote",
      "quoteStatus": "Qualified Opportunity",
      "billingAccount": "Jonah's Trucking Company",
      "opportunityId": 1,
      "opportunity": "Q1 upgrades",
      "customerType": "Existing Business",
      "salesChannel": "Strategic",
      "salesTeam": "Daniel Curry",
      "totalMRC": 0,
      "totalNRC": 0,
      "primary": true
    }
  ],
  "ipAddr": [
    {
      "id": 1,
      "product": "Static IP Block",
      "initialIpBlock": "ipv4",
      "staticIpQty": 1,
      "waiveFee": false
    },
    {
      "id": 2,
      "product": "Static IP Block",
      "initialIpBlock": "ipv4",
      "staticIpQty": 5,
      "waiveFee": true
    }
  ],
  "lookups": [
    {
      "field": "rates.line",
      "code": "internet",
      "label": "Internet"
    },
    {
      "field": "rates.family",
      "code": "dedInternet",
      "label": "Dedicated Internet Access"
    }
  ],
  "rates": [
    {
      "id": 1,
      "line": "Internet",
      "family": "Dedicated Internet Access",
      "offer": "Fiber Internet 25 Mbps",
      "speedLabel": "25 Mbps",
      "speed": "25000",
      "termLabel": "1 Year",
      "term": 12,
      "chargeType": "MRC",
      "rate": 112
    },
    {
      "id": 2,
      "line": "Internet",
      "family": "Dedicated Internet Access",
      "offer": "Fiber Internet 25 Mbps",
      "speedLabel": "25 Mbps",
      "speed": "25000",
      "termLabel": "2 Year",
      "term": 24,
      "rate": 124
    },
    {
      "id": 3,
      "line": "Internet",
      "family": "Dedicated Internet Access",
      "offer": "Fiber Internet 25 Mbps",
      "speedLabel": "25 Mbps",
      "speed": "25000",
      "termLabel": "3 Year",
      "term": 36,
      "rate": 136
    },
    {
      "id": 4,
      "line": "Internet",
      "family": "Dedicated Internet Access",
      "offer": "Fiber Internet 25 Mbps",
      "speedLabel": "25 Mbps",
      "speed": "25000",
      "termLabel": "4 Year",
      "term": 48,
      "rate": 148
    },
    {
      "id": 5,
      "line": "Internet",
      "family": "Dedicated Internet Access",
      "offer": "Fiber Internet 25 Mbps",
      "speedLabel": "25 Mbps",
      "speed": "25000",
      "termLabel": "5 Year",
      "term": 60,
      "rate": 160
    },
    {
      "id": 6,
      "line": "Internet",
      "family": "Dedicated Internet Access",
      "offer": "Fiber Internet 25 Mbps",
      "speedLabel": "25 Mbps",
      "speed": "25000",
      "termLabel": "7 Year",
      "term": 84,
      "rate": 184
    },
    {
      "id": 7,
      "line": "Internet",
      "family": "Dedicated Internet Access",
      "offer": "Fiber Internet 50 Mbps",
      "speedLabel": "50 Mbps",
      "speed": "50000",
      "termLabel": "1 Year",
      "term": 12,
      "rate": 212
    },
    {
      "id": 8,
      "line": "Internet",
      "family": "Dedicated Internet Access",
      "offer": "Fiber Internet 50 Mbps",
      "speedLabel": "50 Mbps",
      "speed": "50000",
      "termLabel": "2 Year",
      "term": 24,
      "rate": 224
    },
    {
      "id": 9,
      "line": "Internet",
      "family": "Dedicated Internet Access",
      "offer": "Fiber Internet 50 Mbps",
      "speedLabel": "50 Mbps",
      "speed": "50000",
      "termLabel": "3 Year",
      "term": 36,
      "rate": 236
    },
    {
      "id": 10,
      "line": "Internet",
      "family": "Dedicated Internet Access",
      "offer": "Fiber Internet 50 Mbps",
      "speedLabel": "50 Mbps",
      "speed": "50000",
      "termLabel": "4 Year",
      "term": 48,
      "rate": 248
    },
    {
      "id": 11,
      "line": "Internet",
      "family": "Dedicated Internet Access",
      "offer": "Fiber Internet 50 Mbps",
      "speedLabel": "50 Mbps",
      "speed": "50000",
      "termLabel": "5 Year",
      "term": 60,
      "rate": 260
    },
    {
      "id": 12,
      "line": "Internet",
      "family": "Dedicated Internet Access",
      "offer": "Fiber Internet 50 Mbps",
      "speedLabel": "50 Mbps",
      "speed": "50000",
      "termLabel": "7 Year",
      "term": 84,
      "rate": 284
    },
    {
      "id": 13,
      "line": "Internet",
      "family": "Dedicated Internet Access",
      "offer": "Fiber Internet 100 Mbps",
      "speedLabel": "100 Mbps",
      "speed": "100000",
      "termLabel": "1 Year",
      "term": 12,
      "rate": 312
    },
    {
      "id": 14,
      "line": "Internet",
      "family": "Dedicated Internet Access",
      "offer": "Fiber Internet 100 Mbps",
      "speedLabel": "100 Mbps",
      "speed": "100000",
      "termLabel": "2 Year",
      "term": 24,
      "rate": 324
    },
    {
      "id": 15,
      "line": "Internet",
      "family": "Dedicated Internet Access",
      "offer": "Fiber Internet 100 Mbps",
      "speedLabel": "100 Mbps",
      "speed": "100000",
      "termLabel": "3 Year",
      "term": 36,
      "rate": 336
    },
    {
      "id": 16,
      "line": "Internet",
      "family": "Dedicated Internet Access",
      "offer": "Fiber Internet 100 Mbps",
      "speedLabel": "100 Mbps",
      "speed": "100000",
      "termLabel": "4 Year",
      "term": 48,
      "rate": 348
    },
    {
      "id": 17,
      "line": "Internet",
      "family": "Dedicated Internet Access",
      "offer": "Fiber Internet 100 Mbps",
      "speedLabel": "100 Mbps",
      "speed": "100000",
      "termLabel": "5 Year",
      "term": 60,
      "rate": 360
    },
    {
      "id": 18,
      "line": "Internet",
      "family": "Dedicated Internet Access",
      "offer": "Fiber Internet 100 Mbps",
      "speedLabel": "100 Mbps",
      "speed": "100000",
      "termLabel": "7 Year",
      "term": 84,
      "rate": 384
    },
    {
      "id": 19,
      "line": "Internet",
      "family": "Dedicated Internet Access",
      "offer": "Fiber Internet 200 Mbps",
      "speedLabel": "200 Mbps",
      "speed": "200000",
      "termLabel": "1 Year",
      "term": 12,
      "rate": 412
    },
    {
      "id": 20,
      "line": "Internet",
      "family": "Dedicated Internet Access",
      "offer": "Fiber Internet 200 Mbps",
      "speedLabel": "200 Mbps",
      "speed": "200000",
      "termLabel": "2 Year",
      "term": 24,
      "rate": 424
    },
    {
      "id": 21,
      "line": "Internet",
      "family": "Dedicated Internet Access",
      "offer": "Fiber Internet 200 Mbps",
      "speedLabel": "200 Mbps",
      "speed": "200000",
      "termLabel": "3 Year",
      "term": 36,
      "rate": 436
    },
    {
      "id": 22,
      "line": "Internet",
      "family": "Dedicated Internet Access",
      "offer": "Fiber Internet 200 Mbps",
      "speedLabel": "200 Mbps",
      "speed": "200000",
      "termLabel": "4 Year",
      "term": 48,
      "rate": 448
    },
    {
      "id": 23,
      "line": "Internet",
      "family": "Dedicated Internet Access",
      "offer": "Fiber Internet 200 Mbps",
      "speedLabel": "200 Mbps",
      "speed": "200000",
      "termLabel": "5 Year",
      "term": 60,
      "rate": 460
    },
    {
      "id": 24,
      "line": "Internet",
      "family": "Dedicated Internet Access",
      "offer": "Fiber Internet 200 Mbps",
      "speedLabel": "200 Mbps",
      "speed": "200000",
      "termLabel": "7 Year",
      "term": 84,
      "rate": 484
    },
    {
      "id": 25,
      "line": "Internet",
      "family": "Dedicated Internet Access",
      "offer": "Fiber Internet 500 Mbps",
      "speedLabel": "500 Mbps",
      "speed": "500000",
      "termLabel": "1 Year",
      "term": 12,
      "rate": 512
    },
    {
      "id": 26,
      "line": "Internet",
      "family": "Dedicated Internet Access",
      "offer": "Fiber Internet 500 Mbps",
      "speedLabel": "500 Mbps",
      "speed": "500000",
      "termLabel": "2 Year",
      "term": 24,
      "rate": 524
    },
    {
      "id": 27,
      "line": "Internet",
      "family": "Dedicated Internet Access",
      "offer": "Fiber Internet 500 Mbps",
      "speedLabel": "500 Mbps",
      "speed": "500000",
      "termLabel": "3 Year",
      "term": 36,
      "rate": 536
    },
    {
      "id": 28,
      "line": "Internet",
      "family": "Dedicated Internet Access",
      "offer": "Fiber Internet 500 Mbps",
      "speedLabel": "500 Mbps",
      "speed": "500000",
      "termLabel": "4 Year",
      "term": 48,
      "rate": 548
    },
    {
      "id": 29,
      "line": "Internet",
      "family": "Dedicated Internet Access",
      "offer": "Fiber Internet 500 Mbps",
      "speedLabel": "500 Mbps",
      "speed": "500000",
      "termLabel": "5 Year",
      "term": 60,
      "rate": 560
    },
    {
      "id": 30,
      "line": "Internet",
      "family": "Dedicated Internet Access",
      "offer": "Fiber Internet 500 Mbps",
      "speedLabel": "500 Mbps",
      "speed": "500000",
      "termLabel": "7 Year",
      "term": 84,
      "rate": 584
    },
    {
      "id": 31,
      "line": "Internet",
      "family": "Dedicated Internet Access",
      "offer": "Fiber Internet 1 Gbps",
      "speedLabel": "1 Gbps",
      "speed": 1000000,
      "termLabel": "1 Year",
      "term": 12,
      "rate": 612
    },
    {
      "id": 32,
      "line": "Internet",
      "family": "Dedicated Internet Access",
      "offer": "Fiber Internet 1 Gbps",
      "speedLabel": "1 Gbps",
      "speed": 1000000,
      "termLabel": "2 Year",
      "term": 24,
      "rate": 624
    },
    {
      "id": 33,
      "line": "Internet",
      "family": "Dedicated Internet Access",
      "offer": "Fiber Internet 1 Gbps",
      "speedLabel": "1 Gbps",
      "speed": 1000000,
      "termLabel": "3 Year",
      "term": 36,
      "rate": 636
    },
    {
      "id": 34,
      "line": "Internet",
      "family": "Dedicated Internet Access",
      "offer": "Fiber Internet 1 Gbps",
      "speedLabel": "1 Gbps",
      "speed": 1000000,
      "termLabel": "4 Year",
      "term": 48,
      "rate": 648
    },
    {
      "id": 35,
      "line": "Internet",
      "family": "Dedicated Internet Access",
      "offer": "Fiber Internet 1 Gbps",
      "speedLabel": "1 Gbps",
      "speed": 1000000,
      "termLabel": "5 Year",
      "term": 60,
      "rate": 660
    },
    {
      "id": 36,
      "line": "Internet",
      "family": "Dedicated Internet Access",
      "offer": "Fiber Internet 1 Gbps",
      "speedLabel": "1 Gbps",
      "speed": 1000000,
      "termLabel": "7 Year",
      "term": 84,
      "rate": 684
    },
    {
      "id": 37,
      "line": "Internet",
      "family": "Dedicated Internet Access",
      "offer": "Fiber Internet 2 Gbps",
      "speedLabel": "2 Gbps",
      "speed": 2000000,
      "termLabel": "1 Year",
      "term": 12,
      "rate": 712
    },
    {
      "id": 38,
      "line": "Internet",
      "family": "Dedicated Internet Access",
      "offer": "Fiber Internet 2 Gbps",
      "speedLabel": "2 Gbps",
      "speed": 2000000,
      "termLabel": "2 Year",
      "term": 24,
      "rate": 724
    },
    {
      "id": 39,
      "line": "Internet",
      "family": "Dedicated Internet Access",
      "offer": "Fiber Internet 2 Gbps",
      "speedLabel": "2 Gbps",
      "speed": 2000000,
      "termLabel": "3 Year",
      "term": 36,
      "rate": 736
    },
    {
      "id": 40,
      "line": "Internet",
      "family": "Dedicated Internet Access",
      "offer": "Fiber Internet 2 Gbps",
      "speedLabel": "2 Gbps",
      "speed": 2000000,
      "termLabel": "4 Year",
      "term": 48,
      "rate": 748
    },
    {
      "id": 41,
      "line": "Internet",
      "family": "Dedicated Internet Access",
      "offer": "Fiber Internet 2 Gbps",
      "speedLabel": "2 Gbps",
      "speed": 2000000,
      "termLabel": "5 Year",
      "term": 60,
      "rate": 760
    },
    {
      "id": 42,
      "line": "Internet",
      "family": "Dedicated Internet Access",
      "offer": "Fiber Internet 2 Gbps",
      "speedLabel": "2 Gbps",
      "speed": 2000000,
      "termLabel": "7 Year",
      "term": 84,
      "rate": 784
    },
    {
      "id": 43,
      "line": "Internet",
      "family": "Dedicated Internet Access",
      "offer": "Fiber Internet 5 Gbps",
      "speedLabel": "5 Gbps",
      "speed": 5000000,
      "termLabel": "1 Year",
      "term": 12,
      "rate": 812
    },
    {
      "id": 44,
      "line": "Internet",
      "family": "Dedicated Internet Access",
      "offer": "Fiber Internet 5 Gbps",
      "speedLabel": "5 Gbps",
      "speed": 5000000,
      "termLabel": "2 Year",
      "term": 24,
      "rate": 824
    },
    {
      "id": 45,
      "line": "Internet",
      "family": "Dedicated Internet Access",
      "offer": "Fiber Internet 5 Gbps",
      "speedLabel": "5 Gbps",
      "speed": 5000000,
      "termLabel": "3 Year",
      "term": 36,
      "rate": 836
    },
    {
      "id": 46,
      "line": "Internet",
      "family": "Dedicated Internet Access",
      "offer": "Fiber Internet 5 Gbps",
      "speedLabel": "5 Gbps",
      "speed": 5000000,
      "termLabel": "4 Year",
      "term": 48,
      "rate": 848
    },
    {
      "id": 47,
      "line": "Internet",
      "family": "Dedicated Internet Access",
      "offer": "Fiber Internet 5 Gbps",
      "speedLabel": "5 Gbps",
      "speed": 5000000,
      "termLabel": "5 Year",
      "term": 60,
      "rate": 860
    },
    {
      "id": 48,
      "line": "Internet",
      "family": "Dedicated Internet Access",
      "offer": "Fiber Internet 5 Gbps",
      "speedLabel": "5 Gbps",
      "speed": 5000000,
      "termLabel": "7 Year",
      "term": 84,
      "rate": 884
    },
    {
      "id": 49,
      "line": "Internet",
      "family": "Dedicated Internet Access",
      "offer": "Fiber Internet 10 Gbps",
      "speedLabel": "10 Gbps",
      "speed": 10000000,
      "termLabel": "1 Year",
      "term": 12,
      "rate": 912
    },
    {
      "id": 50,
      "line": "Internet",
      "family": "Dedicated Internet Access",
      "offer": "Fiber Internet 10 Gbps",
      "speedLabel": "10 Gbps",
      "speed": 10000000,
      "termLabel": "2 Year",
      "term": 24,
      "rate": 924
    },
    {
      "id": 51,
      "line": "Internet",
      "family": "Dedicated Internet Access",
      "offer": "Fiber Internet 10 Gbps",
      "speedLabel": "10 Gbps",
      "speed": 10000000,
      "termLabel": "3 Year",
      "term": 36,
      "rate": 936
    },
    {
      "id": 52,
      "line": "Internet",
      "family": "Dedicated Internet Access",
      "offer": "Fiber Internet 10 Gbps",
      "speedLabel": "10 Gbps",
      "speed": 10000000,
      "termLabel": "4 Year",
      "term": 48,
      "rate": 948
    },
    {
      "id": 53,
      "line": "Internet",
      "family": "Dedicated Internet Access",
      "offer": "Fiber Internet 10 Gbps",
      "speedLabel": "10 Gbps",
      "speed": 10000000,
      "termLabel": "5 Year",
      "term": 60,
      "rate": 960
    },
    {
      "id": 54,
      "line": "Internet",
      "family": "Dedicated Internet Access",
      "offer": "Fiber Internet 10 Gbps",
      "speedLabel": "10 Gbps",
      "speed": 10000000,
      "termLabel": "7 Year",
      "term": 84,
      "rate": 984
    },
    {
      "id": 55,
      "line": "Internet",
      "family": "IPs",
      "offer": "Static IP 1",
      "numIPs": 1,
      "numIPsLabel": "1 Static IP",
      "quantity": 1,
      "termLabel": "MRC",
      "term": "1",
      "rate": 1
    },
    {
      "id": 56,
      "line": "Internet",
      "family": "IPs",
      "offer": "Static IP 5",
      "numIPs": 5,
      "numIPsLabel": "5 Static IP",
      "quantity": 5,
      "termLabel": "MRC",
      "term": "1",
      "rate": 5
    },
    {
      "id": 57,
      "line": "Internet",
      "family": "IPs",
      "offer": "Static IP 13",
      "numIPs": 13,
      "numIPsLabel": "13 Static IP",
      "quantity": 13,
      "termLabel": "MRC",
      "term": "1",
      "rate": 13
    },
    {
      "id": 58,
      "line": "Internet",
      "family": "IPs",
      "offer": "Static IP 29",
      "numIPs": 29,
      "numIPsLabel": "29 Static IP",
      "quantity": 29,
      "termLabel": "MRC",
      "term": "1",
      "rate": 29
    },
    {
      "id": 59,
      "line": "Internet",
      "family": "IPs",
      "offer": "Static IP 61",
      "numIPs": 61,
      "numIPsLabel": "61 Static IP",
      "quantity": 61,
      "termLabel": "MRC",
      "term": "1",
      "rate": 61
    },
    {
      "id": 60,
      "line": "Internet",
      "family": "IPs",
      "offer": "Static IP 125",
      "numIPs": 125,
      "numIPsLabel": "125 Static IP",
      "quantity": 125,
      "termLabel": "MRC",
      "term": "1",
      "rate": 125
    },
    {
      "id": 61,
      "line": "Internet",
      "family": "IPs",
      "offer": "Static IP 253",
      "numIPs": 253,
      "numIPsLabel": "253 Static IP",
      "quantity": 253,
      "termLabel": "MRC",
      "term": "1",
      "rate": 253
    },
    {
      "id": 62,
      "line": "Internet",
      "family": "IPs",
      "offer": "Static IP >253",
      "numIPs": 9999,
      "numIPsLabel": ">253 Static IP",
      "quantity": 9999,
      "termLabel": "MRC",
      "term": "1",
      "rate": -1
    },
    {
      "id": 67,
      "line": "Internet",
      "family": "Managed Router Service",
      "offer": "Mgd Router 20M",
      "tierLabel": "20 Mbps",
      "tier": 20000,
      "termLabel": "1 Year",
      "term": 12,
      "rate": 201
    },
    {
      "id": 68,
      "line": "Internet",
      "family": "Managed Router Service",
      "offer": "Mgd Router 20M",
      "tierLabel": "20 Mbps",
      "tier": 20000,
      "termLabel": "2 Year",
      "term": 24,
      "rate": 202
    },
    {
      "id": 69,
      "line": "Internet",
      "family": "Managed Router Service",
      "offer": "Mgd Router 20M",
      "tierLabel": "20 Mbps",
      "tier": 20000,
      "termLabel": "3 Year",
      "term": 36,
      "rate": 203
    },
    {
      "id": 70,
      "line": "Internet",
      "family": "Managed Router Service",
      "offer": "Mgd Router 20M",
      "tierLabel": "20 Mbps",
      "tier": 20000,
      "termLabel": "4 Year",
      "term": 48,
      "rate": 204
    },
    {
      "id": 71,
      "line": "Internet",
      "family": "Managed Router Service",
      "offer": "Mgd Router 20M",
      "tierLabel": "20 Mbps",
      "tier": 20000,
      "termLabel": "5 Year",
      "term": 60,
      "rate": 205
    },
    {
      "id": 72,
      "line": "Internet",
      "family": "Managed Router Service",
      "offer": "Mgd Router 20M",
      "tierLabel": "20 Mbps",
      "tier": 20000,
      "termLabel": "7 Year",
      "term": 84,
      "rate": 206
    },
    {
      "id": 73,
      "line": "Internet",
      "family": "Managed Router Service",
      "offer": "Mgd Router 30M",
      "tierLabel": "30 Mbps",
      "tier": 30000,
      "termLabel": "1 Year",
      "term": 12,
      "rate": 301
    },
    {
      "id": 74,
      "line": "Internet",
      "family": "Managed Router Service",
      "offer": "Mgd Router 30M",
      "tierLabel": "30 Mbps",
      "tier": 30000,
      "termLabel": "2 Year",
      "term": 24,
      "rate": 302
    },
    {
      "id": 75,
      "line": "Internet",
      "family": "Managed Router Service",
      "offer": "Mgd Router 30M",
      "tierLabel": "30 Mbps",
      "tier": 30000,
      "termLabel": "3 Year",
      "term": 36,
      "rate": 303
    },
    {
      "id": 76,
      "line": "Internet",
      "family": "Managed Router Service",
      "offer": "Mgd Router 30M",
      "tierLabel": "30 Mbps",
      "tier": 30000,
      "termLabel": "4 Year",
      "term": 48,
      "rate": 304
    },
    {
      "id": 77,
      "line": "Internet",
      "family": "Managed Router Service",
      "offer": "Mgd Router 30M",
      "tierLabel": "30 Mbps",
      "tier": 30000,
      "termLabel": "5 Year",
      "term": 60,
      "rate": 305
    },
    {
      "id": 78,
      "line": "Internet",
      "family": "Managed Router Service",
      "offer": "Mgd Router 30M",
      "tierLabel": "30 Mbps",
      "tier": 30000,
      "termLabel": "7 Year",
      "term": 84,
      "rate": 306
    },
    {
      "id": 79,
      "line": "Internet",
      "family": "Managed Router Service",
      "offer": "Mgd Router 500M",
      "tierLabel": "500 Mbps",
      "tier": 500000,
      "termLabel": "1 Year",
      "term": 12,
      "rate": 5001
    },
    {
      "id": 80,
      "line": "Internet",
      "family": "Managed Router Service",
      "offer": "Mgd Router 500M",
      "tierLabel": "500 Mbps",
      "tier": 500000,
      "termLabel": "2 Year",
      "term": 24,
      "rate": 5002
    },
    {
      "id": 81,
      "line": "Internet",
      "family": "Managed Router Service",
      "offer": "Mgd Router 500M",
      "tierLabel": "500 Mbps",
      "tier": 500000,
      "termLabel": "3 Year",
      "term": 36,
      "rate": 5003
    },
    {
      "id": 82,
      "line": "Internet",
      "family": "Managed Router Service",
      "offer": "Mgd Router 500M",
      "tierLabel": "500 Mbps",
      "tier": 500000,
      "termLabel": "4 Year",
      "term": 48,
      "rate": 5004
    },
    {
      "id": 83,
      "line": "Internet",
      "family": "Managed Router Service",
      "offer": "Mgd Router 500M",
      "tierLabel": "500 Mbps",
      "tier": 500000,
      "termLabel": "5 Year",
      "term": 60,
      "rate": 5005
    },
    {
      "id": 84,
      "line": "Internet",
      "family": "Managed Router Service",
      "offer": "Mgd Router 500M",
      "tierLabel": "500 Mbps",
      "tier": 500000,
      "termLabel": "7 Year",
      "term": 84,
      "rate": 5006
    }
  ],
  "opportunities": [
    {
      "id": 1,
      "label": "Jonah’s Trucking Company-Upgrade",
      "opportunityOwner": "Roland Knight",
      "account": "Jonah’s Trucking Company",
      "closeDate": "12/3/2021",
      "stage": "Needs Analysis",
      "probability": "20%",
      "createdBy": "Onis Digital Architect, 12/3/2020, 10:51AM",
      "modifiedBy": "Roland Knight, 12/4/2020, 2:20AM"
    },
    {
      "id": 2,
      "label": "Truck Wifi",
      "account": "Jonny's Chip Truck"
    }
  ],
  "cartItems": [
    {
      "id": "11590761-01_ws.8",
      "quoteId": "11590761-01",
      "sort": "0008",
      "type": "location",
      "description": "137 Teaticket Hwy, East Falmouth MA 2536"
    },
    {
      "id": "11590761-01_ws.64",
      "quoteId": "11590761-01",
      "sort": "0064",
      "type": "location",
      "description": "2465 Hempstead Turnpike, East Meadow NY 11554"
    },
    {
      "id": "11590761-01_ws.1:fia.0",
      "sort": "0008.fia:0001",
      "name": "fia",
      "type": "product",
      "quoteId": "11590761-01",
      "description": "Fiber Internet Access"
    },
    {
      "id": "11590761-01_ws.1:fia.1",
      "sort": "0008.fia:0001.fiamrc:0001",
      "type": "charge",
      "name": "fiamrc",
      "qty": 1,
      "productId": "1",
      "locationId": "8",
      "percentRC": "RC",
      "source": "Rate Card",
      "quoteId": "11590761-01",
      "description": "Fiber Internet Retail 10 Gbps, 7 years",
      "unit": 984,
      "mrc": 984,
      "contractEnd": "9/7/2118"
    },
    {
      "id": "11590761-01_ws.1:fia.2",
      "sort": "0008.fia:0001.install:0002",
      "type": "charge",
      "name": "install",
      "qty": 1,
      "percentRC": "RC",
      "source": "Rate Card",
      "quoteId": "11590761-01",
      "description": "Fiber Internet Retail Installation",
      "nrc": 250
    },
    {
      "id": "11590761-01_ws.1:fia.3",
      "sort": "0008.fia:0001.ipblock:0003",
      "type": "charge",
      "name": "ipblock",
      "qty": 1,
      "percentRC": "RC",
      "source": "Rate Card",
      "quoteId": "11590761-01",
      "description": "Fiber Internet Retail IPv4 1 Static IP 7 years",
      "unit": "984",
      "mrc": 20,
      "contractEnd": "9/7/2118"
    },
    {
      "id": "11590761-01_ws.1:uc.0",
      "sort": "0008.uc:0001",
      "name": "uc",
      "type": "product",
      "quoteId": "11590761-01",
      "description": "Unified Communications"
    },
    {
      "id": "11590761-01_ws.1:uc.1",
      "sort": "0008.uc:0001.ucmrc:0001",
      "type": "charge",
      "name": "ucmrc",
      "qty": 1,
      "percentRC": "RC",
      "source": "Rate Card",
      "quoteId": "11590761-01",
      "description": "Hosted Voice Enterprise Fiber Bundled Seat Tier Hosted Contact Center",
      "unit": 50,
      "mrc": 50,
      "contractEnd": "12/7/2023"
    },
    {
      "id": "11590761-01_ws.1:uc.2",
      "sort": "0008.uc:0001.install:0002",
      "type": "charge",
      "name": "install",
      "qty": 1,
      "percentRC": "RC",
      "source": "Rate Card",
      "quoteId": "11590761-01",
      "description": "Fiber Internet Retail Installation",
      "nrc": 500
    },
    {
      "id": "11590761-01_ws.2:fia.0",
      "sort": "0064.fia:0002",
      "name": "fia",
      "type": "product",
      "quoteId": "11590761-01",
      "description": "Fiber Internet Access"
    },
    {
      "id": "11590761-01_ws.2:fia.1",
      "sort": "0064.fia:0002.fiamrc:0001",
      "type": "charge",
      "name": "fiamrc",
      "qty": 1,
      "productId": "2",
      "locationId": "64",
      "percentRC": "RC",
      "source": "Rate Card",
      "quoteId": "11590761-01",
      "description": "Fiber Internet Retail 1 Gbps, 3 years",
      "unit": 636,
      "mrc": 636,
      "contractEnd": "12/7/2023"
    },
    {
      "id": "11590761-01_ws.2:fia.2",
      "sort": "0064.fia:0002.install:0002",
      "type": "charge",
      "name": "install",
      "qty": 1,
      "percentRC": "RC",
      "source": "Rate Card",
      "quoteId": "11590761-01",
      "description": "Fiber Internet Retail Installation",
      "nrc": 250
    },
    {
      "id": "11590761-01_ws.2:fia.3",
      "sort": "0064.fia:0002.ipblock:0003",
      "type": "charge",
      "name": "ipblock",
      "qty": 1,
      "percentRC": "RC",
      "source": "Rate Card",
      "quoteId": "11590761-01",
      "description": "Fiber Internet Retail IPv4 1 Static IP 3 years",
      "unit": "636",
      "mrc": 20,
      "contractEnd": "12/7/2023"
    }
  ],
  "fia": [
    {
      "quoteId": "11590761-01",
      "id": 1,
      "bandwidth": "10000000",
      "term": "84",
      "ipAddresses": [
        {
          "ipBlock": "IPv4",
          "staticIPs": "5 static IPs"
        }
      ],
      "recommendDone": true
    },
    {
      "quoteId": "11590761-01",
      "id": 2,
      "bandwidth": 1000000,
      "term": 36,
      "ipAddresses": [
        {
          "ipBlock": "IPv4",
          "staticIPs": "5 static IPs"
        }
      ],
      "recommendDone": true
    }
  ],
  "uc": [
    {
      "quoteId": "11590761-01",
      "term": 36,
      "transport": "fiber",
      "phoneRental": "rental",
      "bundledSeatTier": [
        {
          "type": "UC Connect Plus",
          "quantity": 1
        }
      ],
      "businessSegment": "ent",
      "type": "t2",
      "id": 1
    }
  ]
}