<svg width="1280" height="561" viewBox="0 0 1280 561" fill="none" xmlns="http://www.w3.org/2000/svg">
<path d="M928.5 1C1100.5 1 1234.5 33.1119 1280 49.1678V561H-1V36.2448C209.8 88.877 424.5 66.7902 505.5 49.1678C574.833 33.1119 756.5 1 928.5 1Z" fill="url(#paint0_linear_382_7)"/>
<path d="M350.5 0C178.5 0 44.5 32.1119 -1 48.1678V560H1280V35.2448C1069.2 87.8769 854.5 65.7902 773.5 48.1678C704.167 32.1119 522.5 0 350.5 0Z" fill="url(#paint1_linear_382_7)" fill-opacity="0.3"/>
<defs>
<linearGradient id="paint0_linear_382_7" x1="1098.08" y1="476.408" x2="816.754" y2="-179.009" gradientUnits="userSpaceOnUse">
<stop stop-color="#3B68FC"/>
<stop offset="1" stop-color="#51E6FF"/>
</linearGradient>
<linearGradient id="paint1_linear_382_7" x1="180.922" y1="475.408" x2="462.246" y2="-180.009" gradientUnits="userSpaceOnUse">
<stop stop-color="#3B68FC"/>
<stop offset="1" stop-color="#51E6FF"/>
</linearGradient>
</defs>
</svg>
