<svg width="93" height="93" viewBox="0 0 93 93" fill="none" xmlns="http://www.w3.org/2000/svg">
<path d="M46.4954 92.9908C72.1741 92.9908 92.9908 72.1741 92.9908 46.4954C92.9908 20.8167 72.1741 0 46.4954 0C20.8167 0 0 20.8167 0 46.4954C0 72.1741 20.8167 92.9908 46.4954 92.9908Z" fill="url(#paint0_linear_1_4281)"/>
<path d="M53.0874 44.0216C52.7603 44.0216 52.4437 43.9245 52.1723 43.7478C51.902 43.5622 51.6901 43.3061 51.5656 43.0058C51.4385 42.7054 51.4093 42.3698 51.4729 42.0518C51.5364 41.7338 51.6929 41.4422 51.9238 41.2126L55.7025 37.4318L51.9238 33.6511C51.6134 33.3419 51.4412 32.9268 51.4412 32.4851C51.4412 32.0522 51.6161 31.6282 51.9238 31.3191C52.2344 31.0099 52.6515 30.842 53.0886 30.842C53.5258 30.842 53.9456 31.0099 54.2539 31.3191L59.1981 36.2658C59.3517 36.4159 59.4717 36.6015 59.5559 36.8047C59.6407 36.999 59.6804 37.211 59.6804 37.4318C59.6804 37.6439 59.638 37.8647 59.5559 38.059C59.4712 38.2621 59.3522 38.4477 59.1981 38.5979L54.2539 43.5446C54.1003 43.6948 53.9197 43.8185 53.7196 43.898C53.5183 43.9774 53.3052 44.0216 53.0886 44.0216L53.0874 44.0216Z" fill="white"/>
<path d="M26.7197 48.9687C26.5026 48.9687 26.2895 48.9245 26.0891 48.845C25.8879 48.7566 25.7075 48.6419 25.5545 48.4829C25.4009 48.3327 25.2808 48.1472 25.1977 47.9528C25.1129 47.7497 25.0703 47.5376 25.0703 47.3168V45.6738C25.0703 43.0502 26.1281 40.5504 27.9786 38.6953C29.8292 36.8403 32.3355 35.7979 34.9537 35.7803H56.3821C56.819 35.7803 57.2375 35.9569 57.547 36.2661C57.8576 36.5752 58.0292 36.9905 58.0292 37.4321C58.0292 37.865 57.8544 38.289 57.547 38.5982C57.2367 38.9073 56.819 39.0752 56.3821 39.0752H34.9579C33.2125 39.0937 31.5403 39.7907 30.3061 41.0274C29.0723 42.2552 28.3755 43.9336 28.3665 45.6738V47.3168C28.3665 47.5376 28.3242 47.7497 28.2395 47.9528C28.1547 48.1472 28.0355 48.3327 27.8817 48.4829C27.7281 48.642 27.547 48.7567 27.3474 48.845C27.1462 48.9245 26.9328 48.9687 26.7165 48.9687H26.7197Z" fill="white"/>
<path d="M39.9049 62.1481C39.6877 62.1481 39.4737 62.1129 39.273 62.0244C39.0717 61.945 38.8915 61.8213 38.739 61.6711L33.7954 56.7243C33.6418 56.5742 33.5218 56.3886 33.4379 56.1855C33.3558 55.9911 33.3105 55.7791 33.3105 55.5583C33.3105 55.3462 33.3532 55.1254 33.4379 54.9311C33.5226 54.728 33.6415 54.5424 33.7954 54.3923L38.739 49.4455C39.0496 49.1452 39.4672 48.9685 39.9036 48.9685C40.341 48.9685 40.7598 49.1451 41.0691 49.4543C41.3762 49.7635 41.5513 50.1787 41.5513 50.6115C41.5513 51.0532 41.3767 51.4684 41.0701 51.7776L37.291 55.5583L41.0701 59.339C41.3004 59.5686 41.4571 59.8602 41.5206 60.1782C41.5842 60.5051 41.555 60.8319 41.4279 61.1322C41.3034 61.4326 41.092 61.6888 40.8209 61.8743C40.5505 62.0509 40.2318 62.1481 39.9058 62.1481H39.9049Z" fill="white"/>
<path d="M36.6077 57.2101C36.1714 57.2101 35.7515 57.0335 35.4422 56.7243C35.1319 56.4151 34.96 56 34.96 55.5583C34.96 55.1255 35.1345 54.7014 35.4422 54.3923C35.7528 54.0831 36.1714 53.9153 36.6077 53.9153H58.0313C59.7778 53.8967 61.4492 53.1998 62.6831 51.9631C63.9172 50.7352 64.614 49.0568 64.6227 47.3166V45.6736C64.6227 45.2319 64.7975 44.8167 65.1062 44.5076C65.4168 44.1984 65.8342 44.0217 66.2711 44.0217C66.7085 44.0217 67.1271 44.1983 67.4363 44.5076C67.7469 44.8167 67.9199 45.2319 67.9199 45.6736V47.3166C67.9199 49.9402 66.8614 52.4401 65.0106 54.2951C63.16 56.1501 60.6541 57.1925 58.0365 57.2101H36.6077Z" fill="white"/>
<defs>
<linearGradient id="paint0_linear_1_4281" x1="-2.38303e-05" y1="46.4954" x2="92.9908" y2="46.4954" gradientUnits="userSpaceOnUse">
<stop stop-color="#517AFF"/>
<stop offset="1" stop-color="#51E6FF"/>
</linearGradient>
</defs>
</svg>
