<svg width="93" height="93" viewBox="0 0 93 93" fill="none" xmlns="http://www.w3.org/2000/svg">
<path d="M46.4954 92.9908C72.1741 92.9908 92.9908 72.1741 92.9908 46.4954C92.9908 20.8167 72.1741 0 46.4954 0C20.8167 0 0 20.8167 0 46.4954C0 72.1741 20.8167 92.9908 46.4954 92.9908Z" fill="url(#paint0_linear_1_4306)"/>
<path d="M64.2888 43.1834H49.8072C48.4899 43.1834 47.2277 42.6622 46.2965 41.7347C45.3658 40.7984 44.8418 39.5352 44.8418 38.219V23.7409C44.8418 23.6879 44.8418 23.6349 44.8074 23.5817C44.773 23.5288 44.757 23.4846 44.7173 23.4494C44.6802 23.4051 44.6326 23.3787 44.5823 23.3609C44.532 23.3344 44.479 23.3257 44.4261 23.3257H34.9099C33.1539 23.3257 31.4701 24.0235 30.229 25.2691C28.9872 26.5058 28.29 28.1929 28.29 29.942V63.0499C28.29 64.799 28.9872 66.4862 30.229 67.7317C31.4701 68.9684 33.1539 69.6662 34.9099 69.6662H58.0801C59.8363 69.6662 61.5198 68.9684 62.7608 67.7317C64.0029 66.4862 64.7001 64.799 64.7001 63.0499V43.5986C64.7001 43.5456 64.7001 43.4926 64.6656 43.4394C64.6312 43.3952 64.6153 43.3423 64.5756 43.3071C64.5386 43.2718 64.4909 43.2364 64.4433 43.2186C64.393 43.2001 64.3399 43.1834 64.287 43.1834H64.2888ZM54.7724 59.7374H38.222C37.783 59.7374 37.3622 59.5608 37.0514 59.2515C36.741 58.9424 36.5674 58.5183 36.5674 58.0855C36.5674 57.6438 36.7421 57.2198 37.0514 56.9107C37.362 56.6015 37.783 56.4248 38.222 56.4248H54.7724C55.2114 56.4248 55.6322 56.6014 55.943 56.9107C56.2533 57.2198 56.427 57.6438 56.427 58.0855C56.427 58.5183 56.2523 58.9424 55.943 59.2515C55.6324 59.5607 55.2114 59.7374 54.7724 59.7374ZM54.7724 51.4604H38.222C37.783 51.4604 37.3622 51.2838 37.0514 50.9745C36.741 50.6654 36.5674 50.2414 36.5674 49.8085C36.5674 49.3669 36.7421 48.9429 37.0514 48.6337C37.362 48.3245 37.783 48.1478 38.222 48.1478H54.7724C55.2114 48.1478 55.6322 48.3245 55.943 48.6337C56.2533 48.9429 56.427 49.3669 56.427 49.8085C56.427 50.2414 56.2523 50.6654 55.943 50.9745C55.6324 51.2837 55.2114 51.4604 54.7724 51.4604Z" fill="white"/>
<path d="M63.3811 39.5263L48.5055 24.6507C48.471 24.6155 48.4392 24.5977 48.3995 24.589C48.3598 24.5811 48.3201 24.589 48.2804 24.6075C48.2434 24.6155 48.2116 24.6428 48.1877 24.6783C48.1533 24.7135 48.1533 24.7577 48.1533 24.7932V38.2201C48.1533 38.6617 48.3281 39.0857 48.6376 39.3949C48.9479 39.7041 49.3689 39.8808 49.8082 39.8808H63.2358C63.2755 39.8808 63.3152 39.8622 63.3496 39.8455C63.384 39.8191 63.4105 39.7838 63.4264 39.7484C63.4264 39.7131 63.4608 39.6689 63.4264 39.6335C63.4264 39.5892 63.392 39.554 63.3708 39.5275L63.3811 39.5263Z" fill="white"/>
<defs>
<linearGradient id="paint0_linear_1_4306" x1="-5.5604e-05" y1="46.4954" x2="92.9908" y2="46.4954" gradientUnits="userSpaceOnUse">
<stop stop-color="#43DCAE"/>
<stop offset="1" stop-color="#438FAE"/>
</linearGradient>
</defs>
</svg>
