<svg width="463" height="513" viewBox="0 0 463 513" fill="none" xmlns="http://www.w3.org/2000/svg">
<path d="M462 100.393L260.78 70L218.643 348.978L419.863 379.37L462 100.393Z" fill="#F5F5F5"/>
<path d="M419.397 192.964L274.165 171.048L272.837 179.849L418.066 201.765L419.397 192.964Z" fill="#E0E0E0"/>
<path d="M416.078 214.966L270.847 193.05L269.518 201.851L414.747 223.767L416.078 214.966Z" fill="#E0E0E0"/>
<path d="M430.023 122.539L355.197 111.256L353.874 120.057L428.691 131.348L430.023 122.539Z" fill="#E0E0E0"/>
<path d="M420.098 143.556L358.482 134.262L357.159 143.063L418.775 152.357L420.098 143.556Z" fill="url(#paint0_linear_50_0)"/>
<path d="M395.156 234.315L267.523 215.053L266.195 223.863L393.825 243.116L395.156 234.315Z" fill="#E0E0E0"/>
<path d="M374.226 253.664L264.2 237.064L262.872 245.865L372.894 262.465L374.226 253.664Z" fill="#E0E0E0"/>
<path d="M357.704 273.678L260.881 259.067L259.552 267.868L356.373 282.479L357.704 273.678Z" fill="#E0E0E0"/>
<path d="M380.788 299.666L257.561 281.07L256.233 289.879L379.457 308.467L380.788 299.666Z" fill="#E0E0E0"/>
<path d="M302.649 310.378L254.244 303.072L252.916 311.882L301.327 319.187L302.649 310.378Z" fill="#009AFF"/>
<path opacity="0.5" d="M341.019 123.36C341.789 118.293 341.224 113.106 339.394 108.317C337.561 103.527 334.518 99.2909 330.558 96.0315C326.607 92.7636 321.878 90.5763 316.829 89.6858C311.771 88.7867 306.576 89.2189 301.743 90.9221C296.91 92.6339 292.599 95.5647 289.232 99.4379C285.867 103.302 283.559 107.98 282.536 113.003C281.513 118.034 281.808 123.239 283.392 128.115C284.977 132.991 287.798 137.374 291.579 140.841C291.579 140.884 291.579 140.927 291.579 140.97C292.398 142.042 293.422 142.933 294.593 143.607L294.645 143.478C295.847 144.869 301.354 147.627 308.011 148.613H308.159C312.378 149.261 317.063 149.201 321.412 147.627C321.412 147.627 321.454 147.558 321.534 147.42C322.632 147.091 323.661 146.59 324.595 145.941L324.691 145.613C329.013 143.503 332.757 140.374 335.601 136.501C338.445 132.628 340.304 128.115 341.022 123.36L341.019 123.36Z" fill="url(#paint1_linear_50_0)"/>
<path d="M340.008 122.15C342.385 106.415 331.553 91.7265 315.809 89.3577C300.075 86.9802 285.395 97.8128 283.021 113.547C280.646 129.282 291.479 143.971 307.216 146.34C322.951 148.717 337.63 137.884 340.008 122.15Z" fill="#F5F5F5"/>
<path d="M298.38 127.346C298.38 127.346 291.526 126.87 291.437 139.51C292.233 140.547 293.225 141.412 294.359 142.06L300.126 129.706L298.38 127.346Z" fill="#FDA57D"/>
<path d="M320.408 130.665C320.408 130.665 327.117 132.248 323.46 144.342C322.396 145.103 321.186 145.639 319.915 145.924L318.048 132.429L320.408 130.665Z" fill="#FDA57D"/>
<path d="M301.733 107.124C301.733 107.124 297.082 116.037 295.457 114.887C295.457 114.887 310.24 132.135 327.471 119.711C326.131 116.357 324.393 113.175 322.301 110.227L301.733 107.124Z" fill="#333333"/>
<path d="M325.422 109.804C326.469 102.827 321.67 96.317 314.694 95.2709C307.725 94.2162 301.215 99.0144 300.161 105.991C299.106 112.968 303.913 119.469 310.89 120.524C317.858 121.579 324.368 116.772 325.422 109.804Z" fill="#333333"/>
<path opacity="0.1" d="M320.278 130.648L298.25 127.328L294.861 135.827C294.861 135.827 293.039 139.726 294.272 141.749C295.509 143.772 308.918 149.962 320.097 145.968C321.35 143.746 321.843 141.187 321.506 138.662C320.952 134.374 321.255 138.325 321.255 138.325L320.278 130.648Z" fill="#334D6E"/>
<path opacity="0.1" d="M320.572 130.691L298.543 127.371L295.163 135.87C295.163 135.87 293.339 139.769 294.575 141.792C295.803 143.815 309.22 150.005 320.399 146.002C321.653 143.789 322.145 141.23 321.8 138.705C321.246 134.417 321.558 138.368 321.558 138.368L320.572 130.691Z" fill="#334D6E"/>
<path d="M320.408 130.665L298.379 127.346L294.999 135.853C294.999 135.853 293.172 139.743 294.403 141.766C295.639 143.789 309.057 149.988 320.235 145.985C321.489 143.772 321.982 141.204 321.636 138.688C321.082 134.391 321.384 138.351 321.384 138.351L320.408 130.665Z" fill="url(#paint2_linear_50_0)"/>
<path opacity="0.1" d="M306.23 121.078L315.048 122.409L313.846 130.363C313.709 131.288 313.198 132.127 312.446 132.689C311.685 133.242 310.743 133.475 309.809 133.337L308.002 133.069C307.077 132.931 306.238 132.421 305.685 131.668C305.123 130.908 304.89 129.957 305.028 129.032L306.23 121.078Z" fill="#334D6E"/>
<path d="M306.273 120.749L315.091 122.08L313.89 130.034C313.752 130.968 313.241 131.798 312.489 132.36C311.728 132.922 310.786 133.155 309.852 133.008L308.054 132.74C307.12 132.602 306.29 132.1 305.728 131.34C305.166 130.579 304.933 129.636 305.08 128.703L306.273 120.749Z" fill="#FDA57D"/>
<path opacity="0.1" d="M306.108 121.994C308.788 123.489 311.918 123.965 314.918 123.351L315.081 122.27L306.272 120.939L306.108 121.994Z" fill="#334D6E"/>
<path d="M325.007 112.544C326.062 105.567 321.256 99.0573 314.279 98.0026C307.311 96.9565 300.8 101.755 299.746 108.732C298.699 115.708 303.498 122.21 310.475 123.264C317.443 124.319 323.953 119.512 325.007 112.544Z" fill="#FDA57D"/>
<path d="M300.999 104.011L325.085 107.642C325.085 107.642 324.497 97.6222 315.298 96.8528C306.1 96.0747 300.999 104.011 300.999 104.011Z" fill="#333333"/>
<path d="M301.258 108.403C301.442 107.184 301.069 106.121 300.42 106.017C299.771 105.922 299.097 106.83 298.915 108.049C298.731 109.268 299.104 110.331 299.754 110.435C300.402 110.53 301.077 109.622 301.258 108.403Z" fill="#FDA57D"/>
<path d="M325.933 112.13C326.122 110.911 325.743 109.847 325.094 109.744C324.445 109.648 323.772 110.556 323.59 111.775C323.406 112.994 323.779 114.058 324.428 114.153C325.077 114.257 325.751 113.349 325.933 112.13Z" fill="#FDA57D"/>
<path opacity="0.1" d="M300.965 104.331L325.051 107.962C325.051 107.962 324.463 97.951 315.264 97.1729C306.065 96.4035 300.965 104.331 300.965 104.331Z" fill="#334D6E"/>
<path opacity="0.5" d="M215.727 84.507L9 117.921L55.163 403.557L261.89 370.143L215.727 84.507Z" fill="url(#paint3_linear_50_0)"/>
<path d="M212.62 86.176L11.7979 119.098L57.4414 397.523L258.263 364.601L212.62 86.176Z" fill="#F5F5F5"/>
<path d="M203.31 211.673L58.3691 235.439L59.8094 244.223L204.751 220.456L203.31 211.673Z" fill="#E0E0E0"/>
<path d="M206.91 233.632L61.9688 257.398L63.4081 266.182L208.35 242.425L206.91 233.632Z" fill="#E0E0E0"/>
<path d="M191.795 141.402L117.127 153.644L118.567 162.428L193.235 150.186L191.795 141.402Z" fill="#E0E0E0"/>
<path d="M188.804 164.443L127.312 174.523L128.752 183.307L190.244 173.226L188.804 164.443Z" fill="url(#paint4_linear_50_0)"/>
<path d="M192.944 258.479L65.5684 279.358L67.0086 288.141L194.384 267.263L192.944 258.479Z" fill="#E0E0E0"/>
<path d="M178.973 283.317L69.168 301.317L70.6082 310.1L180.413 292.101L178.973 283.317Z" fill="#E0E0E0"/>
<path d="M169.398 307.438L72.7686 323.277L74.2082 332.069L170.838 316.222L169.398 307.438Z" fill="#E0E0E0"/>
<path d="M199.349 325.075L76.3682 345.236L77.8084 354.02L200.789 333.859L199.349 325.075Z" fill="#E0E0E0"/>
<path d="M128.285 359.276L79.9736 367.204L81.413 375.988L129.725 368.068L128.285 359.276Z" fill="url(#paint5_linear_50_0)"/>
<path opacity="0.5" d="M110.052 167.616C109.198 162.411 107.012 157.518 103.707 153.411C100.401 149.305 96.0884 146.123 91.1882 144.178C86.2881 142.233 80.9682 141.584 75.7447 142.311C70.5219 143.028 65.5743 145.086 61.384 148.285C57.1929 151.483 53.9013 155.711 51.83 160.561C49.7581 165.411 48.9777 170.711 49.5628 175.95C50.1485 181.189 52.0807 186.195 55.1714 190.466C58.2612 194.736 62.4053 198.134 67.1992 200.33L67.2406 200.46C68.3801 201.247 69.6629 201.791 71.0148 202.076V201.93C72.6223 202.915 78.8842 203.875 85.7103 202.742H85.858C90.1859 202.033 94.7506 200.494 98.5089 197.59C98.5089 197.59 98.509 197.503 98.5608 197.348C99.5264 196.682 100.38 195.869 101.085 194.935C101.085 194.815 101.085 194.693 101.085 194.581C104.656 191.157 107.338 186.904 108.9 182.209C110.462 177.506 110.857 172.501 110.051 167.616L110.052 167.616Z" fill="url(#paint6_linear_50_0)"/>
<path d="M84.7139 201.782C100.858 199.137 111.8 183.904 109.154 167.754C106.507 151.613 91.2738 140.668 75.1295 143.313C58.9841 145.959 48.0418 161.192 50.6887 177.342C53.3351 193.483 68.5685 204.428 84.7139 201.782Z" fill="#F5F5F5"/>
<path d="M79.1973 175.431C86.3533 174.256 91.2034 167.504 90.0303 160.345C88.8569 153.196 82.105 148.345 74.9493 149.512C67.7933 150.688 62.9434 157.44 64.1163 164.599C65.2897 171.757 72.0419 176.607 79.1973 175.431Z" fill="#333333"/>
<path d="M69.1374 186.065C69.1374 186.065 62.2854 187.777 66.186 200.157C67.2899 200.927 68.5355 201.463 69.8488 201.739L71.5934 187.837L69.1374 186.065Z" fill="#4D8AF0"/>
<path d="M91.7397 182.356C91.7397 182.356 98.7972 181.776 99.0351 194.779C98.2284 195.842 97.22 196.742 96.0666 197.416L89.9736 184.794L91.7397 182.356Z" fill="#4D8AF0"/>
<path d="M91.608 182.373L69.0061 186.064L68.3784 195.453C68.3784 195.453 67.8519 199.845 69.6701 201.427C71.4882 203.018 86.6006 204.842 96.2407 197.381C96.7691 194.822 96.4404 192.159 95.3082 189.799C93.4105 185.779 94.9555 189.549 94.9555 189.549L91.608 182.373Z" fill="#4D8AF0"/>
<path d="M91.909 182.33L69.3061 186.021L68.6794 195.402C68.6794 195.402 68.1521 199.794 69.971 201.384C71.7892 202.966 86.9014 204.799 96.542 197.338C97.0694 194.771 96.7416 192.108 95.6092 189.748C93.7117 185.727 95.2558 189.497 95.2558 189.497L91.909 182.33Z" fill="#4D8AF0"/>
<path d="M91.7391 182.356L69.1375 186.048L68.5105 195.445C68.5105 195.445 67.9833 199.837 69.8014 201.428C71.6204 203.01 86.7319 204.843 96.3731 197.373C96.9004 194.814 96.5725 192.151 95.4396 189.791C93.5426 185.771 95.0865 189.541 95.0865 189.541L91.7391 182.356Z" fill="#4D8AF0"/>
<path opacity="0.1" d="M74.8472 177.419L83.8878 175.932L85.2407 184.189C85.3936 185.122 85.1731 186.073 84.6217 186.834C84.0728 187.595 83.2428 188.114 82.3143 188.261L80.2698 188.598C79.3423 188.753 78.391 188.529 77.6268 187.984C76.8629 187.431 76.348 186.601 76.1951 185.676L74.8418 177.419H74.8472Z" fill="#334D6E"/>
<path d="M74.7944 177.083L83.8353 175.604L85.188 183.852C85.3409 184.786 85.1153 185.737 84.568 186.497C84.0199 187.267 83.1901 187.777 82.2616 187.933L80.2168 188.261C79.2883 188.417 78.3375 188.192 77.5738 187.647C76.8098 187.094 76.2945 186.264 76.1423 185.339L74.7891 177.083H74.7944Z" fill="#FDA57D"/>
<path opacity="0.1" d="M75.015 178.388C78.1073 179.001 81.3159 178.483 84.0597 176.935L83.8756 175.82L74.8359 177.307L75.015 178.388Z" fill="#334D6E"/>
<path d="M79.6626 178.241C86.8183 177.074 91.6681 170.322 90.4952 163.164C89.3221 156.005 82.5702 151.155 75.4142 152.331C68.2585 153.498 63.4079 160.25 64.5813 167.408C65.7544 174.567 72.5066 179.417 79.6626 178.241Z" fill="#FDA57D"/>
<path opacity="0.1" d="M64.3887 162.731L89.104 158.685C89.104 158.685 85.3563 149.045 76.1222 151.215C66.8872 153.394 64.3887 162.731 64.3887 162.731Z" fill="#334D6E"/>
<path d="M64.3311 162.403L89.0682 158.348C89.0682 158.348 85.3202 148.708 76.0852 150.878C66.8504 153.057 64.3311 162.403 64.3311 162.403Z" fill="#333333"/>
<path d="M65.2806 169.855C65.9492 169.742 66.327 168.636 66.1246 167.382C65.9224 166.129 65.2161 165.204 64.5467 165.316C63.8786 165.42 63.5006 166.527 63.703 167.78C63.9052 169.034 64.6115 169.959 65.2806 169.855Z" fill="#FDA57D"/>
<path d="M90.4387 164.927C91.1052 164.814 91.4797 163.708 91.2747 162.463C91.07 161.209 90.3636 160.284 89.6968 160.397C89.0303 160.509 88.6558 161.607 88.8608 162.861C89.0655 164.106 89.7721 165.031 90.4387 164.927Z" fill="#FDA57D"/>
<path opacity="0.5" d="M366.618 130.726H157.801V419.24H366.618V130.726Z" fill="url(#paint7_linear_50_0)"/>
<path d="M363.963 132.852H160.457V414.987H363.963V132.852Z" fill="white"/>
<path opacity="0.5" d="M187.635 197.407C187.636 192.013 189.032 186.713 191.688 182.019C194.344 177.333 198.168 173.408 202.79 170.633C207.413 167.858 212.674 166.327 218.063 166.189C223.452 166.051 228.785 167.313 233.543 169.846C238.3 172.388 242.32 176.105 245.212 180.653C248.104 185.209 249.768 190.422 250.044 195.808C250.319 201.194 249.198 206.554 246.786 211.378C244.374 216.203 240.755 220.309 236.281 223.318V223.456C235.261 224.433 234.057 225.202 232.739 225.712L232.697 225.574C231.237 226.828 225.081 228.842 218.007 228.816H217.854C213.374 228.816 208.514 228.029 204.234 225.713C204.234 225.713 204.198 225.626 204.141 225.479C203.056 224.969 202.062 224.286 201.194 223.456L201.147 223.102C196.98 220.24 193.574 216.402 191.22 211.923C188.867 207.445 187.637 202.465 187.638 197.408L187.635 197.407Z" fill="url(#paint8_linear_50_0)"/>
<path d="M218.856 227.692C235.583 227.692 249.142 214.128 249.142 197.399C249.142 180.679 235.583 167.114 218.856 167.114C202.129 167.114 188.568 180.679 188.568 197.399C188.568 214.128 202.129 227.692 218.856 227.692Z" fill="#F5F5F5"/>
<path d="M206.975 208.94C206.975 208.94 199.759 209.528 201.667 222.704C202.657 223.655 203.825 224.398 205.104 224.891L209.162 211.154L206.975 208.94Z" fill="#BE7C5E"/>
<path d="M230.393 208.94C230.393 208.94 237.609 209.528 235.701 222.704C234.712 223.655 233.543 224.398 232.264 224.891L228.222 211.11L230.393 208.94Z" fill="#BE7C5E"/>
<path d="M207.286 187.388C207.286 187.388 206.732 189.005 205.941 190.881C204.223 194.97 206.182 210.687 210.295 212.364C214.908 214.241 220.974 215.442 227.273 213.151C232.75 211.154 234.436 193.258 230.568 188.901C230.114 188.373 229.64 187.881 229.145 187.388H207.286Z" fill="#333333"/>
<path d="M218.876 199.88C226.291 199.88 232.302 193.871 232.302 186.454C232.302 179.045 226.291 173.027 218.876 173.027C211.462 173.027 205.451 179.045 205.451 186.454C205.451 193.871 211.462 199.88 218.876 199.88Z" fill="#333333"/>
<path opacity="0.1" d="M230.257 208.94H206.838L204.651 218.312C204.651 218.312 203.364 222.643 204.961 224.554C206.559 226.465 221.476 230.796 232.439 224.865C233.394 222.367 233.503 219.626 232.75 217.059C231.5 212.693 232.439 216.747 232.439 216.747L230.257 208.94Z" fill="#334D6E"/>
<path opacity="0.1" d="M230.566 208.94H207.137L204.949 218.312C204.949 218.312 203.664 222.643 205.26 224.554C206.857 226.465 221.773 230.796 232.738 224.865C233.693 222.367 233.802 219.626 233.048 217.059C231.799 212.693 232.738 216.747 232.738 216.747L230.566 208.94Z" fill="#334D6E"/>
<path d="M230.393 208.94H206.973L204.786 218.312C204.786 218.312 203.501 222.643 205.097 224.554C206.694 226.465 221.61 230.796 232.575 224.865C233.53 222.367 233.639 219.626 232.885 217.059C231.636 212.693 232.575 216.747 232.575 216.747L230.393 208.94Z" fill="url(#paint9_linear_50_0)"/>
<path opacity="0.1" d="M214.158 201.169H223.526V209.797C223.526 210.739 223.151 211.647 222.487 212.313C221.821 212.978 220.919 213.35 219.977 213.35H217.701C216.76 213.35 215.858 212.978 215.192 212.313C214.528 211.647 214.153 210.739 214.153 209.797V201.169H214.158Z" fill="#334D6E"/>
<path d="M214.158 200.823H223.526V209.451C223.526 210.393 223.151 211.292 222.487 211.958C221.821 212.624 220.919 213.004 219.977 213.004H217.701C216.76 213.004 215.858 212.624 215.192 211.958C214.528 211.292 214.153 210.393 214.153 209.451V200.823H214.158Z" fill="#BE7C5E"/>
<path opacity="0.1" d="M214.175 202.145C217.196 203.269 220.52 203.269 223.542 202.145V200.995H214.175V202.145Z" fill="#334D6E"/>
<path d="M218.876 202.794C226.291 202.794 232.302 196.785 232.302 189.368C232.302 181.959 226.291 175.941 218.876 175.941C211.462 175.941 205.451 181.959 205.451 189.368C205.451 196.785 211.462 202.794 218.876 202.794Z" fill="#BE7C5E"/>
<path d="M206.036 184.275H231.642C231.642 184.275 229.455 173.936 219.777 174.593C210.099 175.258 206.036 184.275 206.036 184.275Z" fill="#333333"/>
<path d="M205.73 191.14C206.42 191.14 206.979 190.094 206.979 188.797C206.979 187.509 206.42 186.463 205.73 186.463C205.04 186.463 204.48 187.509 204.48 188.797C204.48 190.094 205.04 191.14 205.73 191.14Z" fill="#BE7C5E"/>
<path d="M231.958 191.14C232.648 191.14 233.208 190.094 233.208 188.797C233.208 187.509 232.648 186.463 231.958 186.463C231.268 186.463 230.709 187.509 230.709 188.797C230.709 190.094 231.268 191.14 231.958 191.14Z" fill="#BE7C5E"/>
<path opacity="0.1" d="M206.036 184.612H231.642C231.642 184.612 229.455 174.273 219.777 174.938C210.099 175.604 206.036 184.612 206.036 184.612Z" fill="#334D6E"/>
<path d="M334.466 255.194H187.593V264.09H334.466V255.194Z" fill="#E0E0E0"/>
<path d="M334.466 277.447H187.593V286.343H334.466V277.447Z" fill="#E0E0E0"/>
<path d="M334.474 183.981H258.81V192.878H334.474V183.981Z" fill="#E0E0E0"/>
<path d="M327.799 206.234H265.481V215.139H327.799V206.234Z" fill="url(#paint10_linear_50_0)"/>
<path d="M316.673 299.7H187.593V308.596H316.673V299.7Z" fill="#E0E0E0"/>
<path d="M298.863 321.953H187.593V330.858H298.863V321.953Z" fill="#E0E0E0"/>
<path d="M285.513 344.215H187.593V353.112H285.513V344.215Z" fill="#E0E0E0"/>
<path d="M312.212 366.468H187.593V375.365H312.212V366.468Z" fill="#E0E0E0"/>
<path d="M236.55 388.722H187.593V397.618H236.55V388.722Z" fill="url(#paint11_linear_50_0)"/>
<path opacity="0.5" d="M352.534 437.75C377.096 437.75 397.015 417.831 397.015 393.269C397.015 368.699 377.096 348.789 352.534 348.789C327.964 348.789 308.054 368.699 308.054 393.269C308.054 417.831 327.964 437.75 352.534 437.75Z" fill="url(#paint12_linear_50_0)"/>
<path d="M352.534 435.131C375.652 435.131 394.395 416.388 394.395 393.27C394.395 370.152 375.652 351.409 352.534 351.409C329.416 351.409 310.673 370.152 310.673 393.27C310.673 416.388 329.416 435.131 352.534 435.131Z" fill="url(#paint13_linear_50_0)"/>
<path d="M334.362 387.684L350.062 402.07L372.298 369.373L380.157 375.909L350.062 415.151L327.826 390.304L334.362 387.684Z" fill="white"/>
<circle cx="328.649" cy="12.6494" r="10.6494" stroke="url(#paint14_linear_50_0)" stroke-width="4" stroke-linecap="round" stroke-linejoin="round"/>
<circle cx="12.6494" cy="376.649" r="10.6494" stroke="url(#paint15_linear_50_0)" stroke-width="4" stroke-linecap="round" stroke-linejoin="round"/>
<path d="M9.88509 82.1058L22.0705 61L34.2559 82.1058H9.88509Z" stroke="url(#paint16_linear_50_0)" stroke-width="4" stroke-linecap="round" stroke-linejoin="round"/>
<path d="M432.646 316.68L428.414 292.68L451.315 301.015L432.646 316.68Z" stroke="url(#paint17_linear_50_0)" stroke-width="4" stroke-linecap="round" stroke-linejoin="round"/>
<path d="M221 494.562C224.915 493.357 232.384 493.297 230.939 502.694C239.974 500.887 239.974 506.308 239.974 510.826" stroke="url(#paint18_linear_50_0)" stroke-width="4" stroke-linecap="round" stroke-linejoin="round"/>
<defs>
<linearGradient id="paint0_linear_50_0" x1="357.159" y1="143.309" x2="420.098" y2="143.309" gradientUnits="userSpaceOnUse">
<stop stop-color="#FD7961"/>
<stop offset="1" stop-color="#FD2B61" stop-opacity="0.980392"/>
</linearGradient>
<linearGradient id="paint1_linear_50_0" x1="34824.3" y1="43745.2" x2="35832.6" y2="37062.9" gradientUnits="userSpaceOnUse">
<stop stop-color="#808080" stop-opacity="0.25"/>
<stop offset="0.54" stop-color="#808080" stop-opacity="0.12"/>
<stop offset="1" stop-color="#808080" stop-opacity="0.1"/>
</linearGradient>
<linearGradient id="paint2_linear_50_0" x1="293.977" y1="137.325" x2="321.743" y2="137.325" gradientUnits="userSpaceOnUse">
<stop stop-color="#FD7961"/>
<stop offset="1" stop-color="#FD2B61" stop-opacity="0.980392"/>
</linearGradient>
<linearGradient id="paint3_linear_50_0" x1="115990" y1="94234.4" x2="90721.8" y2="-62112.5" gradientUnits="userSpaceOnUse">
<stop stop-color="#808080" stop-opacity="0.25"/>
<stop offset="0.54" stop-color="#808080" stop-opacity="0.12"/>
<stop offset="1" stop-color="#808080" stop-opacity="0.1"/>
</linearGradient>
<linearGradient id="paint4_linear_50_0" x1="127.312" y1="173.875" x2="190.244" y2="173.875" gradientUnits="userSpaceOnUse">
<stop stop-color="#1CA8FF"/>
<stop offset="1" stop-color="#1C46FF"/>
</linearGradient>
<linearGradient id="paint5_linear_50_0" x1="79.9736" y1="367.632" x2="129.725" y2="367.632" gradientUnits="userSpaceOnUse">
<stop stop-color="#1CA8FF"/>
<stop offset="1" stop-color="#1C46FF"/>
</linearGradient>
<linearGradient id="paint6_linear_50_0" x1="23936.6" y1="-2313.17" x2="22785.2" y2="-9336.92" gradientUnits="userSpaceOnUse">
<stop stop-color="#808080" stop-opacity="0.25"/>
<stop offset="0.54" stop-color="#808080" stop-opacity="0.12"/>
<stop offset="1" stop-color="#808080" stop-opacity="0.1"/>
</linearGradient>
<linearGradient id="paint7_linear_50_0" x1="100538" y1="205798" x2="100538" y2="47871.8" gradientUnits="userSpaceOnUse">
<stop stop-color="#808080" stop-opacity="0.25"/>
<stop offset="0.54" stop-color="#808080" stop-opacity="0.12"/>
<stop offset="1" stop-color="#808080" stop-opacity="0.1"/>
</linearGradient>
<linearGradient id="paint8_linear_50_0" x1="31734.6" y1="26949.9" x2="31734.6" y2="19505.5" gradientUnits="userSpaceOnUse">
<stop stop-color="#808080" stop-opacity="0.25"/>
<stop offset="0.54" stop-color="#808080" stop-opacity="0.12"/>
<stop offset="1" stop-color="#808080" stop-opacity="0.1"/>
</linearGradient>
<linearGradient id="paint9_linear_50_0" x1="204.297" y1="218.409" x2="233.38" y2="218.409" gradientUnits="userSpaceOnUse">
<stop stop-color="#438FAE"/>
<stop offset="1" stop-color="#43DCAE"/>
</linearGradient>
<linearGradient id="paint10_linear_50_0" x1="265.481" y1="210.687" x2="327.799" y2="210.687" gradientUnits="userSpaceOnUse">
<stop stop-color="#438FAE"/>
<stop offset="1" stop-color="#43DCAE"/>
</linearGradient>
<linearGradient id="paint11_linear_50_0" x1="187.593" y1="393.17" x2="236.55" y2="393.17" gradientUnits="userSpaceOnUse">
<stop stop-color="#438FAE"/>
<stop offset="1" stop-color="#43DCAE"/>
</linearGradient>
<linearGradient id="paint12_linear_50_0" x1="58318.7" y1="66888.3" x2="58318.7" y2="51874" gradientUnits="userSpaceOnUse">
<stop stop-color="#808080" stop-opacity="0.25"/>
<stop offset="0.54" stop-color="#808080" stop-opacity="0.12"/>
<stop offset="1" stop-color="#808080" stop-opacity="0.1"/>
</linearGradient>
<linearGradient id="paint13_linear_50_0" x1="310.673" y1="393.27" x2="394.395" y2="393.27" gradientUnits="userSpaceOnUse">
<stop stop-color="#D4AA00"/>
<stop offset="1" stop-color="#FFDD55"/>
</linearGradient>
<linearGradient id="paint14_linear_50_0" x1="319.593" y1="3.82154" x2="337.122" y2="21.6746" gradientUnits="userSpaceOnUse">
<stop stop-color="#517AFF"/>
<stop offset="1" stop-color="#51E6FF"/>
</linearGradient>
<linearGradient id="paint15_linear_50_0" x1="3.2962" y1="367.597" x2="21.9013" y2="386.888" gradientUnits="userSpaceOnUse">
<stop stop-color="#FD7961"/>
<stop offset="1" stop-color="#FD2B61" stop-opacity="0.980392"/>
</linearGradient>
<linearGradient id="paint16_linear_50_0" x1="3.99138" y1="75.0704" x2="40.1296" y2="75.0704" gradientUnits="userSpaceOnUse">
<stop stop-color="#D4AA00"/>
<stop offset="1" stop-color="#FFDD55"/>
</linearGradient>
<linearGradient id="paint17_linear_50_0" x1="419.031" y1="302.372" x2="455.808" y2="308.316" gradientUnits="userSpaceOnUse">
<stop stop-color="#FE496C"/>
<stop offset="1" stop-color="#FE9B6C" stop-opacity="0.980392"/>
</linearGradient>
<linearGradient id="paint18_linear_50_0" x1="230.604" y1="510.944" x2="230.271" y2="494.038" gradientUnits="userSpaceOnUse">
<stop stop-color="#1CA8FF"/>
<stop offset="1" stop-color="#1C46FF"/>
</linearGradient>
</defs>
</svg>
