<svg width="543" height="387" viewBox="0 0 543 387" fill="none" xmlns="http://www.w3.org/2000/svg">
<path d="M23.973 77.083C28.7619 77.083 32.6441 73.2007 32.6441 68.4118C32.6441 63.6229 28.7619 59.7406 23.973 59.7406C19.184 59.7406 15.3018 63.6229 15.3018 68.4118C15.3018 73.2007 19.184 77.083 23.973 77.083Z" fill="#E6E6E6"/>
<path d="M49.9866 77.083C54.7756 77.083 58.6575 73.2007 58.6575 68.4118C58.6575 63.6229 54.7756 59.7406 49.9866 59.7406C45.1977 59.7406 41.3154 63.6229 41.3154 68.4118C41.3154 73.2007 45.1977 77.083 49.9866 77.083Z" fill="#E6E6E6"/>
<path d="M76 77.083C80.7889 77.083 84.6712 73.2007 84.6712 68.4118C84.6712 63.6229 80.7889 59.7406 76 59.7406C71.2111 59.7406 67.3291 63.6229 67.3291 68.4118C67.3291 73.2007 71.2111 77.083 76 77.083Z" fill="#E6E6E6"/>
<path d="M102.013 77.083C106.802 77.083 110.684 73.2007 110.684 68.4118C110.684 63.6229 106.802 59.7406 102.013 59.7406C97.2241 59.7406 93.3418 63.6229 93.3418 68.4118C93.3418 73.2007 97.2241 77.083 102.013 77.083Z" fill="#E6E6E6"/>
<path d="M128.027 77.083C132.816 77.083 136.698 73.2007 136.698 68.4118C136.698 63.6229 132.816 59.7406 128.027 59.7406C123.238 59.7406 119.355 63.6229 119.355 68.4118C119.355 73.2007 123.238 77.083 128.027 77.083Z" fill="#E6E6E6"/>
<path d="M154.04 77.083C158.829 77.083 162.712 73.2007 162.712 68.4118C162.712 63.6229 158.829 59.7406 154.04 59.7406C149.251 59.7406 145.369 63.6229 145.369 68.4118C145.369 73.2007 149.251 77.083 154.04 77.083Z" fill="#E6E6E6"/>
<path d="M180.054 77.083C184.843 77.083 188.725 73.2007 188.725 68.4118C188.725 63.6229 184.843 59.7406 180.054 59.7406C175.265 59.7406 171.383 63.6229 171.383 68.4118C171.383 73.2007 175.265 77.083 180.054 77.083Z" fill="#E6E6E6"/>
<path d="M200.091 78.97H3.93599C3.00042 78.969 2.10367 78.597 1.44211 77.9354C0.78055 77.2739 0.408323 76.377 0.407227 75.4414V61.3799C0.408328 60.4444 0.780551 59.5474 1.44211 58.8859C2.10367 58.2244 3.00043 57.8524 3.93599 57.8513H200.091C201.026 57.8524 201.923 58.2245 202.585 58.8861C203.246 59.5476 203.619 60.4444 203.62 61.3799V75.4414C203.619 76.3769 203.246 77.2738 202.585 77.9353C201.923 78.5968 201.026 78.9689 200.091 78.97ZM3.93599 59.2628C3.37464 59.2634 2.83666 59.4866 2.43972 59.8835C2.04278 60.2804 1.81928 60.8186 1.81867 61.3799V75.4414C1.81929 76.0028 2.04279 76.5409 2.43972 76.9378C2.83666 77.3348 3.37465 77.558 3.93599 77.5586H200.091C200.652 77.558 201.191 77.3348 201.587 76.9378C201.984 76.5409 202.208 76.0028 202.208 75.4414V61.3799C202.208 60.8186 201.984 60.2804 201.587 59.8835C201.191 59.4866 200.652 59.2634 200.091 59.2628H3.93599Z" fill="#E6E6E6"/>
<path d="M45.9143 0C46.4518 0.000631778 46.9671 0.214551 47.3472 0.594633C47.7273 0.974715 47.9409 1.49 47.9415 2.0275V45.962C47.9409 46.4995 47.7273 47.0148 47.3472 47.3948C46.9671 47.7749 46.4518 47.9887 45.9143 47.9893H2.87711C2.33957 47.9887 1.82436 47.7749 1.44424 47.3948C1.06412 47.0147 0.850229 46.4995 0.849609 45.962V2.0275C0.850229 1.48996 1.06412 0.97457 1.44424 0.594486C1.82436 0.214403 2.33957 0.00071489 2.87711 0.00014675H45.9143" fill="url(#paint0_linear_1_4107)"/>
<path d="M192.905 0C193.443 0.000631778 193.958 0.214551 194.338 0.594633C194.718 0.974715 194.932 1.49 194.932 2.0275V45.962C194.932 46.4995 194.718 47.0148 194.338 47.3948C193.958 47.7749 193.443 47.9887 192.905 47.9893H149.868C149.331 47.9887 148.815 47.7749 148.435 47.3948C148.055 47.0148 147.841 46.4995 147.841 45.962V2.0275C147.841 1.49 148.055 0.97471 148.435 0.594633C148.815 0.214556 149.331 0.000778516 149.868 0.00014675H192.905" fill="url(#paint1_linear_1_4107)"/>
<path d="M339.182 82.4476H296.145C295.612 82.4476 295.085 82.5525 294.593 82.7562C294.101 82.96 293.654 83.2588 293.277 83.6353C292.901 84.0118 292.602 84.4588 292.398 84.9508C292.195 85.4427 292.09 85.97 292.09 86.5025V130.437C292.09 130.969 292.195 131.497 292.398 131.989C292.602 132.481 292.901 132.928 293.277 133.304C293.654 133.681 294.101 133.979 294.593 134.183C295.085 134.387 295.612 134.492 296.145 134.492H339.182C339.714 134.492 340.242 134.387 340.734 134.183C341.225 133.979 341.672 133.681 342.049 133.304C342.426 132.928 342.724 132.481 342.928 131.989C343.132 131.497 343.237 130.969 343.237 130.437V86.5025C343.237 85.97 343.132 85.4427 342.928 84.9508C342.724 84.4588 342.426 84.0117 342.049 83.6351C341.672 83.2586 341.225 82.96 340.734 82.7562C340.242 82.5525 339.714 82.4476 339.182 82.4476Z" fill="url(#paint2_linear_1_4107)"/>
<path d="M339.182 84.4755C339.719 84.4761 340.234 84.6899 340.614 85.07C340.995 85.45 341.208 85.9655 341.209 86.503V130.437C341.208 130.975 340.995 131.49 340.614 131.87C340.234 132.25 339.719 132.464 339.182 132.465H296.144C295.607 132.464 295.092 132.25 294.712 131.87C294.331 131.49 294.118 130.975 294.117 130.437V86.503C294.118 85.9655 294.331 85.4502 294.712 85.0701C295.092 84.69 295.607 84.4761 296.144 84.4755H339.182Z" fill="url(#paint3_linear_1_4107)"/>
<path d="M75.8085 11.4326C75.1516 11.4334 74.5219 11.6947 74.0575 12.1593C73.593 12.6238 73.3317 13.2535 73.3311 13.9104V45.5123C73.3318 46.1691 73.593 46.7989 74.0575 47.2633C74.5219 47.7278 75.1517 47.9889 75.8085 47.9896H119.972C120.629 47.9888 121.259 47.7276 121.724 47.2632C122.188 46.7987 122.449 46.1691 122.45 45.5123V13.9104C122.449 13.2535 122.188 12.6238 121.724 12.1593C121.259 11.6947 120.629 11.4334 119.972 11.4326H75.8085Z" fill="black"/>
<path d="M119.972 50.0167H75.8084C74.614 50.0153 73.4693 49.5402 72.6248 48.6956C71.7802 47.8511 71.3051 46.7062 71.3037 45.5119V13.91C71.305 12.7157 71.7799 11.5706 72.6245 10.726C73.469 9.88139 74.614 9.4061 75.8084 9.40466H119.972C121.167 9.406 122.312 9.88123 123.157 10.7259C124.001 11.5705 124.477 12.7156 124.478 13.91V45.5119C124.476 46.7063 124.001 47.8513 123.157 48.6958C122.312 49.5403 121.167 50.0154 119.972 50.0167Z" fill="url(#paint4_linear_1_4107)"/>
<path d="M234.847 18.17C234.215 17.9878 233.538 18.0633 232.962 18.3801C232.387 18.6969 231.96 19.2291 231.777 19.8598L222.975 50.211C222.793 50.8421 222.869 51.5196 223.185 52.095C223.502 52.6705 224.034 53.0967 224.665 53.2803L267.081 65.5811C267.712 65.7634 268.39 65.6879 268.965 65.3712C269.541 65.0546 269.967 64.5227 270.151 63.892L278.953 33.5406C279.135 32.9095 279.059 32.2319 278.743 31.6563C278.426 31.0808 277.894 30.6545 277.263 30.4707L234.847 18.17Z" fill="black"/>
<path d="M266.516 67.5273L224.099 55.2265C222.953 54.8925 221.986 54.1173 221.41 53.071C220.834 52.0247 220.696 50.7927 221.028 49.6453L229.83 19.294C230.164 18.1473 230.938 17.1798 231.985 16.6038C233.031 16.0278 234.263 15.8904 235.411 16.2217L277.827 28.5225C278.974 28.8564 279.942 29.6316 280.518 30.6781C281.093 31.7245 281.231 32.9568 280.899 34.1044L272.097 64.4556C271.763 65.6024 270.988 66.5697 269.942 67.1456C268.895 67.7214 267.663 67.8587 266.516 67.5273Z" fill="url(#paint5_linear_1_4107)"/>
<path d="M543 384.612H98.1299V386.52H543V384.612Z" fill="#E6E6E6"/>
<path d="M356.43 381.627H284.087L286.539 349.748H353.977L356.43 381.627Z" fill="#E6E6E6"/>
<path d="M361.333 377.949H280.408V385.306H361.333V377.949Z" fill="#E6E6E6"/>
<path d="M458.813 144.369H182.318C181.351 144.369 180.395 144.56 179.502 144.929C178.61 145.299 177.799 145.841 177.116 146.524C176.432 147.207 175.891 148.018 175.521 148.911C175.151 149.803 174.961 150.76 174.961 151.726V320.321H466.17V151.726C466.17 150.76 465.979 149.803 465.61 148.911C465.24 148.018 464.698 147.207 464.015 146.524C463.332 145.841 462.521 145.299 461.628 144.929C460.735 144.56 459.779 144.369 458.813 144.369Z" fill="#3F3D56"/>
<path d="M174.961 320.32V347.909C174.961 348.875 175.151 349.831 175.521 350.724C175.891 351.616 176.432 352.428 177.116 353.111C177.799 353.794 178.61 354.336 179.502 354.705C180.395 355.075 181.351 355.265 182.318 355.265H458.813C460.764 355.265 462.635 354.49 464.015 353.111C465.394 351.731 466.17 349.86 466.17 347.909V320.32H174.961Z" fill="#E6E6E6"/>
<path d="M452.068 159.695H189.674V306.832H452.068V159.695Z" fill="#E6E6E6"/>
<path d="M320.872 344.843C324.935 344.843 328.228 341.549 328.228 337.486C328.228 333.423 324.935 330.129 320.872 330.129C316.808 330.129 313.515 333.423 313.515 337.486C313.515 341.549 316.808 344.843 320.872 344.843Z" fill="#3F3D56"/>
<path d="M197.856 165.911C198.627 165.911 199.252 165.285 199.252 164.514C199.252 163.743 198.627 163.118 197.856 163.118C197.085 163.118 196.46 163.743 196.46 164.514C196.46 165.285 197.085 165.911 197.856 165.911Z" fill="white"/>
<path d="M203.155 165.911C203.926 165.911 204.551 165.285 204.551 164.514C204.551 163.743 203.926 163.118 203.155 163.118C202.384 163.118 201.759 163.743 201.759 164.514C201.759 165.285 202.384 165.911 203.155 165.911Z" fill="white"/>
<path d="M208.455 165.911C209.226 165.911 209.851 165.285 209.851 164.514C209.851 163.743 209.226 163.118 208.455 163.118C207.684 163.118 207.059 163.743 207.059 164.514C207.059 165.285 207.684 165.911 208.455 165.911Z" fill="white"/>
<path d="M444.506 169.258H196.46V292.829H444.506V169.258Z" fill="white"/>
<path d="M162.04 7.68481C160.255 7.68481 158.811 9.14488 158.811 10.9295L158.787 36.8874C158.787 38.672 160.231 40.1321 162.016 40.1321H181.501C183.285 40.1321 184.745 38.672 184.745 36.8874V17.4191L175.011 7.68481H162.04ZM173.396 19.0414V10.1184L182.319 19.0414H173.396Z" fill="white"/>
<path d="M316.062 127.776C315.951 127.717 315.834 127.607 315.797 127.533C315.761 127.459 315.716 126.497 315.694 125.396L315.656 123.394L314.821 123.225C313.143 122.885 311.353 122.177 310.041 121.332C309.186 120.782 308.026 119.857 307.77 119.52C307.413 119.052 307.451 118.966 308.823 117.174C310.357 115.17 310.368 115.164 311.254 115.897C314.082 118.236 317.515 119.136 319.949 118.176C320.506 117.957 321.33 117.397 321.599 117.056C322.053 116.478 322.298 115.756 322.293 115.007C322.293 114.226 321.763 113.317 320.989 112.747C320.317 112.253 318.939 111.582 316.859 110.738C312.265 108.874 310.683 107.859 309.222 105.837C308.157 104.365 307.783 101.783 308.338 99.7399C308.896 97.6901 310.625 95.6994 312.774 94.6334C313.588 94.2295 314.309 93.9655 315.106 93.7792L315.694 93.6417V91.6802C315.694 89.5064 315.73 89.29 316.128 89.1255C316.289 89.0589 316.822 89.0389 317.994 89.0555C319.586 89.0771 319.641 89.0839 319.808 89.2515C319.979 89.4217 319.981 89.4556 320.003 91.5088L320.027 93.5936H320.219C320.978 93.5936 323.111 94.2259 324.306 94.8047C325.121 95.1993 326.576 96.1853 326.841 96.523C327.166 96.9364 327.157 96.9681 326.127 98.8309C325.169 100.564 324.936 100.878 324.61 100.878C324.519 100.878 324.001 100.582 323.463 100.221C321.997 99.2359 320.815 98.7279 319.422 98.4851C317.177 98.0935 314.855 98.8274 313.981 100.205C313.52 100.933 313.448 102.064 313.811 102.86C313.945 103.157 314.158 103.417 314.546 103.766C315.526 104.646 316.324 105.055 319.448 106.277C321.264 106.987 323.314 107.938 324.051 108.412C325.395 109.278 326.469 110.373 326.963 111.381C327.476 112.429 327.684 113.249 327.736 114.427C327.846 116.932 327.044 118.986 325.263 120.768C324.045 121.986 322.664 122.764 321.01 123.163C320.569 123.27 320.165 123.369 320.113 123.383C320.038 123.403 320.019 123.878 320.019 125.429V127.448L319.798 127.669L319.577 127.891L317.921 127.889C316.633 127.886 316.22 127.862 316.065 127.777L316.062 127.776Z" fill="white"/>
<path d="M246.837 32.0518C244.809 32.0518 243.172 33.6901 243.172 35.7183C243.172 36.8035 243.649 37.7668 244.396 38.4373L241.573 43.2848C241.388 43.2451 241.206 43.2129 241.014 43.2129C240.822 43.2129 240.64 43.2446 240.456 43.2848L237.176 37.6579C237.575 37.227 237.822 36.6607 237.822 36.0302C237.822 34.7051 236.753 33.6353 235.428 33.6353C234.103 33.6353 233.033 34.7051 233.033 36.0302C233.033 37.3551 234.103 38.4235 235.428 38.4235C235.62 38.4235 235.803 38.3918 235.986 38.3516L239.267 43.9798C238.868 44.4109 238.621 44.977 238.621 45.6075C238.621 46.9326 239.69 48.0024 241.014 48.0024C242.34 48.0024 243.409 46.9326 243.409 45.6075C243.409 44.977 243.162 44.4109 242.764 43.9798L245.581 39.1586C245.973 39.3016 246.395 39.3834 246.837 39.3834C247.131 39.3834 247.411 39.334 247.692 39.2732L252.715 47.8879C252.104 48.5477 251.725 49.4155 251.725 50.3807C251.725 52.409 253.362 54.046 255.39 54.046C257.418 54.046 259.057 52.409 259.057 50.3807C259.057 49.4155 258.677 48.5477 258.066 47.8879L263.15 39.1878C263.408 39.2486 263.675 39.2858 263.944 39.2858C265.911 39.2858 267.511 37.6857 267.511 35.7185C267.511 33.7514 265.911 32.1498 263.944 32.1498C261.977 32.1498 260.375 33.7514 260.375 35.7185C260.375 36.6471 260.742 37.4779 261.316 38.1133L256.247 46.8247C255.967 46.7639 255.683 46.7143 255.39 46.7143C255.096 46.7143 254.816 46.7636 254.534 46.8247L249.513 38.2112C250.124 37.5514 250.504 36.6838 250.504 35.7185C250.504 33.6902 248.866 32.0519 246.837 32.0519V32.0518Z" fill="white"/>
<path d="M23.58 18.8991H30.7599C31.7471 18.8991 32.5552 18.0914 32.5552 17.1041C32.5552 16.1168 31.7471 15.309 30.7599 15.309H23.58C22.5927 15.309 21.7849 16.1168 21.7849 17.1041C21.7849 18.0914 22.5927 18.8991 23.58 18.8991ZM23.58 26.0792H30.7599C31.7471 26.0792 32.5552 25.2714 32.5552 24.2841C32.5552 23.2969 31.7471 22.4892 30.7599 22.4892H23.58C22.5927 22.4892 21.7849 23.2969 21.7849 24.2841C21.7849 25.2714 22.5927 26.0792 23.58 26.0792ZM23.58 33.2593H30.7599C31.7471 33.2593 32.5552 32.4515 32.5552 31.4642C32.5552 30.477 31.7471 29.6693 30.7599 29.6693H23.58C22.5927 29.6693 21.7849 30.477 21.7849 31.4642C21.7849 32.4515 22.5927 33.2593 23.58 33.2593ZM14.605 15.309H18.1951V18.8991H14.605V15.309ZM14.605 22.4892H18.1951V26.0792H14.605V22.4892ZM14.605 29.6693H18.1951V33.2593H14.605V29.6693ZM37.9404 8.12897H9.21986C8.23263 8.12897 7.4248 8.93662 7.4248 9.92387V38.6444C7.4248 39.6317 8.23263 40.4393 9.21986 40.4393H37.9404C38.9276 40.4393 39.7352 39.6317 39.7352 38.6444V9.92387C39.7352 8.93662 38.9276 8.12897 37.9404 8.12897ZM36.1453 36.8494H11.0152V11.7189H36.1453V36.8494Z" fill="white"/>
<path d="M107.642 31.437C107.731 30.5978 107.755 29.758 107.695 28.9475L110.792 26.487C111.08 26.2552 111.138 25.8786 110.965 25.5602L107.984 20.3786C107.811 20.0605 107.434 19.9443 107.087 20.0605L103.381 21.5079C102.715 21.0155 101.992 20.6106 101.21 20.2919L100.631 16.3552C100.581 15.9789 100.286 15.7183 99.9084 15.7183H93.9163C93.5708 15.7183 93.2498 15.9789 93.1928 16.3267L92.6143 20.2636C91.862 20.5817 91.1383 21.0162 90.4721 21.4792L86.7669 20.032C86.4219 19.8877 86.0425 20.0319 85.8694 20.35L82.888 25.5316C82.7149 25.8498 82.775 26.2264 83.0612 26.4583L86.1582 28.9478C86.0692 29.787 86.0452 30.6267 86.1077 31.4373L83.0101 33.8979C82.7225 34.1296 82.6648 34.5062 82.8369 34.8246L85.818 40.0063C85.9911 40.3245 86.3686 40.4407 86.7155 40.3245L90.3913 38.8771C91.0569 39.3695 91.7811 39.7743 92.563 40.0929L93.1414 44.0298C93.1943 44.3767 93.4871 44.6381 93.8658 44.6381H99.8579C100.203 44.6381 100.525 44.3775 100.581 44.0298L101.16 40.0929C101.913 39.7743 102.636 39.3401 103.302 38.8771L107.008 40.3245C107.353 40.4688 107.731 40.3245 107.905 40.0063L110.887 34.8246C111.06 34.5059 110.999 34.1298 110.713 33.8979L107.642 31.437ZM96.903 34.5345C94.5 34.5345 92.5609 32.5948 92.5609 30.1923C92.5609 27.7896 94.5 25.8501 96.903 25.8501C99.3056 25.8501 101.245 27.7896 101.245 30.1923C101.245 32.5948 99.3056 34.5345 96.903 34.5345Z" fill="white"/>
<defs>
<linearGradient id="paint0_linear_1_4107" x1="0.8497" y1="23.9947" x2="47.9415" y2="23.9947" gradientUnits="userSpaceOnUse">
<stop stop-color="#FE496C"/>
<stop offset="1" stop-color="#FE9B6C" stop-opacity="0.980392"/>
</linearGradient>
<linearGradient id="paint1_linear_1_4107" x1="147.841" y1="23.9947" x2="194.933" y2="23.9947" gradientUnits="userSpaceOnUse">
<stop stop-color="#438FAE"/>
<stop offset="1" stop-color="#43DCAE"/>
</linearGradient>
<linearGradient id="paint2_linear_1_4107" x1="292.09" y1="108.47" x2="343.237" y2="108.47" gradientUnits="userSpaceOnUse">
<stop stop-color="#9F39FF"/>
<stop offset="1" stop-color="#9F95FF" stop-opacity="0.988235"/>
</linearGradient>
<linearGradient id="paint3_linear_1_4107" x1="294.117" y1="108.47" x2="341.209" y2="108.47" gradientUnits="userSpaceOnUse">
<stop stop-color="#9F39FF"/>
<stop offset="1" stop-color="#9F95FF" stop-opacity="0.988235"/>
</linearGradient>
<linearGradient id="paint4_linear_1_4107" x1="71.3036" y1="29.7107" x2="124.478" y2="29.7107" gradientUnits="userSpaceOnUse">
<stop stop-color="#1CA8FF"/>
<stop offset="1" stop-color="#1C46FF"/>
</linearGradient>
<linearGradient id="paint5_linear_1_4107" x1="220.851" y1="41.8745" x2="281.077" y2="41.8745" gradientUnits="userSpaceOnUse">
<stop stop-color="#FF5E52"/>
<stop offset="1" stop-color="#FFC552"/>
</linearGradient>
</defs>
</svg>
