<svg width="30" height="40" viewBox="0 0 30 40" fill="none" xmlns="http://www.w3.org/2000/svg">
<path d="M14.7437 0C13.7753 0 12.7858 0.0842107 11.7963 0.294737C5.98578 1.41053 1.3542 6.10526 0.259464 11.9158C-0.751062 17.4105 1.26999 22.4632 4.93315 25.7263C5.83841 26.5263 6.32262 27.6421 6.32262 28.8211V33.6842C6.32262 36 8.21736 37.8947 10.5331 37.8947H11.1226C11.8595 39.1579 13.1858 40 14.7437 40C16.3016 40 17.6489 39.1579 18.3647 37.8947H18.9542C21.27 37.8947 23.1647 36 23.1647 33.6842V28.8211C23.1647 27.6632 23.6279 26.5263 24.5121 25.7474C27.5647 23.0526 29.4805 19.1158 29.4805 14.7368C29.4805 6.58947 22.891 0 14.7437 0ZM15.7963 23.1579H13.691V17.7053L9.83841 13.8737L11.3331 12.3789L14.7437 15.7895L18.1542 12.3789L19.6489 13.8737L15.7963 17.7263V23.1579ZM17.9016 33.6842C17.8805 33.6842 17.8595 33.6632 17.8384 33.6632V33.6842H11.6489V33.6632C11.6279 33.6632 11.6068 33.6842 11.5858 33.6842C10.9963 33.6842 10.5331 33.2211 10.5331 32.6316C10.5331 32.0421 10.9963 31.5789 11.5858 31.5789C11.6068 31.5789 11.6279 31.6 11.6489 31.6V31.5789H17.8384V31.6C17.8595 31.6 17.8805 31.5789 17.9016 31.5789C18.491 31.5789 18.9542 32.0421 18.9542 32.6316C18.9542 33.2211 18.491 33.6842 17.9016 33.6842ZM17.9016 29.4737H11.5858C10.9963 29.4737 10.5331 29.0105 10.5331 28.4211C10.5331 27.8316 10.9963 27.3684 11.5858 27.3684H17.9016C18.491 27.3684 18.9542 27.8316 18.9542 28.4211C18.9542 29.0105 18.491 29.4737 17.9016 29.4737Z" fill="url(#paint0_linear_1_4254)"/>
<defs>
<linearGradient id="paint0_linear_1_4254" x1="-1.92554e-07" y1="20" x2="29.4805" y2="20" gradientUnits="userSpaceOnUse">
<stop stop-color="#9F39FF"/>
<stop offset="1" stop-color="#9F95FF" stop-opacity="0.988235"/>
</linearGradient>
</defs>
</svg>
