<svg width="50" height="40" viewBox="0 0 50 40" fill="none" xmlns="http://www.w3.org/2000/svg">
<path d="M44.9753 0H4.97462C2.22506 0 0 2.25002 0 5.00003V35C0 37.75 2.24983 40 4.99926 40H44.9998C47.7495 40 49.9992 37.75 49.9992 35V5.00003C49.9992 2.25002 47.7495 0 44.9998 0H44.9753ZM43.9746 10.625L26.2997 21.675C25.4965 22.1748 24.4497 22.1748 23.6504 21.675L5.97544 10.625C5.35173 10.2253 4.97462 9.55 4.97462 8.825C4.97462 7.14999 6.80038 6.15002 8.22523 7.02497L24.975 17.5L41.7249 7.02497C43.1497 6.15002 44.9753 7.14965 44.9753 8.825C44.9753 9.54973 44.5973 10.225 43.9746 10.625Z" fill="url(#paint0_linear_1_4266)"/>
<defs>
<linearGradient id="paint0_linear_1_4266" x1="0.000125556" y1="20" x2="49.9995" y2="20" gradientUnits="userSpaceOnUse">
<stop stop-color="#FF5E52"/>
<stop offset="1" stop-color="#FFC552"/>
</linearGradient>
</defs>
</svg>
