[debug] [2019-12-20T22:31:31.683Z] ----------------------------------------------------------------------
[debug] [2019-12-20T22:31:31.685Z] Command:       /usr/local/bin/node /usr/local/bin/firebase serve
[debug] [2019-12-20T22:31:31.685Z] CLI Version:   7.11.0
[debug] [2019-12-20T22:31:31.685Z] Platform:      linux
[debug] [2019-12-20T22:31:31.685Z] Node Version:  v13.1.0
[debug] [2019-12-20T22:31:31.685Z] Time:          Fri Dec 20 2019 17:31:31 GMT-0500 (hora estándar oriental)
[debug] [2019-12-20T22:31:31.685Z] ----------------------------------------------------------------------
[debug] [2019-12-20T22:31:31.685Z] 
[debug] [2019-12-20T22:31:31.690Z] > command requires scopes: ["email","openid","https://www.googleapis.com/auth/cloudplatformprojects.readonly","https://www.googleapis.com/auth/firebase","https://www.googleapis.com/auth/cloud-platform"]
[debug] [2019-12-20T22:31:31.690Z] > authorizing via signed-in user
[debug] [2019-12-20T22:31:31.690Z] [iam] checking project final-76033 for permissions ["firebase.projects.get"]
[debug] [2019-12-20T22:31:31.692Z] >>> HTTP REQUEST POST https://cloudresourcemanager.googleapis.com/v1/projects/final-76033:testIamPermissions  

[debug] [2019-12-20T22:31:32.295Z] <<< HTTP RESPONSE 200
[debug] [2019-12-20T22:31:32.298Z] >>> HTTP REQUEST GET https://firebase.googleapis.com/v1beta1/projects/final-76033  
 
[debug] [2019-12-20T22:31:32.696Z] <<< HTTP RESPONSE 200
[info] 
[info] === Serving from '/home/eyvar/Escritorio/Final/FINAL'...
[info] 
[debug] [2019-12-20T22:31:32.702Z] >>> HTTP REQUEST GET https://firebase.googleapis.com/v1beta1/projects/final-76033/webApps/-/config  
 
[debug] [2019-12-20T22:31:33.310Z] <<< HTTP RESPONSE 200
[info] i  hosting: Serving hosting files from: public
[info] ✔  hosting: Local server: http://localhost:5000
