{
  "strict": {
    "text-font-family": "Roboto-Regular",

    "text-heading-1-font-size": 36,
    "text-heading-1-font-weight": "800",
    "text-heading-1-font-family": "$text-font-family",

    "text-heading-2-font-size": 32,
    "text-heading-2-font-weight": "800",
    "text-heading-2-font-family": "$text-font-family",

    "text-heading-3-font-size": 30,
    "text-heading-3-font-weight": "800",
    "text-heading-3-font-family": "$text-font-family",

    "text-heading-4-font-size": 26,
    "text-heading-4-font-weight": "800",
    "text-heading-4-font-family": "$text-font-family",

    "text-heading-5-font-size": 22,
    "text-heading-5-font-weight": "800",
    "text-heading-5-font-family": "$text-font-family",

    "text-heading-6-font-size": 18,
    "text-heading-6-font-weight": "800",
    "text-heading-6-font-family": "$text-font-family",

    "text-subtitle-1-font-size": 15,
    "text-subtitle-1-font-weight": "600",
    "text-subtitle-1-font-family": "$text-font-family",

    "text-subtitle-2-font-size": 13,
    "text-subtitle-2-font-weight": "600",
    "text-subtitle-2-font-family": "$text-font-family",

    "text-paragraph-1-font-size": 15,
    "text-paragraph-1-font-weight": "400",
    "text-paragraph-1-font-family": "$text-font-family",

    "text-paragraph-2-font-size": 13,
    "text-paragraph-2-font-weight": "400",
    "text-paragraph-2-font-family": "$text-font-family",

    "text-caption-1-font-size": 12,
    "text-caption-1-font-weight": "400",
    "text-caption-1-font-family": "$text-font-family",

    "text-caption-2-font-size": 12,
    "text-caption-2-font-weight": "600",
    "text-caption-2-font-family": "$text-font-family",

    "text-label-font-size": 12,
    "text-label-font-weight": "800",
    "text-label-font-family": "$text-font-family",

    "size-tiny": 24,
    "size-small": 32,
    "size-medium": 40,
    "size-large": 48,
    "size-giant": 56,

    "border-radius": 4,
    "border-width": 1
  }
}