<?xml version="1.0" encoding="utf-8"?>
<!-- Generator: Adobe Illustrator 19.2.1, SVG Export Plug-In . SVG Version: 6.00 Build 0)  -->
<svg version="1.1" id="Layer_1" xmlns="http://www.w3.org/2000/svg" xmlns:xlink="http://www.w3.org/1999/xlink" x="0px" y="0px"
	 viewBox="0 0 48 48" style="enable-background:new 0 0 48 48;" xml:space="preserve">
<style type="text/css">
	.st0{fill:none;stroke:#231F20;}
	.st1{fill:#231F20;}
</style>
<title>AA_Assets-Icon</title>
<line class="st0" x1="38.6" y1="9.2" x2="27.1" y2="18.4"/>
<line class="st0" x1="25.2" y1="27.8" x2="37.3" y2="38.3"/>
<line class="st0" x1="16" y1="26.8" x2="8.4" y2="33.2"/>
<line class="st0" x1="6.5" y1="7.4" x2="16.5" y2="17.6"/>
<circle class="st0" cx="21.1" cy="22.5" r="7"/>
<path class="st1" d="M42.5,1C45,1,47,3,47,5.5S45,10,42.5,10S38,8,38,5.5C38,3,40,1,42.5,1 M42.5,0c-3,0-5.5,2.5-5.5,5.5
	s2.5,5.5,5.5,5.5S48,8.5,48,5.5S45.5,0,42.5,0L42.5,0z"/>
<path class="st1" d="M42,37c2.8,0,5,2.2,5,5s-2.2,5-5,5s-5-2.2-5-5S39.2,37,42,37 M42,36c-3.3,0-6,2.7-6,6s2.7,6,6,6s6-2.7,6-6
	S45.3,36,42,36L42,36z"/>
<path class="st1" d="M6.3,33.2c1.4,0,2.5,1.1,2.5,2.5s-1.1,2.5-2.5,2.5s-2.5-1.1-2.5-2.5S4.9,33.2,6.3,33.2 M6.3,32.2
	c-1.9,0-3.5,1.6-3.5,3.5s1.6,3.5,3.5,3.5s3.5-1.6,3.5-3.5S8.3,32.2,6.3,32.2L6.3,32.2z"/>
<path class="st1" d="M4.5,1C6.4,1,8,2.6,8,4.5S6.4,8,4.5,8S1,6.4,1,4.5S2.6,1,4.5,1 M4.5,0C2,0,0,2,0,4.5S2,9,4.5,9S9,7,9,4.5
	S7,0,4.5,0L4.5,0z"/>
</svg>
