{
  "summary": "This release fixes a problem that caused the \"Block element\" button to disappear from the icon popup ([ui#1303]). It also fixes a problem in 3.15.1 that prevented us from publishing it to the Firefox Add-ons store ([ui#1306])."
}
