{
  "summary": "This release includes further under-the-hood changes to make Adblock Plus compatible with Manifest v3, as well as some bug fixes.",
  "changes": [
    {
      "title": "User interface changes",
      "items": [
        "Made user interface compatible with Manifest v3 ([ui#1069], [ui#1190], [ui#1249], [ui#1276], [ui#1277]).",
        "Temporarily removed link behind the Premium label in the icon popup in order to reduce confusion ([ui#1293]).",
        "Fixed: Developer tools panel only showed one element hiding filter hit ([ui#1309])."
      ]
    },
    {
      "title": "Filter changes",
      "subtitle": "Upgraded EWE to 0.7.2 (release notes: [0.7.0][ewe-0.7.0], [0.7.1][ewe-0.7.1], [0.7.2][ewe-0.7.2]) ([ui#1183]), which includes the following changes:",
      "items": [
        "Made functionality compatible with Manifest v3 ([ewe#316], [ewe#319], [ewe#323], [ewe#380]).",
        "Implemented migration of user data from Manifest v2 to v3 ([ewe#344], [ewe#345], [ewe#378]).",
        "Upgraded adblockpluscore to 0.10.1 (release notes: [0.10.0][core-0.10.0], [0.10.1][core-0.10.1]) ([ewe#377], [ewe#394])."
      ]
    },
    {
      "title": "Firefox-specific changes",
      "items": [
        "Fixed: Unable to report issues using the issue reporter ([ui#1173])."
      ]
    }
  ],
  "links": {
    "core-0.10.0": "https://gitlab.com/eyeo/adblockplus/abc/adblockpluscore/-/releases/0.10.0",
    "core-0.10.1": "https://gitlab.com/eyeo/adblockplus/abc/adblockpluscore/-/releases/0.10.1",
    "ewe-0.7.0": "https://gitlab.com/eyeo/adblockplus/abc/webext-sdk/-/releases/0.7.0",
    "ewe-0.7.1": "https://gitlab.com/eyeo/adblockplus/abc/webext-sdk/-/releases/0.7.1",
    "ewe-0.7.2": "https://gitlab.com/eyeo/adblockplus/abc/webext-sdk/-/releases/0.7.2"
  }
}
