{
  "summary": "This release introduces support for showing premium features in the pop-up menu. [MR][MR]",
  "links": {
    "MR": "https://gitlab.com/adblockinc/ext/adblockplus/adblockplus/-/merge_requests/1062"
  }
}
