{
  "summary": null,
  "changes": [
    {
      "title": "Changes",
      "items": [
        "Added `freeze-element` snippet ([core#200]).",
        "Updated `hide-if-matches-xpath` snippet to be able to hide more elements ([core#240]).",
        "Fixed: Error message shown in browser's developer tools when using Block element feature ([webext#230])."
      ]
    },
    {
      "title": "Firefox-specific changes",
      "items": [
        "Fixed: Link-based popup blocking stopped working in Firefox 79 ([webext#237])."
      ]
    }
  ],
  "links": {}
}
