<svg version="1.1" xmlns="http://www.w3.org/2000/svg" xmlns:xlink="http://www.w3.org/1999/xlink" width="960" height="960" viewBox="0,0,960,960">
  <path d="M 400,850 A 370,370 0 0 1 400,110" stroke="black" stroke-width="20" fill="none" />
  <line x1="400" y1="110" x2="520" y2="110" stroke="black" stroke-width="20"/>
  <line x1="400" y1="850" x2="520" y2="850" stroke="black" stroke-width="20"/>
  <circle cx="520" cy="480" r="360" stroke="black" stroke-width="40" fill="none" />
</svg>
