{
  "images": {
    "small": "{{driverAssetsPath}}/images/small.png",
    "large": "{{driverAssetsPath}}/images/large.png",
    "xlarge": "{{driverAssetsPath}}/images/xlarge.png"
  },
  "platforms": ["local"],
  "connectivity": ["lan"],
  "pair": [
    {
      "id": "api_key",
      "$template": "api_key",
      "navigation": { "next": "discover_hub" }
    },
    {
      "id": "discover_hub",
      "$template": "discover_hub",
      "navigation": { 
        "next": "list_devices",
        "prev": "api_key" 
      }
    },
    {
      "id": "no_hubs_found",
      "$template": "no_hubs_found",
      "navigation": { 
        "prev": "api_key" 
      }
    },
    {
      "id": "invalid_apikey",
      "$template": "invalid_apikey",
      "navigation": { 
        "prev": "api_key" 
      }
    },
    {
      "id": "invalid_permissions",
      "$template": "invalid_permissions",
      "navigation": { 
        "prev": "api_key" 
      }
    },
    {
      "id": "list_devices",
      "template": "list_devices",
      "navigation": { 
        "next": "add_devices",
        "prev": "discover_hub" 
      }
    },
    {
      "id": "add_devices",
      "template": "add_devices",
      "navigation": { 
        "prev": "list_devices" 
      }
    }
  ]
}
